{"text_format":"1","workbook":"xlsx","n_sheets":5,"sheets":["Biztosítási termékismertető","Ajánlat1","Ajánlat2","Tarifa","Tevékenységi lista"],"not_rendered":{"charts":1,"images":17,"macros":1,"external_links":0,"defined_names":56,"comments":0,"pivot_tables":0},"unopened":[],"bounds":{"document_bytes":16777216,"sheet_cells":100000,"rows_first":2000,"rows_last":500,"rows_between":2000,"halvings":0,"cell_chars":16384,"cell_head_chars":4096},"cells_cut":0,"cells_raw":0,"read":"whole","date_system":"1900"}

{"sheet":"Biztosítási termékismertető","index":0,"n_rows":0,"n_cols":0,"rows_kept":0,"cut":false,"hidden":false,"merged":[]}

{"sheet":"Ajánlat1","index":1,"n_rows":180,"n_cols":51,"rows_kept":180,"cut":false,"hidden":false,"merged":[[29,28,29,44],[19,41,19,44],[22,41,22,44],[27,41,27,44],[43,10,43,30],[45,18,45,22],[63,28,63,32],[45,27,45,32],[45,10,45,14],[61,28,61,32],[56,3,56,27],[56,28,56,32],[57,28,57,32],[58,28,58,32],[59,28,59,32],[60,28,60,32],[62,28,62,32],[119,36,119,48],[6,1,6,7],[14,11,14,49],[16,6,16,18],[39,23,39,27],[9,16,9,29],[10,16,10,21],[22,23,22,37],[22,2,22,5],[22,8,22,19],[9,5,9,9],[9,36,9,49],[10,6,10,8],[16,22,16,32],[16,36,16,49],[85,31,85,35],[143,11,143,13],[148,6,148,8],[66,28,66,32],[160,2,160,4],[139,25,139,27],[143,25,143,27],[150,6,150,8],[160,22,160,24],[133,16,134,19],[83,31,83,35],[135,16,135,19],[143,29,143,32],[133,14,134,15],[118,12,118,15],[119,19,119,31],[139,15,139,17],[87,31,87,35],[118,4,118,10],[139,29,139,32],[89,31,89,35],[135,14,135,15],[139,11,139,13],[170,3,170,7],[170,8,170,10],[170,11,170,13],[147,6,147,8],[135,2,135,13],[151,6,151,8],[152,6,152,8],[158,6,158,8],[155,6,155,8],[156,6,156,8],[143,2,143,4],[153,6,153,8],[157,7,157,8],[149,6,149,8],[139,7,139,8],[139,2,139,6],[10,40,10,49],[11,6,11,15],[11,41,11,49],[27,2,27,5],[27,8,27,19],[27,23,27,37],[19,2,19,5],[19,8,19,19],[19,23,19,37]]}
[]
[]
[]
[]
[null,null,"Kötvényszám:"]
[null,null,null,null,null,null,null,null,null,null,null,null,null,null,null,null,null,null,null,null,null,null,null,null,null,null,null,null,null,null,null,null,null,null,null,null,null,null,null,null,null,null,null,null,null,null,null,null,null,null,"UNION-Rendezvényszervezői felelősségbiztosítás"]
[null,"as",null,null,null,null,null,null,null,null,null,null,null,null,null,null,null,null,null,null,null,null,null,null,null,null,null,null,null,null,null,null,null,null,null,null,null,null,null,null,null,null,null,null,null,null,null,null,null,null,"Biztosítási Ajánlat"]
[]
[]
[null,null,"Módozat",null,null,7810,null,null,null,null,null,"Üzletkötő neve:",null,null,null,null,null,null,null,null,null,null,null,null,null,null,null,null,null,null,null,"Üzletkötő kódja:"]
[null,null,"Átdolgozás:",null,null,null,"nem",null,null,null,null,null,null,null,null,"Előzmény kötv.száma:",null,null,null,null,null,null,null,"Adóigazgatási szám: 1049 1984-2-44",null,null,null,null,null,null,null,null,null,null,null,null,null,null,null,"Ajánlat azonosító:"]
[null,null,"Készítette:",null,null,null,null,null,null,null,null,null,null,null,null,null,null,{"$f":"CONCATENATE(\"    Tel: \",IFERROR(VLOOKUP(G12,D174:K187,7,FALSE),\"\"),\"     E-mail: \",IFERROR(VLOOKUP(G12,D174:K187,4,FALSE),\"\"))","v":"    Tel:      E-mail: "},null,null,null,null,null,null,null,null,null,null,null,null,null,null,null,null,null,null,null,null,"Hiv.szám:"]
[]
[]
[null,null,"Szerződő / Biztosított neve:"]
[]
[null,null,"Adószáma:",null,null,null,null,null,null,null,null,null,null,null,null,null,null,null,null,null,null,"Tel:",null,null,null,null,null,null,null,null,null,null,null,null,null,"E-mail:"]
[]
[null,null,"Székhelye:"]
[null,null,null,null,null,null,"ir.sz.",null,null,null,null,null,null,null,null,null,null,null,null,null,"helység",null,null,null,null,null,null,null,null,null,null,null,null,null,null,null,null,null,"közterület",null,null,null,null,null,null,"hsz.em.ajtó"]
[]
[null,null,"Levelezési Címe:"]
[null,null,null,null,null,null,"ir.sz.",null,null,null,null,null,null,null,null,null,null,null,null,null,"helység",null,null,null,null,null,null,null,null,null,null,null,null,null,null,null,null,null,"közterület",null,null,null,null,null,null,"hsz.em.ajtó"]
[]
[null,null,"Biztosított tevékenység:",null,null,null,null,null,null,null,"Rendezvényszervezés"]
[]
[null,null,"Kockázatviselés helye (rendezvény helyszíne):"]
[null,null,null,null,null,null,"ir.sz.",null,null,null,null,null,null,null,null,null,null,null,null,null,"helység",null,null,null,null,null,null,null,null,null,null,null,null,null,null,null,null,null,"közterület",null,null,null,null,null,null,"hsz.em.ajtó"]
[]
[null,null,"Rendezvény lebonyolítására szolgáló létesítmény megnevezése (ha értelmezhető):"]
[]
[null,null,"Területi hatály:",null,null,null,null,null,null,null,"Magyarország, ezen belül a kockázatviselés helye"]
[]
[null,null,"Biztosítás tartama:",null,null,null,null,null,null,null,"határozott"]
[]
[null,null,"Díjfizetés gyakorisága:",null,null,null,null,null,null,null,"egyszeri, egyösszegű"]
[]
[null,null,"Díjfizetés módja:",null,null,null,null,null,null,null,"a biztosító által kiállított számviteli bizonylat alapján, átutalással"]
[]
[null,null,"Dolgozói létszám:"]
[]
[null,null,"Biztosított rendezvény típusa:",null,null,null,null,null,null,null,null,null,""]
[]
[null,null,"Biztosított rendezvény:",null,null,null,null,null,null,null,null,null,null,null,null,null,null,null,null,null,null,null,null,null,null,null,null,null,null,null,null,null,"(rendezvény megnevezése)"]
[]
[null,null,"Kockázatviselés kezdete:",null,null,null,null,null,null,null,null,null,null,null,null,null,"Vége:",null,null,null,null,null,null,null,null,null,null,"Rendezvény tartama:",null,null,null,null,null,{"$f":"IF(OR(K46=\"\",S46=\"\"),0,S46-K46+1)","v":0},"nap"]
[]
[null,null,"Várható látogatói létszám (max. fő /nap):"]
[]
[]
[null,null,"Limit:"]
[]
[null,null,"Önrész:"]
[]
[null,null,"Rendezvényszervezői felelősségbiztosítás"]
[null,null,"kiegészítő fedezetek:"]
[null,null,null,"Általános felelősségbiztosítás"]
[null,null,null,"Bérelt ingatlan (felszerelési tárgyak) fedezete"]
[null,null,null,"Ruhatári szolgáltatás"]
[null,null,null,"Hangtechnika, világítástechnika szerelés"]
[null,null,null,"Ideiglenes felépítmények felállítása, üzemeltetése, bontása (pl. sátor, színpad)"]
[null,null,null,"Vendéglátás, catering tevékenység"]
[null,null,null,"Környezetszennyezési fedezet"]
[null,null,null,"Alvállalkozók fedezete"]
[]
[null,null,"Biztosított termékek:"]
[null,null,null,"A biztosított által \"catering\" tevékenysége körében kínált élelmiszerek és italáruk",null,null,null,null,null,null,null,null,null,null,null,null,null,null,null,null,null,null,null,null,null,null,null,null,"kérem"]
[]
[]
[]
[]
[]
[]
[]
[]
[]
[]
[]
[]
[]
[]
[null,null,null,null,null,null,null,null,null,null,null,null,null,null,"Biztosítási díjösszesítő "]
[]
[null,null,null,null,null,null,null,null,null,null,null,null,null,null,null,null,"Kis- és középvállalkozások felelősségbiztosítása",null,null,null,null,null,null,null,null,null,null,null,null,null,null,{"$f":"IFERROR(C161,0)","v":0}]
[]
[null,null,null,null,null,null,null,null,null,null,null,null,null,null,null,null,"Biztosítási díj:",null,null,null,null,null,null,null,null,null,null,null,null,null,null,{"$f":"IFERROR(W161,0)","v":0}]
[]
[null,null,null,null,null,null,null,null,null,null,null,null,null,null,null,null,"Díjfizetési gyakoriság miatti engedmény:",null,null,null,null,null,null,null,null,null,null,null,null,null,null,{"$f":"IF(F126=\"éves\",0.05,IF(F126=\"féléves\",0.025,0))","v":0}]
[]
[null,null,null,null,null,null,null,null,null,null,null,null,null,null,null,null,"Engedménnyel csökkentett éves díj:",null,null,null,null,null,null,null,null,null,null,null,null,null,null,{"$f":"(AF86*(1-(AF88)))","v":0}]
[]
[]
[]
[]
[null,null,null,null,null,null,null,null,null,null,null,null,null,"A biztosított három alábbi mutatója közül legalább kettő meghaladja-e a következő értékeket:"]
[null,null,null,null,null,null,null,null,null,null,null,null,null,"               Mérleg főösszege az 1,5 mrd. Ft-ot"]
[null,null,null,null,null,null,null,null,null,null,null,null,null,"               Nettó üzleti forgalma a 3 mrd. Ft-ot"]
[null,null,null,null,null,null,null,null,null,null,null,null,null,"               Átlagos alkalmazotti létszám az 1.000 főt"]
[]
[null,null,null,null,null,null,null,null,null,null,null,null,null,"Ezúton nyilatkozom, hogy Társaságunk :"]
[]
[]
[]
[]
[null,null,null,null,null,null,null,null,null,null,null,null,null,"minősül."]
[]
[]
[]
[]
[]
[]
[]
[]
[]
[]
[]
[]
[]
[null,null,"Kelt:",null,{"$f":"szerz.lakcimhelyseg","v":0},null,null,null,null,null,null,",",{"$f":"TODAY()","v":"2021-07-01"}]
[null,null,null,null,null,null,null,null,null,null,null,null,null,null,null,null,null,null,null,"Biztosításközvetítő aláírása",null,null,null,null,null,null,null,null,null,null,null,null,null,null,null,null,"Szerződő cégszerű aláírása"]
[]
[]
[null,null,"igen"]
[null,null,"nem"]
[]
[null,null,"éves",null,null,"egyszeri, egyösszegű",null,null,null,null,"",null,null,null,null,null,{"$f":"VLOOKUP(K126,Tarifa!B31:D40,3,FALSE)","v":{"$error":"#N/A"}},null,null,""]
[null,null,"féléves"]
[null,null,"negyedéves"]
[]
[null,null,"kérem",null,null,null,null,null,null,null,"",null,null,null,"",null,null,null,null,null,null,null,"szolg.fel + alv.fel"]
[null,null,"nem kérem",null,null,null,null,null,null,null,null,null,null,null,null,null,null,null,null,null,null,null,0,0]
[]
[]
[null,null,null,null,null,null,null,null,null,null,null,null,null,null,"kockázati osztály",null,"alapdíj /fő"]
[null,null,"Tevékenységi lista"]
[null,null,{"$f":"tev.lista","v":""},null,null,null,null,null,null,null,null,null,null,null,{"$f":"IFERROR(VLOOKUP(Ajánlat1!C136,'Tevékenységi lista'!A2:C298,2,FALSE),0)","v":0},null,{"$f":"VLOOKUP(Ajánlat1!K130,Tarifa!E12:F17,2,FALSE)","v":{"$error":"#N/A"}}]
[]
[null,null,null,null,null,null,null,null,null,null,null,null,null,null,null,null,null,null,null,null,null,null,null,null,null,null,null,null,null,null,null,null,null,null,null,null,null,null,null,null,"Kötvény?"]
[null,null,"Általános felelősség biztosítás",null,null,null,null,null,null,null,null,"kock. ezrelék",null,null,null,"Forg. Korr",null,null,null,"Limitkorr",null,null,"Önrész",null,null,"Min. Díj",null,null,null,"Díj",null,null,null,null,null,null,null,null,null,null,false]
[null,null,{"$f":"Q136","v":{"$error":"#N/A"}},null,null,null,null,"mioFt",null,null,null,{"$f":"VLOOKUP(Ajánlat1!O136,Tarifa!B4:C8,2,FALSE)","v":{"$error":"#N/A"}},null,null,null,{"$f":"IF(tartam=1,1,IF(tartam=2,1.23,1.46*LN(tartam)))","v":{"$error":"#NUM!"}},null,null,null,{"$f":"VLOOKUP(K126,Tarifa!B30:C40,2,FALSE)","v":{"$error":"#N/A"}},null,null,{"$f":"VLOOKUP(T126,Tarifa!B45:C48,2,FALSE)","v":{"$error":"#N/A"}},null,null,40000,null,null,null,{"$f":"IFERROR(C140*L140*P140*T140*W140,\"\")","v":""}]
[]
[]
[null,null,"Munkáltatói felelősségbiztosítás",null,null,null,null,null,null,null,null,"kock. Alapdíj",null,null,null,"Létszám korr",null,null,null,"Limitkorr",null,null,"Önrész",null,null,"Min. Díj",null,null,null,"Díj"]
[null,null,{"$f":"Z65","v":0},null,null,"fő",null,null,null,null,null,{"$f":"Ajánlat1!Q136","v":{"$error":"#N/A"}},null,null,null,{"$f":"VLOOKUP(Ajánlat1!C144,Tarifa!E12:F20,2)","v":{"$error":"#N/A"}},null,null,null,{"$f":"T140","v":{"$error":"#N/A"}},null,null,{"$f":"W140","v":{"$error":"#N/A"}},null,null,{"$f":"VLOOKUP(Ajánlat1!O136,Tarifa!$B$54:$C$58,2,FALSE)","v":{"$error":"#N/A"}},null,null,null,{"$f":"IF(C140>0,IF(C144=0,\"\",IF(P144=0,0,IF(C144*L144*P144*T144*W144>Z144,C144*L144*P144*T144*W144,Z144))),\"\")","v":{"$error":"#N/A"}}]
[]
[]
[null,null,null,null,null,"Kiegészítők"]
[null,null,null,null,null,{"$f":"IF(Ajánlat1!AC58=$C$130,Tarifa!C74,0)","v":0},{"$f":"IFERROR(Ajánlat1!$AD$140*Ajánlat1!F148,\"\")","v":""}]
[null,null,null,null,null,{"$f":"IF(Ajánlat1!AC59=$C$130,Tarifa!C79,0)","v":0},{"$f":"IFERROR(Ajánlat1!$AD$140*Ajánlat1!F149,\"\")","v":""}]
[null,null,null,null,null,{"$f":"IF(Ajánlat1!AC60=$C$130,Tarifa!C76,0)","v":0},{"$f":"IFERROR(IF(egypluszketto,0,Ajánlat1!$AD$140*Ajánlat1!F150),\"\")","v":""}]
[null,null,null,null,null,{"$f":"IF(Ajánlat1!AC61=$C$130,Tarifa!C77,0)","v":0},{"$f":"IFERROR(IF(G150>0,0,Ajánlat1!$AD$140*Ajánlat1!F151),\"\")","v":0}]
[null,null,null,null,null,{"$f":"IF(Ajánlat1!AC62=$C$130,Tarifa!C78,0)","v":0},{"$f":"IFERROR(Ajánlat1!$AD$140*Ajánlat1!F152,\"\")","v":""}]
[null,null,null,null,null,{"$f":"IF(Ajánlat1!AC63=$C$130,Tarifa!C75,0)","v":0},{"$f":"IFERROR(Ajánlat1!$AD$140*Ajánlat1!F153,\"\")","v":""}]
[null,null,null,null,null,{"$f":"IF(Ajánlat1!AC64=$C$130,Tarifa!C80,0)","v":0},{"$f":"IFERROR(Ajánlat1!$AD$140*Ajánlat1!F154,\"\")","v":""}]
[null,null,null,null,null,{"$f":"IF(Ajánlat1!AC65=$C$130,Tarifa!C81,0)","v":0}]
[null,null,null,null,null,{"$f":"IF(Ajánlat1!AC66=$C$130,Tarifa!C82,0)","v":0},{"$f":"IFERROR(Ajánlat1!$AD$140*Ajánlat1!F156,\"\")","v":""}]
[null,null,null,null,null,{"$f":"IF(Ajánlat1!AC67=$C$130,Tarifa!C83,0)","v":0},{"$f":"IFERROR(($AD$140+G148+G149+G150)*F157,\"\")","v":""}]
[null,null,null,null,null,{"$f":"IF(Ajánlat1!AC68=$C$130,Tarifa!C84,0)","v":0}]
[null,null,null,null,null,{"$f":"IF(orszag=\"Európa\",Tarifa!C85,0)","v":0},{"$f":"IFERROR(Ajánlat1!$AD$140*Ajánlat1!F159,\"\")","v":""}]
[null,null,"Kieg Díj",null,null,null,null,null,null,null,null,null,null,null,null,null,null,null,null,null,null,null,"Éves Díj"]
[null,null,{"$f":"AD140+G148+G149+G150+G151+G152+G153+G154+G156+G157+G159+IF(F155=1,AD144,0)","v":{"$error":"#VALUE!"}},null,null,null,null,null,null,null,null,null,null,null,null,null,null,null,null,null,null,null,{"$f":"IF(C161<Z140,Z140,Ajánlat1!C161)","v":{"$error":"#VALUE!"}}]
[]
[]
[]
[]
[]
[]
[]
[]
[null,null,null,"Lejárati Dátum",null,null,null,null,"Verzió",null,null,"lejárati jelszó"]
[null,null,null,"2021-12-31",null,null,null,null,"v1.96",null,null,"felelosseg"]
[]
[]
[null,null,null,"Ambrus Péter",null,null,"ambrus.peter@unionbiztosito.hu",null,null,"666-7656"]
[null,null,null,"Árokszállási Zoltán",null,null,"ajanlatkeres@unionbiztosito.hu",null,null,"486-4366"]
[null,null,null,"Csanádi Zoltán",null,null,"csanadi.zoltan@unionbiztosito.hu",null,null,"486-4235"]
[null,null,null,"Dobi László",null,null,"dobi.laszlogabor@unionbiztosito.hu",null,null,"486-4346"]
[null,null,null,"Hajdók Viktória",null,null,"hajdok.viktoria@unionbiztosito.hu",null,null,"486-4213"]
[null,null,null,"Klinger József",null,null,"klinger.jozsef@unionbiztosito.hu",null,null,"486-4232"]
[null,null,null,"Utry Oszkár",null,null,"ajanlatkeres@unionbiztosito.hu",null,null,"666-7652"]

{"sheet":"Ajánlat2","index":2,"n_rows":81,"n_cols":12,"rows_kept":81,"cut":false,"hidden":false,"merged":[[80,3,80,8],[79,3,79,8],[20,3,20,5],[23,3,23,5],[25,3,25,5],[62,1,62,9],[59,1,59,9],[33,1,33,9],[39,1,39,9],[35,1,35,9],[55,1,55,9],[41,1,41,9],[46,1,46,9],[36,1,36,9],[78,1,78,2],[34,1,34,9],[37,11,37,17],[57,1,57,9],[70,2,70,9],[71,2,71,9],[66,1,66,9],[68,2,68,9],[69,2,69,9],[49,1,49,9],[50,1,52,9],[43,1,43,9],[74,2,74,9],[47,1,47,9],[37,1,37,9],[76,2,76,9],[44,1,44,9]]}
[null,"Kis és középvállallatok felelősségbiztosítása",null,null,null,null,null,null,null,null,null,"SZÍNKÓDOK, MAGYARÁZATOK"]
[null,"Biztosított kockázatok:","Általános felelősségbiztosítás"]
[null,null,"valamint:"]
[null,"Szolgáltatói felelősségbiztosítás",null,null,null,null,null,null,null,null,null,"innentől választható / legördülő menü"]
[null,"Szolgáltatói felelősség kiterjesztve a szolgáltatás tárgyára (egyedi záradék szerint)",null,null,null,null,null,null,null,null,null,"csak akkor választható, ha a szolg fel korábban kiválasztásra került"]
[null,"Szolgáltatói felelősség kiterjesztve rakodási tevékenységre (egyedi záradék szerint)",null,null,null,null,null,null,null,null,null,"csak akkor választható, ha a szolg fel korábban kiválasztásra került"]
[null,"Termékfelelősség-biztosítás"]
[null,"Kiterjesztett termékfelelősség-biztosítás",null,null,null,null,null,null,null,null,null,"csak akkor választható, ha a term fel korábban kiválasztásra került"]
[null,"Bérlői felelősségbiztosítás"]
[null,"Bérbeadói felelősségbiztosítás"]
[null,"Munkáltatói felelősségbiztosítás"]
[null,"Környezetszennyezési felelősségbiztosítás"]
[null,"Alvállalkozói fedezet (egyedi záradék szerint)"]
[null,"Építőipari tevékenység fedezete (egyedi záradék szerint)",null,null,null,null,null,null,null,null,null,"ha 5-ös kock. osztály, ez feljön, ÉS az önrész kötelezően min. 10%, de min 100 000 Ft/kár"]
[null,"Területi hatály kiterjesztése Európa (egyedi záradék szerint)",null,null,null,null,null,null,null,null,null,"ha Európa"]
[]
[null,"Dolgozói létszám:",null,14,"fő",null,null,null,null,null,null,"opcionálisan (munk fel esetén) kitöltendő mező"]
[]
[null,"Díjszámítási alap (éves bruttó forgalom):",null,2465,"MFt",null,null,null,null,null,null,"kötelezően kitöltendő mező"]
[]
[null,"Kombinált limit:",null,"5 MFt/kár, 10 MFt/év",null,null,null,null,null,null,null,"választható limitek legördülő menüben"]
[]
[]
[null,"Önrész:",null,"10 %, de min. 25 000 Ft",null,null,null,null,null,null,null,"választható önrészek legördülő menüben"]
[]
[null,"Díjtétel:",null,{"$f":"D28/(D19*1000000)*100","v":{"$error":"#VALUE!"}},null,null,null,null,null,null,null,"háttértábla (tarifáló) alapján"]
[]
[null,"Éves díj:",null,{"$f":"Ajánlat1!C161","v":{"$error":"#VALUE!"}},null,null,null,null,null,null,null,"háttértábla (tariáfló) alapján"]
[]
[null,"Biztosítási feltételek"]
[]
[null,"Felelősségbiztosítások Szerződési Feltételei (U70060)"]
[null,"Rendezvényszervezői Felelősségbiztosítás Különös Biztosítási Feltételek (U70066) "]
[null,null,null,null,null,null,null,null,null,null,null,"ha építőipari tevékenység fedezetét választja, akkor ez jön föl az A38 helyett"]
[null,"azzal, hogy a feltételek 2.1.a) pontjában írt kizáró rendelkezés e körben történő részleges feloldása és a feltételek egyéb rendelkezéseinek változatlan alkalmazása mellett kiterjed a rendezvény során igénybe vett (bérelt) idegen tulajdonú ingatlanokban, valamint berendezési és felszerelési tárgyakban bekövetkezett károkra is.   \n",null,null,null,null,null,null,null,null,null,"innentől akkor jönnek föl, ha fent kiválasztásra kerültek"]
[null,null,null,null,null,null,null,null,null,null,null,"ha építőipari tevékenység fedezetét választja, akkor ez jön föl az A41 helyett"]
[null,"azzal, hogy a feltételek 2.1.o.) pontjában írt kizáró rendelkezés feloldása mellett a fedezet kiterjed a bérlői felelősség körébe tartozó károkra a \" Bérlői felelősségbiztosítás Különös Biztosítási Feltételek (U71034)\" rendelkezései szerint."]
[null,"Bérlői felelősségbiztosítás Különös Biztosítási Feltételek (U71034)",null,null,null,null,null,null,null,null,null,"a fedezet választása esetén \"feljön\""]
[]
[null,"azzal, hogy a feltételek 2.1.i.) pontjában írt kizáró rendelkezés feloldása mellett a fedezet kiterjed a letéti felelősség körében okozott károkra a \"Ruhatárban elhelyezett tárgyakban bekövetkezett károk (letéti felelősség) egyedi záradéka\" rendelkezései szerint.                                                                                                                \nRuhatárban elhelyezett tárgyakban bekövetkezett károk (letéti felelősség) egyedi záradéka: A jelen egyedi záradék alkalmazásában biztosítási esemény az a dologi kár, amely a rendezvény látogatója a biztosított által üzemeltetett, erre kijelölt és lezárt, vagy egyéb módon őrzött helyen elhelyezett, vagy az átvételére általa jogosultnak tarthatott személy részére átadott vagyontárgyában következett be és amelyért a szerződésben megnevezett kockázatviselési helyen ruhatári szolgáltatást nyújtó biztosított a Ptk. 467.§-a alapján kártérítési kötelezettséggel tartozik. A ruhatárban elhelyezett tárgyakban bekövetkezett károk fedezete nem terjed ki az értéktárgyakra (ékszer, nemesfém, drágakő, gyűjtemény stb.), okiratokra, értékpapírokra, készpénzre.",null,null,null,null,null,null,null,null,null,"a fedezet választása esetén \"feljön\""]
[]
[null,"azzal, hogy a feltételek 2.1.k.) pontjában írt kizáró rendelkezés feloldása mellett a fedezet kiterjed az építés-szerelési tevékenységgel okozott károkra az \"Építés-szerelési tevékenység záradéka\" rendelkezései szerint.                                                                                                                 \nÉpítési-szerelési tevékenység záradéka: A biztosítási fedezet kiterjed az építési-szerelési tevékenységgel összefüggésben bekövetkezett dologi károkra, ide nem értve az épületek, építmények repedéseivel összefüggésben bekövetkezett károkat, valamint az épületben, építményben vibráció, vagy – a föld, illetve egyéb támaszt is ideértve – teherhordó elem eltávolítása, meggyengítése, vagy megépítésének elmaradása miatt bekövetkezett károkat, amennyiben az építési-szerelési tevékenységre a rendezvény helyszínén, a rendezvény lebonyolítására szolgáló épületek, építmények, díszletek, színpadok, sátrak, stb. létesítésével összefüggésben került sor.",null,null,null,null,null,null,null,null,null,"alvállalkozói fedezet esetén \"feljön\""]
[]
[null,"azzal, hogy a feltételek 2.1.m.) pontjában írt kizáró rendelkezés feloldása mellett a fedezet kiterjed az ételmérgezéssel okozott károkra a „Termékfelelősség-biztosítás Különös Biztosítási Feltételek (U70061)” rendelkezései szerint,",null,null,null,null,null,null,null,null,null,"csak akkor jön fel, ha a szolg fel és az alvállalkozói fedezet korábban kiválasztásra került"]
[null,"Termékfelelősség-biztosítás Különös Biztosítási Feltételek (U70061)"]
[]
[null,"azzal, hogy a feltételek 2.1.n.) pontjában írt kizáró rendelkezés feloldása mellett a fedezet kiterjed a környezetszennyezéssel okozott károkra a \" Környezetszennyezési Felelősségbiztosítás Különös Biztosítási Feltételek (U71032)\" rendelkezései szerint,"]
[null,"Környezetszennyezési Felelősségbiztosítás Különös Biztosítási Feltételek (U71032)"]
[]
[null,"azzal, hogy a feltételek 2.1.r.) pontjában írt kizáró rendelkezés feloldása mellett a fedezet kiterjed az alvállalkozók által okozott károkra az \"Alvállalkozói fedezet záradéka\" rendelkezései szerint."]
[null,"Alvállalkozói fedezet egyedi záradéka (2016): A rendezvényszervezői felelősségbiztosítási fedezet a szerződésben írt limit erejéig, a vonatkozó feltételek változatlan alkalmazása mellett kiterjed a biztosított alvállalkozóira is, amennyiben a kárt a biztosított alvállalkozójaként eljárva, ebbéli minőségükben okozták. A jelen felelősségbiztosítási fedezet annyiban áll fönn, amennyiben a kár más biztosítási fedezet (elsődleges fedezet) alapján nem térül meg. A jelen felelősségbiztosítás elsődleges fedezet fennállta esetén a kárra csak annyiban nyújt fedezetet, amennyiben az elsődleges fedezet a biztosítási esemény bekövetkezte előtt bármely okból megszűnt, vagy a biztosítási feltételek eltérő rendelkezése miatt az elsődleges fedezet alapján szolgáltatás nyújtására nem kerül sor, vagy a limit alacsonyabb volta miatt az elsődleges fedezet alapján nyújtott szolgáltatás részleges. A biztosító által nyújtott alvállalkozói fedezet nem szélesebb, mint a vonatkozó feltételek alapján a biztosított számára nyújtott fedezet. Nem terjed ki a fedezet ezen alvállalkozók további alvállalkozóira, valamint a biztosítottak egymásnak okozott káraira."]
[]
[null,null,null,null,null,null,null,null,null,null,null,"5-ös kockázati osztály esetén kötelező (feljön)"]
[]
[null,null,null,null,null,null,null,null,null,null,null,"Ha Európa"]
[]
[]
[null,"EGYÉB"]
[]
[null,"A biztosítási szerződésre a fentiekben hivatkozott biztosítási feltételek és az ajánlatban foglalt egyedi záradékok együttesen vonatkoznak.\nA Biztosító nem nyújt fedezetet, nem teljesít kárkifizetést, valamint nem nyújt szolgáltatást, amennyiben ezen fedezet nyújtásával, illetve kár kifizetésével a Biztosító sértené  az Egyesült Nemzetek Szervezetének határozata szerinti bármely szankcióit, rendelkezéseit, vagy rendeleteit,  valamint Magyarország, az Európai Unió, illetve az Egyesült Államok kereskedelmi, pénzügyi embargóit vagy gazdasági szankcióit, törvényeit vagy rendeleteit, (feltéve, hogy ezek nem sértik az biztosítóra alkalmazandó szabályozásokat vagy nemzeti jogszabályokat).\n\nNem terjed ki a biztosítás azokra a károkra, amelyek bármilyen (bakteriális, vírusos, stb.) kórokozói eredetű járványos megbetegedéssel, betegséggel, vagy fertőzéssel összefüggésben következnek be, és amelyek a kórokozó bármely fajtájától, mutációjától, illetve variánsától származnak."]
[]
[null,"Díjfizetési engedmény:"]
[null,"Amennyiben a szerződő/biztosított a biztosítási díjat az alábbi díjfizetési gyakorisággal egyenlíti ki, akkor a biztosító a számára a fentiekben megállapított biztosítási díjakból az alábbi díjfizetési engedményeket nyújtja:"]
[null," - éves díjfizetés esetén: 5,0%"]
[null," - féléves díjfizetés esetén: 2,5%."]
[]
[null,"Ajánlatot teszek a túloldalon részletezett biztosításra, amelynek alapján az Union Vienna Insurance Group Biztosító Zrt. azt a kötelezettséget vállalja, hogy díjfizetés ellenében készpénzben megtéríti a különös feltételekben felsorolt biztosítási események során bekövetkező azon károkat, amelyekre a biztosítási szerződés kiterjed. Kijelentem, hogy az ajánlattétel előtt biztosítási igényem felmérése nyomán a vonatkozó termékismertetőket átvettem, áttanulmányoztam és megértettem, a jogszabályban előírt tájékoztatást megkaptam, a biztosítási feltételeket átvettem, áttanulmányoztam és megértettem.\nKijelentem, hogy az Adatkezelési tájékoztató a biztosítási ajánlat aláírását megelőzően részemre átadásra került, és tudomással bírok arról, hogy ezen dokumentum a biztosító honlapján (www.union.hu) bármikor megtekinthető."]
[]
[null,"Tudomásul veszem, hogy:","- jelen ajánlat a biztosító kockázatelbírálásának alapja, továbbá, hogy a biztosítónak az ajánlat beérkezésétől számított 15 nap áll rendelkezésére a kockázat elbírálására,"]
[null,null,"- a biztosító a kockázatelbírálás eredményeként az ajánlatot jogosult elutasítani, az elutasítást nem köteles megindokolni."]
[null,null,"- a biztosító kártérítése - betöréses lopás esetén - a kár időpontjában fennálló vagyonvédelmi színvonal függvényében történik"]
[null,null,"- a biztosító a tényleges adatoktól való eltérés esetén az alul- és túlbiztosítottságot vizsgálja"]
[]
[]
[null,"Kijelentem, hogy:","- a Felelősségbiztosítások Szerződési Feltételeiben, az Általános Felelősségi Feltételekben és a Különös Felelősségbiztosítási Feltételekben foglaltakat az ajánlat aláírása előtt megismertem,"]
[null,null,"- a közölt adatok a valóságnak megfelelnek,"]
[null,null,"- jelen ajánlatomban minden biztosítási szándékommal kapcsolatos igényemet rögzítettek, más szóbeli megállapodás nem történt."]
[]
[null,{"$f":"\"Kelt: \" & keltez & \", \" & TEXT(keltdat, \"ÉÉÉÉ.hh.nn\")","v":"Kelt: 0, 2021.07.01"}]
[null,null,null,"Szerződő cégszerű aláírása"]
[null,null,null,"UNION Vienna Insurance Group Biztosító Zrt."]

{"sheet":"Tarifa","index":3,"n_rows":2090,"n_cols":11,"rows_kept":2090,"cut":false,"hidden":true,"merged":[[51,2,51,3]]}
[null,null,null,null,null,null,null,null,"Összeadás","4/a + 6 + 4/b"]
["1/a","Általános felelősségbiztosítás díjtételek (ezrelék):",null,"1/b","rendezvény tartama (nap):"]
[null,"kockázati osztály","ezrelék",null,null,null,null,null,null,"Díjfizetési gyakoriság kedvezménye:"]
[null,1,1.24,null,1,4,null,null,null,"féléves","2,5%"]
[null,2,1.3,null,6,3,null,null,null,"éves","5%"]
[null,3,1.33,null,11,2]
[null,4,1.45,null,21,1]
[]
[]
[]
["2/a","Forgalom megadása / forgalomkorrekció (függvény)",null,"2/b","Létszámkorrekció (fő):"]
[null,"=-0,262*LN(x)+2,2125",null,null,"100-ig",12000]
[null,null,null,null,"101-300",16800]
[null,null,null,null,"301-500",20160]
[null,null,null,null,"501-1000",23940]
[null,null,null,null,"1001-1500",27770]
[null,null,null,null,"1501-2500",32215]
[]
[]
[]
[]
[]
[]
[]
[]
[]
[]
["3/a és 3/b","Limit kiválasztása / limitkorrekció:"]
[null,"mioFt/kár/év","Limitkorrekció:"]
[null,"5 MFt/kár, 5 MFt/tartam",1]
[null,"5 MFt/kár, 10 MFt/tartam",1.07,1]
[null,"5 MFt/kár, 15 MFt/tartam",1.1240000000000001]
[null,"5 MFt/kár, 20 MFt/tartam",1.18]
[null,"5 MFt/kár, 25 MFt/tartam",1.2150000000000001]
[null,"5 MFt/kár, 30 MFt/tartam",1.2390000000000001]
[null,"10 MFt/kár, 10 MFt/tartam",1.3380000000000001,1.25]
[null,"10 MFt/kár, 20 MFt/tartam",1.4470000000000001,1.75]
[null,"10 MFt/kár, 30 MFt/tartam",1.577,1.94]
[null,"20 MFt/kár, 20 MFt/tartam",1.62,2.13]
[null,"30 MFt/kár, 30 MFt/tartam",2.0499999999999998,2.56]
[]
[]
["4/a és 4/b","Önrész kiválasztása / önrészkorrekció:"]
[null,null,"Önrészkorrekció:"]
[null,"10 %, de min. 50 000 Ft/kár",1]
[null,"10 %, de min. 100 000 Ft/kár",0.9]
[null,"10 %, de min. 250 000 Ft/kár",0.7]
[null,"10 %, de min. 500 000 Ft/kár",0.5]
[]
[]
[]
[5,"Minimáldíj figyelembe vétele (általános és munkáltatói felelősségbiztosítás):","4/a és 4/b összevetése a minimáldíjjal"]
[null,"kockázati osztály"]
[null,1,12000]
[null,2,16000.000000000002]
[null,3,17500.000000000004]
[null,4,24000.000000000004]
[null,5,67500.000000000015]
[]
[]
[]
[6,"Fedezeti \"szorzók\" (pl.: 0,5 szorzó = +50% díj)","alap a 2/a \"szám\" vagy a 3 (ált. fel. min. díj)"]
[null,"bérelt ingatlan/berendezés fedezete",0.4]
[null,"építés/szerelés/bontás",0.5]
[null,"alvállalkozók",0.2]
[null,"termék",0.4]
[null,"letét (ruhatár)",0.2]
[null,"körny.szenny.",0.2]
[]
[]
[]
[]
[]
[null,"Bérelt ingatlan (felszerelési tárgyak) fedezete",0.4]
[null,"Ruhatári szolgáltatás",0.2]
[null,"Hangtechnika, világítástechnika szerelés",0.5]
[null,"Ideiglenes felépímények felállítása, üzemeltetése, bontása (pl. sátor, színpad)",0.5]
[null,"Vendéglátás, catering tevékenység",0.4]
[null,"Környezetszennyezési fedezet",0.2]
[null,"Alvállakozók fedezete",0.2]
[]
[]
[]
[]
[]
[]
[null,null,null,null,null,null,null,"dt.","Min.díj"]
[null,null,null,null,null,"Kock. Oszt.",2,{"$f":"VLOOKUP(G88,B4:C8,2,FALSE)","v":1.3},{"$f":"VLOOKUP(G88,B54:C58,2,FALSE)","v":16000.000000000002}]
[]
[]
[null,null,null,null,null,{"$f":"-0.262*LN(G91)+2.2125","v":2.2124999999999999},{"$f":"+G92-1","v":1},2,{"$f":"$H$88*F91*1000*G91","v":2876.25}]
[null,null,null,null,null,2.0308954386932943,2,2,5280.3281406025653]
[null,null,null,null,null,1.9246635803689551,3,2,7506.1879634389243]
[null,null,null,null,null,1.8492908773865886,4,2,9616.3125624102613]
[null,null,null,null,null,1.7908272669422656,5,2,11640.377235124726]
[null,null,null,null,null,1.7430590190622495,6,2,13595.860348685546]
[null,null,null,null,null,1.7026715409475077,7,2,15494.311022622322]
[null,null,null,null,null,1.6676863160798829,8,2,17343.937687230784]
[null,null,null,null,null,1.6368271607379103,9,2,19150.877780633549]
[null,null,null,null,null,1.6092227056355599,10,2,20919.895173262281]
[null,null,null,null,null,1.5842514385268269,11,1.8,22654.795570933627]
[null,null,null,null,null,1.5614544577555438,12,1.8,24358.689540986488]
[null,null,null,null,null,1.5404832683450773,13,1.8,26034.167235031804]
[null,null,null,null,null,1.5210669796408021,14,1.8,27683.419029462599]
[null,null,null,null,null,1.5029908473112208,15,1.8,29308.321522568804]
[null,null,null,null,null,1.4860817547731773,16,1.8,30910.500499282087]
[null,null,null,null,null,1.4701981038572711,17,1.8,32491.378095245695]
[null,null,null,null,null,1.4552225994312047,18,1.8,34052.208826690192]
[null,null,null,null,null,1.4410569874583925,19,1.8,35594.107590222295]
[null,null,null,null,null,1.4276181443288543,20,1.8,37118.071752550211]
[null,null,null,null,null,1.4148351213164632,21,1.8,38624.998811939447]
[null,null,null,null,null,1.402646877220121,22,1.8,40115.700688495461]
[null,null,null,null,null,1.3910005154265628,23,1.8,41590.915411254224]
[null,null,null,null,null,1.3798498964488379,24,1.8,43051.316769203739]
[null,null,null,null,null,1.3691545338845312,25,1.8,44497.522351247266]
[null,null,null,null,null,1.3588787070383717,26,1.45,45930.100297896963]
[null,null,null,null,null,1.3489907411068658,27,1.45,47349.57501285099]
[null,null,null,null,null,1.3394624183340964,28,1.45,48756.432027361108]
[null,null,null,null,null,1.3302684925435435,29,1.45,50151.122168891583]
[null,null,null,null,null,1.3213862860045151,30,1.45,51534.065154176096]
[null,null,null,null,null,1.3127953524248914,31,1.45,52905.652702723128]
[null,null,null,null,null,1.3044771934664716,32,1.45,54266.251248205219]
[null,null,null,null,null,1.2964150188957819,33,1.45,55616.204310629044]
[null,null,null,null,null,1.2885935425505655,34,1.45,56955.834580734991]
[null,null,null,null,null,1.2809988078897736,35,1.45,58285.445758984693]
[null,null,null,null,null,1.273618038124499,36,1.45,59605.324184226556]
[null,null,null,null,null,1.2664395068872132,37,1.45,60915.740281274957]
[null,null,null,null,null,1.2594524261516868,38,1.45,62216.949851893332]
[null,null,null,null,null,1.2526468487140325,39,1.45,63509.195229801451]
[null,null,null,null,null,1.2460135830221486,40,1.45,64792.706317151737]
[null,null,null,null,null,1.2395441185234712,41,1.45,66067.701517301015]
[null,null,null,null,null,1.2332305600097575,42,1.45,67334.388576532758]
[null,null,null,null,null,1.2270655696882864,43,1.45,68592.965345575212]
[null,null,null,null,null,1.2210423159134156,44,1.45,69843.620470247377]
[null,null,null,null,null,1.2151544276801762,45,1.45,71086.53401929031]
[null,null,null,null,null,1.2093959541198569,46,1.45,72321.878056367437]
[null,null,null,null,null,1.2037613283519646,47,1.45,73549.817162305044]
[null,null,null,null,null,1.1982453351421325,48,1.45,74770.508912869074]
[null,null,null,null,null,1.1928430818950158,49,1.45,75984.104316712503]
[null,null,null,null,null,1.1875499725778256,50,1.45,77190.748217558663]
[null,null,null,null,null,1.1823616842262266,51,1.1000000000000001,78390.579664198827]
[null,null,null,null,null,1.1772741457316658,52,1.1000000000000001,79583.732251460606]
[null,null,null,null,null,1.1722835186493439,53,1.1000000000000001,80770.334434939796]
[null,null,null,null,null,1.1673861798001599,54,1.1000000000000001,81950.509821971224]
[null,null,null,null,null,1.1625787054690924,55,1.1000000000000001,83124.377441040109]
[null,null,null,null,null,1.1578578570273907,56,1.1000000000000001,84292.051991594053]
[null,null,null,null,null,1.1532205678273477,57,1.1000000000000001,85453.644076006472]
[null,null,null,null,null,1.1486639312368381,58,1.1000000000000001,86609.260415257595]
[null,null,null,null,null,1.1441851896967012,59,1.1000000000000001,87759.004049736992]
[null,null,null,null,null,1.1397817246978095,60,1.1000000000000001,88902.974526429141]
[null,null,null,null,null,1.1354510475865922,61,1.1000000000000001,90041.268073616768]
[null,null,null,null,null,1.1311907911181858,62,1.1000000000000001,91173.977764125782]
[null,null,null,null,null,1.1269987016854184,63,1.1000000000000001,92301.193668035776]
[null,null,null,null,null,1.122872632159766,64,1.1000000000000001,93423.002995692528]
[null,null,null,null,null,{"$f":"-0.262*LN(G155)+2.2125","v":1.118810535287343},65,1.1000000000000001,{"$f":"$H$88*F155*1000*G155","v":94539.490231780481}]
[null,null,null,null,null,1.1148104575890765,66,1.1000000000000001,95650.737261142756]
[null,null,null,null,null,1.1108705337195668,67,1.1000000000000001,96756.823486974274]
[null,null,null,null,null,1.1069889812438598,68,1.1000000000000001,97857.825941957213]
[null,null,null,null,null,1.1031640957955178,69,1.1000000000000001,98953.819392857942]
[null,null,null,null,null,1.0993942465830677,70,1.1000000000000001,100044.87643905918]
[null,null,null,null,null,1.0956778722151752,71,1.1000000000000001,101131.06760546069]
[null,null,null,null,null,1.0920134768177934,72,1.1000000000000001,102212.46143014546]
[null,null,null,null,null,1.0883996264191214,73,1.1000000000000001,103289.12454717462]
[null,null,null,null,null,1.0848349455805073,74,1.1000000000000001,104361.12176484482]
[null,null,null,null,null,1.0813181142534867,75,1.1000000000000001,105428.51613971496]
[null,null,null,null,null,1.0778478648449812,76,1.1000000000000001,106491.36904668415]
[null,null,null,null,null,1.0744229794743345,77,1.1000000000000001,107549.7402453809]
[null,null,null,null,null,1.0710422874073269,78,1.1000000000000001,108603.68794310297]
[null,null,null,null,null,1.0677046626536402,79,1.1000000000000001,109653.26885452887]
[null,null,null,null,null,1.0644090217154429,80,1.1000000000000001,110698.53825840606]
[null,null,null,null,null,1.0611543214758208,81,1.1000000000000001,111739.55005140393]
[null,null,null,null,null,1.0579395572167656,82,1.1000000000000001,112776.35679930721]
[null,null,null,null,null,1.0547637607572911,83,1.1000000000000001,113809.00978571171]
[null,null,null,null,null,1.0516259987030518,84,1.1000000000000001,114837.55905837327]
[null,null,null,null,null,1.048525370799537,85,1.1000000000000001,115862.05347334883]
[null,null,null,null,null,1.045461008381581,86,1.1000000000000001,116882.54073706076]
[null,null,null,null,null,1.042432072912499,87,1.1000000000000001,117899.06744640363]
[null,null,null,null,null,1.0394377546067097,88,1.1000000000000001,118911.67912700759]
[null,null,null,null,null,1.0364772711301793,89,1.1000000000000001,119920.42026976173]
[null,null,null,null,null,1.0335498663734703,90,1.1000000000000001,120925.33436569604]
[null,null,null,null,null,1.0306548092925851,91,1.1000000000000001,121926.46393931282]
[null,null,null,null,null,1.0277913928131512,92,1.1000000000000001,122923.8505804529]
[null,null,null,null,null,1.0249589327938466,93,1.1000000000000001,123917.53497477608]
[null,null,null,null,null,1.0221567670452589,94,1.1000000000000001,124907.55693293065]
[null,null,null,null,null,1.0193842544006582,95,1.1000000000000001,125893.9554184813]
[null,null,null,null,null,1.0166407738354268,96,1.1000000000000001,126876.76857466128]
[null,null,null,null,null,1.0139257236321135,97,1.1000000000000001,127856.03375000952]
[null,null,null,null,null,1.0112385205883099,98,1.1000000000000001,128831.78752295069]
[null,null,null,null,null,1.0085785992647374,99,1.1000000000000001,129804.06572537171]
[null,null,null,null,null,1.0059454112711199,100,1.1000000000000001,130772.9034652456]
[null,null,null,null,null,1.0033384245875898,101,0.8,131738.33514835054]
[null,null,null,null,null,1.0007571229195209,102,0.8,132700.39449912845]
[null,null,null,null,null,0.99820100508383525,103,0.8,133659.11458072555]
[null,null,null,null,null,0.99566958442496034,104,0.8,134614.52781425466]
[null,null,null,null,null,0.99316238825872882,105,0.8,135566.66599731648]
[null,null,null,null,null,0.99067895734263822,106,0.8,136515.56032181554]
[null,null,null,null,null,0.98821884537098059,107,0.8,137461.24139110339]
[null,null,null,null,null,0.98578161849345425,108,0.8,138403.73923648099]
[null,null,null,null,null,0.9833668548559642,109,0.8,139343.08333309012]
[null,null,null,null,null,0.98097414416238671,110,0.8,140279.30261522133]
[null,null,null,null,null,0.9786030872561684,111,0.8,141212.42549106511]
[null,null,null,null,null,0.97625329572068509,112,0.8,142142.47985693175]
[null,null,null,null,null,0.97392439149736654,113,0.8,143069.49311096314]
[null,null,null,null,null,0.97161600652064206,114,0.8,143993.49216635918]
[null,null,null,null,null,0.96932778236882822,115,0.8,144914.50346413982]
[null,null,null,null,null,0.96705936993013242,116,0.8,145832.55298546396]
[null,null,null,null,null,0.96481042908298775,117,0.8,146747.66626352243]
[null,null,null,null,null,0.96258062838999559,118,0.8,147659.86839502532]
[null,null,null,null,null,0.96036964480477915,119,0.8,148569.18405129935]
[null,null,null,null,null,0.95817716339110381,120,0.8,149475.63748901221]
[null,null,null,null,null,0.95600287705365372,121,0.8,150379.25256053972]
[null,null,null,null,null,0.95384648627988655,122,0.8,151280.05272399003]
[null,null,null,null,null,0.95170769889242668,123,0.8,152178.06105289905]
[null,null,null,null,null,0.94958622981148011,124,0.8,153073.30024561059]
[null,null,null,null,null,0.94748180082679689,125,0.8,153965.7926343545]
[null,null,null,null,null,0.94539414037871272,126,0.8,154855.56019403314]
[null,null,null,null,null,0.94332298334784892,127,0.8,155742.62455072987]
[null,null,null,null,null,0.9412680708530603,128,0.8,156627.00698994924]
[null,null,null,null,null,{"$f":"-0.262*LN(G219)+2.2125","v":0.93922915005724184},129,0.8,{"$f":"$H$88*F219*1000*G219","v":157508.72846459947}]
[null,null,null,null,null,0.93720597398063732,130,0.8,158387.80960272768]
[null,null,null,null,null,0.93519830132129833,131,0.8,159264.2707150171]
[null,null,null,null,null,0.93320589628237083,132,0.8,160138.13180205482]
[null,null,null,null,null,0.93122852840590031,133,0.8,161009.41256138019]
[null,null,null,null,null,0.92926597241286113,134,0.8,161878.13239432042]
[null,null,null,null,null,0.92731800804913123,135,0.8,162744.31041262255]
[null,null,null,null,null,0.92538441993715415,136,0.8,163607.96544488883]
[null,null,null,null,null,0.92346499743303112,137,0.8,164469.11604282283]
[null,null,null,null,null,0.92155953448881212,138,0.8,165327.78048729291]
[null,null,null,null,null,0.91966782951975867,139,0.8,166183.97679422039]
[null,null,null,null,null,0.91778968527636229,140,0.8,167037.72272029793]
[null,null,null,null,null,0.91592490872091981,141,0.8,167889.03576854459]
[null,null,null,null,null,0.91407331090846955,142,0.8,168737.9331937035]
[null,null,null,null,null,0.91223470687190433,143,0.8,169584.43200748702]
[null,null,null,null,null,0.91040891551108771,144,0.8,170428.54898367563]
[null,null,null,null,null,0.9085957594858094,145,0.8,171270.30066307506]
[null,null,null,null,null,0.9067950651124157,146,0.8,172109.7033583365]
[null,null,null,null,null,0.90500666226397097,147,0.8,172946.77315864485]
[null,null,null,null,null,0.90323038427380187,148,0.8,173781.52593427946]
[null,null,null,null,null,0.90146606784228944,149,0.8,174613.97734105145]
[null,null,null,null,null,0.89971355294678101,150,0.8,175444.14282462231]
[null,null,null,null,null,0.8979726827544896,151,0.8,176272.03762470628]
[null,null,null,null,null,0.89624330353827553,152,0.8,177097.67677916324]
[null,null,null,null,null,0.89452526459518178,153,0.8,177921.07512798169]
[null,null,null,null,null,0.89281841816762886,154,0.8,178742.24731715932]
[null,null,null,null,null,0.89112261936715731,155,0.8,179561.20780248218]
[null,null,null,null,null,0.88943772610062122,156,0.8,180377.97085320597]
[null,null,null,null,null,0.88776359899874313,157,0.8,181192.55055564348]
[null,null,null,null,null,0.88610010134693451,158,0.8,182004.96081666034]
[null,null,null,null,null,0.8844470990182991,159,0.8,182815.21536708245]
[null,null,null,null,null,0.88280446040873728,160,0.8,183623.32776501734]
[null,null,null,null,null,0.88117205637407059,161,0.8,184429.31139909299]
[null,null,null,null,null,0.87954976016911535,162,0.8,185233.17949161568]
[null,null,null,null,null,0.87793744738862811,163,0.8,186034.94510165032]
[null,null,null,null,null,0.8763349959100597,164,0.8,186834.62112802474]
[null,null,null,null,null,0.87474228583804781,165,0.8,187632.22031226128]
[null,null,null,null,null,0.8731591994505854,166,0.8,188427.7552414363]
[null,null,null,null,null,0.87158562114681004,167,0.8,189221.23835097248]
[null,null,null,null,null,0.87002143739634596,168,0.8,190012.68192736193]
[null,null,null,null,null,0.8684665366901545,169,0.8,190802.09811082698]
[null,null,null,null,null,0.86692080949283112,170,0.8,191589.49889791568]
[null,null,null,null,null,0.86538414819630294,171,0.8,192374.89614403812]
[null,null,null,null,null,0.8638564470748753,172,0.8,193158.30156594215]
[null,null,null,null,null,0.86233760224158162,173,0.8,193939.72674413171]
[null,null,null,null,null,0.86082751160579329,174,0.8,194719.18312523045]
[null,null,null,null,null,0.85932607483203904,175,0.8,195496.68202428889]
[null,null,null,null,null,0.85783319330000429,176,0.8,196272.23462704101]
[null,null,null,null,null,0.85634877006565668,177,0.8,197045.85199210761]
[null,null,null,null,null,0.85487270982347363,178,0.8,197817.54505315181]
[null,null,null,null,null,0.85340491886972214,179,0.8,198587.32462098435]
[null,null,null,null,null,0.85194530506676469,180,0.8,199355.20138562296]
[null,null,null,null,null,0.85049377780835345,181,0.8,200121.18591830556]
[null,null,null,null,null,0.84905024798587947,182,0.8,200885.28867345909]
[null,null,null,null,null,0.84761462795554743,183,0.8,201647.51999062474]
[null,null,null,null,null,0.84618683150644558,184,0.8,202407.89009634178]
[null,null,null,null,null,0.84476677382947885,185,0.8,203166.40910598967]
[null,null,null,null,null,0.84335437148714099,186,0.8,203923.08702559068]
[null,null,null,null,null,0.84194954238409814,187,0.8,204677.93375357427]
[null,null,null,null,null,0.84055220573855305,188,0.8,205430.95908250235]
[null,null,null,null,null,0.8391622820543736,189,0.8,206182.17270075963]
[null,null,null,null,null,0.8377796930939525,190,0.8,206931.58419420625]
[null,null,null,null,null,0.83640436185178291,191,0.8,207679.2030477977]
[null,null,null,null,null,0.83503621252872118,192,0.8,208425.03864716884]
[null,null,null,null,null,{"$f":"-0.262*LN(G283)+2.2125","v":0.83367517050691986},193,0.8,{"$f":"$H$88*F283*1000*G283","v":209169.10028018622}]
[null,null,null,null,null,0.83232116232540787,194,0.8,209911.39713846787]
[null,null,null,null,null,0.8309741156562982,195,0.8,210651.93831887163]
[null,null,null,null,null,0.82963395928160444,196,0.8,211390.73282495281]
[null,null,null,null,null,0.82830062307064689,197,0.8,212127.78956839271]
[null,null,null,null,null,0.8269740379580317,198,0.8,212863.11737039738]
[null,null,null,null,null,0.82565413592218295,199,0.8,213596.72496306873]
[null,null,null,null,null,0.82434084996441426,200,0.8,214328.62099074767]
[null,null,null,null,null,0.82303411408852201,201,0.8,215058.81401133077]
[null,null,null,null,null,0.82173386328088416,202,0.8,215787.31249756023]
[null,null,null,null,null,0.82044003349105155,203,0.8,216514.12483828852]
[null,null,null,null,null,0.81915256161281524,204,0.8,217239.25933971864]
[null,null,null,null,null,0.8178713854657369,205,0.8,217962.72422661886]
[null,null,null,null,null,0.81659644377712959,206,0.8,218684.52764351529]
[null,null,null,null,null,0.81532767616447321,207,0.8,219404.67765585973]
[null,null,null,null,null,0.81406502311825446,208,0.8,220123.18225117601]
[null,null,null,null,null,0.8128084259852193,209,0.8,220840.04934018408]
[null,null,null,null,null,0.81155782695202316,210,0.8,221555.28675790233]
[null,null,null,null,null,0.81031316902927042,211,0.8,222268.90226472891]
[null,null,null,null,null,0.80907439603593256,212,0.8,222980.90354750303]
[null,null,null,null,null,0.80784145258413043,213,0.8,223691.29822054572]
[null,null,null,null,null,0.80661428406427493,214,0.8,224400.09382668129]
[null,null,null,null,null,0.80539283663055228,215,0.8,225107.29783823938]
[null,null,null,null,null,0.80417705718674859,216,0.8,225812.91765803902]
[null,null,null,null,null,0.80296689337239946,217,0.8,226516.9606203539]
[null,null,null,null,null,0.80176229354925854,218,0.8,227219.43399185987]
[null,null,null,null,null,0.80056320678807658,219,0.8,227920.34497256539]
[null,null,null,null,null,0.79936958285568105,220,0.8,228619.70069672476]
[null,null,null,null,null,0.79818137220234875,221,0.8,229317.50823373478]
[null,null,null,null,null,0.79699852594946274,222,0.8,230013.774589015]
[null,null,null,null,null,0.7958209958774487,223,0.8,230708.50670487242]
[null,null,null,null,null,0.79464873441397943,224,0.8,231401.71146135082]
[null,null,null,null,null,0.79348169462244167,225,0.8,232093.3956770642]
[null,null,null,null,null,0.79231983019066088,226,0.8,232783.56611001617]
[null,null,null,null,null,0.79116309541987229,227,0.8,233472.22945840433]
[null,null,null,null,null,0.7900114452139364,228,0.8,234159.39236141072]
[null,null,null,null,null,0.78886483506878902,229,0.8,234845.0613999785]
[null,null,null,null,null,0.78772322106212256,230,0.8,235529.24309757465]
[null,null,null,null,null,0.78658655984328996,231,0.8,236211.94392093996]
[null,null,null,null,null,0.78545480862342676,232,0.8,236893.17028082552]
[null,null,null,null,null,0.78432792516578642,233,0.8,237572.9285327167]
[null,null,null,null,null,0.78320586777628209,234,0.8,238251.224977545]
[null,null,null,null,null,0.78208859529423025,235,0.8,238928.06586238736]
[null,null,null,null,null,0.78097606708328993,236,0.8,239603.45738115333]
[null,null,null,null,null,0.77986824302259539,237,0.8,240277.40567526163]
[null,null,null,null,null,0.7787650834980735,238,0.8,240949.91683430393]
[null,null,null,null,null,0.77766654939394386,239,0.8,241620.99689669837]
[null,null,null,null,null,0.77657260208439816,240,0.8,242290.65185033224]
[null,null,null,null,null,0.77548320342544841,241,0.8,242958.88763319302]
[null,null,null,null,null,0.77439831574694784,242,0.8,243625.71013398978]
[null,null,null,null,null,0.77331790184477622,243,0.8,244291.12519276486]
[null,null,null,null,null,0.77224192497318089,244,0.8,244955.138601493]
[null,null,null,null,null,0.77117034883728119,245,0.8,245617.7561046741]
[null,null,null,null,null,0.7701031375857208,246,0.8,246278.98339991353]
[null,null,null,null,null,0.76904025580346969,247,0.8,246938.82613849413]
[null,null,null,null,null,0.76798166850477445,248,0.8,247597.28992593932]
[null,null,null,null,null,0.7669273411262465,249,0.8,248254.38032256599]
[null,null,null,null,null,0.76587723952009146,250,0.8,248910.10284402972]
[null,null,null,null,null,0.76483132994747249,251,0.66,249564.46296186029]
[null,null,null,null,null,0.76378957907200684,252,0.66,250217.46610398943]
[null,null,null,null,null,0.76275195395338957,253,0.66,250869.11765526983]
[null,null,null,null,null,0.76171842204114326,254,0.66,251519.42295798549]
[null,null,null,null,null,0.76068895116849222,255,0.66,252168.38731235516]
[null,null,null,null,null,0.75966350954635464,256,0.66,252816.01597702684]
[null,null,null,null,null,{"$f":"-0.262*LN(G347)+2.2125","v":0.75864206575745219},257,0.66,{"$f":"$H$88*F347*1000*G347","v":253462.31416956478}]
[null,null,null,null,null,0.75762458875053618,258,0.66,254107.28706692983]
[null,null,null,null,null,0.756611047834721,259,0.66,254750.93980595053]
[null,null,null,null,null,0.75560141267393166,260,0.66,255393.27748378893]
[null,null,null,null,null,0.75459565328145417,261,0.66,256034.30515839739]
[null,null,null,null,null,0.75359374001459245,262,0.66,256674.0278489702]
[null,null,null,null,null,0.75259564356942543,263,0.66,257312.45053638658]
[null,null,null,null,null,0.75160133497566517,264,0.66,257949.57816364829]
[null,null,null,null,null,0.75061078559160976,265,0.66,258585.4156363096]
[null,null,null,null,null,0.74962396709919465,266,0.66,259219.96782290153]
[null,null,null,null,null,0.74864085149913451,267,0.66,259853.2395553496]
[null,null,null,null,null,0.74766141110615547,268,0.66,260485.23562938458]
[null,null,null,null,null,0.74668561854431803,269,0.66,261115.96080494803]
[null,null,null,null,null,0.74571344674242557,270,0.66,261745.41980659138]
[null,null,null,null,null,0.74474486892951819,271,0.66,262373.61732386926]
[null,null,null,null,null,0.74377985863044849,272,0.66,263000.55801172659]
[null,null,null,null,null,0.74281838966154035,273,0.66,263626.24649088067]
[null,null,null,null,null,0.74186043612632546,274,0.66,264250.68734819716]
[null,null,null,null,null,0.74090597241135803,275,0.66,264873.88513706048]
[null,null,null,null,null,0.73995497318210668,276,0.66,265495.84437773988]
[null,null,null,null,null,0.73900741337891707,277,0.66,266116.56955774804]
[null,null,null,null,null,0.73806326821305301,278,0.66,266736.0651321974]
[null,null,null,null,null,0.73712251316280208,279,0.66,267354.33552414831]
[null,null,null,null,null,0.73618512396965663,280,0.66,267971.38512495504]
[null,null,null,null,null,0.73525107663455858,281,0.66,268587.21829460427]
[null,null,null,null,null,0.73432034741421393,282,0.66,269201.83936205081]
[null,null,null,null,null,0.73339291281747165,283,0.66,269815.25262554782]
[null,null,null,null,null,0.73246874960176389,284,0.66,270427.4623529712]
[null,null,null,null,null,0.73154783476961338,285,0.66,271038.47278214176]
[null,null,null,null,null,0.73063014556519845,286,0.66,271648.28812114079]
[null,null,null,null,null,0.72971565947097905,287,0.66,272256.91254862229]
[null,null,null,null,null,0.72880435420438205,288,0.66,272864.35021412064]
[null,null,null,null,null,0.72789620771454255,289,0.66,273470.60523835366]
[null,null,null,null,null,0.72699119817910374,290,0.66,274075.68171352212]
[null,null,null,null,null,0.72608930400106875,291,0.66,274679.58370360435]
[null,null,null,null,null,0.72519050380571004,292,0.66,275282.3152446475]
[null,null,null,null,null,0.72429477643752804,293,0.66,275883.88034505444]
[null,null,null,null,null,0.72340210095726531,294,0.66,276484.28298586683]
[null,null,null,null,null,0.7225124566389669,295,0.66,277083.52712104382]
[null,null,null,null,null,0.72162582296709621,296,0.66,277681.61667773861]
[null,null,null,null,null,0.72074217963369258,297,0.66,278278.55555656867]
[null,null,null,null,null,0.71986150653558378,298,0.66,278874.3476318852]
[null,null,null,null,null,0.71898378377163996,299,0.66,279468.99675203644]
[null,null,null,null,null,0.71810899164007513,300,0.66,280062.50673962932]
[null,null,null,null,null,0.71723711063579443,301,0.66,280654.88139178633]
[null,null,null,null,null,0.71636812144778395,302,0.66,281246.1244804]
[null,null,null,null,null,0.71550200495654526,303,0.66,281836.2397523832]
[null,null,null,null,null,0.71463874223156965,304,0.66,282425.23092991632]
[null,null,null,null,null,0.71377831452885787,305,0.66,283013.10171069216]
[null,null,null,null,null,0.71292070328847612,306,0.66,283599.85576815577]
[null,null,null,null,null,0.71206589013215438,307,0.66,284185.49675174279]
[null,null,null,null,null,0.71121385686092342,308,0.66,284770.02828711376]
[null,null,null,null,null,0.71036458545279046,309,0.66,285353.45397638594]
[null,null,null,null,null,0.70951805806045143,310,0.66,285935.77739836188]
[null,null,null,null,null,0.70867425700904052,311,0.66,286517.00210875506]
[null,null,null,null,null,0.70783316479391534,312,0.66,287097.13164041209]
[null,null,null,null,null,0.70699476407847972,313,0.66,287676.1695035334]
[null,null,null,null,null,0.70615903769203747,314,0.66,288254.11918588972]
[null,null,null,null,null,0.70532596862768404,315,0.66,288830.98415303661]
[null,null,null,null,null,0.70449554004022885,316,0.66,289406.76784852601]
[null,null,null,null,null,0.70366773524415249,317,0.66,289981.47369411524]
[null,null,null,null,null,0.70284253771159344,318,0.66,290555.10508997279]
[null,null,null,null,null,0.70201993107037053,319,0.66,291127.66541488265]
[null,null,null,null,null,0.70119989910203162,320,0.66,291699.15802644519]
[null,null,null,null,null,{"$f":"-0.262*LN(G411)+2.2125","v":0.70038242573993581},321,0.66,{"$f":"$H$88*F411*1000*G411","v":292269.58626127522}]
[null,null,null,null,null,0.69956749506736471,322,0.66,292838.95343519887]
[null,null,null,null,null,0.69875509131566393,323,0.66,293407.26284344727]
[null,null,null,null,null,0.69794519886240969,324,0.66,293974.51776084694]
[null,null,null,null,null,0.69713780222960864,325,0.66,294540.72144200961]
[null,null,null,null,null,0.69633288608192245,326,0.66,295105.87712151872]
[null,null,null,null,null,0.69553043522491942,327,0.66,295669.98801411327]
[null,null,null,null,null,0.69473043460335404,328,0.66,296233.05731487018]
[null,null,null,null,null,0.6939328692994724,329,0.66,296795.08819938434]
[null,null,null,null,null,0.69313772453134215,330,0.66,297356.08382394578]
[null,null,null,null,null,0.69234498565120939,331,0.66,297916.04732571542]
[null,null,null,null,null,0.69155463814387996,332,0.66,298474.98182289861]
[null,null,null,null,null,0.69076666762512362,333,0.66,299032.89041491604]
[null,null,null,null,null,0.68998105984010416,334,0.66,299589.77618257323]
[null,null,null,null,null,0.68919780066183245,335,0.66,300145.64218822803]
[null,null,null,null,null,0.68841687608964031,336,0.66,300700.49147595488]
[null,null,null,null,null,0.68763827224768104,337,0.66,301254.32707170909]
[null,null,null,null,null,0.68686197538344884,338,0.66,301807.15198348742]
[null,null,null,null,null,0.68608797186632198,339,0.66,302358.96920148807]
[null,null,null,null,null,0.68531624818612547,340,0.66,302909.7816982675]
[null,null,null,null,null,0.68454679095171844,341,0.66,303459.59242889681]
[null,null,null,null,null,0.6837795868895975,342,0.66,304008.40433111507]
[null,null,null,null,null,0.68301462284252379,343,0.66,304556.22032548138]
[null,null,null,null,null,0.68225188576816964,344,0.66,305103.04331552546]
[null,null,null,null,null,0.68149136273778343,345,0.66,305648.87618789583]
[null,null,null,null,null,0.68073304093487597,346,0.66,306193.7218125072]
[null,null,null,null,null,0.67997690765392282,347,0.66,306737.58304268459]
[null,null,null,null,null,0.67922295029908764,348,0.66,307280.46271530725]
[null,null,null,null,null,0.67847115638296396,349,0.66,307822.36365095078]
[null,null,null,null,null,0.67772151352533361,350,0.66,308363.28865402681]
[null,null,null,null,null,0.67697400945194319,351,0.66,308903.24051292165]
[null,null,null,null,null,0.67622863199329841,352,0.66,309442.22200013336]
[null,null,null,null,null,0.67548536908347612,353,0.66,309980.23587240721]
[null,null,null,null,null,0.67474420875895103,354,0.66,310517.28487086925]
[null,null,null,null,null,0.67400513915744087,355,0.66,311053.37172115897]
[null,null,null,null,null,0.67326814851676797,356,0.66,311588.49913356022]
[null,null,null,null,null,0.67253322517373459,357,0.66,312122.66980313027]
[null,null,null,null,null,0.67180035756301626,358,0.66,312655.8864098278]
[null,null,null,null,null,0.67106953421607085,359,0.66,313188.15161864029]
[null,null,null,null,null,0.67034074376005903,360,0.66,313719.46807970764]
[null,null,null,null,null,0.66961397491678509,361,0.66,314249.83842844726]
[null,null,null,null,null,0.66888921650164779,362,0.66,314779.26528567547]
[null,null,null,null,null,0.66816645742260894,363,0.66,315307.75125772913]
[null,null,null,null,null,0.66744568667917381,364,0.66,315835.29893658502]
[null,null,null,null,null,0.66672689336138702,365,0.66,316361.91089997813]
[null,null,null,null,null,0.66601006664884199,366,0.66,316887.58971151907]
[null,null,null,null,null,0.66529519580970242,367,0.66,317412.33792080905]
[null,null,null,null,null,0.66458227019973992,368,0.66,317936.15806355554]
[null,null,null,null,null,0.66387127926138167,369,0.66,318459.05266168481]
[null,null,null,null,null,0.66316221252277319,370,0.66,318981.02422345389]
[null,null,null,null,null,0.66245505959685191,371,0.66,319502.0752435617]
[null,null,null,null,null,0.66174981018043555,372,0.66,320022.20820325863]
[null,null,null,null,null,0.66104645405332008,373,0.66,320541.42557045491]
[null,null,null,null,null,0.66034498107739248,374,0.66,321059.7297998282]
[null,null,null,null,null,0.65964538119575233,375,0.66,321577.12333292927]
[null,null,null,null,null,0.65894764443184739,376,0.66,322093.60859828704]
[null,null,null,null,null,0.65825176088862092,377,0.66,322609.18801151315]
[null,null,null,null,null,0.65755772074766772,378,0.66,323123.86397540395]
[null,null,null,null,null,0.65686551426840412,379,0.66,323637.63888004271]
[null,null,null,null,null,0.65617513178724685,380,0.66,324150.51510289992]
[null,null,null,null,null,0.65548656371680414,381,0.66,324662.49500893313]
[null,null,null,null,null,0.65479980054507703,382,0.66,325173.58095068525]
[null,null,null,null,null,0.65411483283467065,383,0.66,325683.77526838251]
[null,null,null,null,null,0.6534316512220153,384,0.66,326193.08029003005]
[null,null,null,null,null,{"$f":"-0.262*LN(G475)+2.2125","v":0.65275024641660018},385,0.66,{"$f":"$H$88*F475*1000*G475","v":326701.49833150837}]
[null,null,null,null,null,0.6520706092002142,386,0.66,327209.03169666749]
[null,null,null,null,null,0.65139273042619705,387,0.66,327715.6826774198]
[null,null,null,null,null,0.65071660101870221,388,0.66,328221.45355383342]
[null,null,null,null,null,0.6500422119719671,389,0.66,328726.34659422381]
[null,null,null,null,null,0.64936955434959254,390,0.66,329230.36405524338]
[null,null,null,null,null,0.64869861928383399,391,0.66,329733.50818197284]
[null,null,null,null,null,0.64802939797489878,392,0.66,330235.78120800841]
[null,null,null,null,null,0.64736188169025333,393,0.66,330737.18535555043]
[null,null,null,null,null,0.64669606176394123,394,0.66,331237.72283549071]
[null,null,null,null,null,0.64603192959590583,395,0.66,331737.39584749768]
[null,null,null,null,null,0.64536947665132582,396,0.66,332236.20658010256]
[null,null,null,null,null,0.64470869445995582,397,0.66,332734.15721078322]
[null,null,null,null,null,0.64404957461547707,398,0.66,333231.24990604789]
[null,null,null,null,null,0.64339210877485553,399,0.66,333727.48682151752]
[null,null,null,null,null,0.6427362886577086,400,0.66,334222.87010200846]
[null,null,null,null,null,0.64208210604567872,401,0.66,334717.40188161231]
[null,null,null,null,null,0.64142955278181635,402,0.66,335211.08428377722]
[null,null,null,null,null,0.64077862076996905,403,0.66,335703.91942138685]
[null,null,null,null,null,0.6401293019741785,404,0.66,336195.90939683857]
[null,null,null,null,null,0.63948158841808667,405,0.66,336687.05630212266]
[null,null,null,null,null,0.63883547218434589,406,0.66,337177.36221889773]
[null,null,null,null,null,0.63819094541403998,407,0.66,337666.82921856857]
[null,null,null,null,null,0.63754800030610959,408,0.66,338155.45936236053]
[null,null,null,null,null,0.63690662911678575,409,0.66,338643.254701395]
[null,null,null,null,null,0.63626682415903124,410,0.66,339130.21727676364]
[null,null,null,null,null,0.63562857780198656,411,0.66,339616.34911960142]
[null,null,null,null,null,0.63499188247042393,412,0.66,340101.65225115907]
[null,null,null,null,null,0.63435673064420905,413,0.66,340586.12868287589]
[null,null,null,null,null,0.63372311485776756,414,0.66,341069.78041645046]
[null,null,null,null,null,0.63309102769955694,415,0.66,341552.609443911]
[null,null,null,null,null,0.6324604618115488,416,0.66,342034.61774768558]
[null,null,null,null,null,0.63183140988871389,417,0.66,342515.80730067176]
[null,null,null,null,null,0.63120386467851364,418,0.66,342996.18006630434]
[null,null,null,null,null,0.63057781898039988,419,0.66,343475.73799862387]
[null,null,null,null,null,0.62995326564531751,420,0.66,343954.48304234335]
[null,null,null,null,null,0.62933019757521591,421,0.66,344432.41713291564]
[null,null,null,null,null,0.62870860772256476,422,0.66,344909.54219659907]
[null,null,null,null,null,0.62808848908987502,423,0.66,345385.86015052226]
[null,null,null,null,null,0.62746983472922691,424,0.66,345861.37290274986]
[null,null,null,null,null,0.62685263774180244,425,0.66,346336.08235234593]
[null,null,null,null,null,0.62623689127742477,426,0.66,346809.99038943782]
[null,null,null,null,null,0.62562258853410024,427,0.66,347283.09889527905]
[null,null,null,null,null,0.62500972275756905,428,0.66,347755.40974231146]
[null,null,null,null,null,0.62439828724085933,429,0.66,348226.92479422723]
[null,null,null,null,null,0.62378827532384662,430,0.66,348697.64590603026]
[null,null,null,null,null,0.62317968039281801,431,0.66,349167.57492409594]
[null,null,null,null,null,0.62257249588004293,432,0.66,349636.71368623211]
[null,null,null,null,null,0.62196671526334746,433,0.66,350105.0640217383]
[null,null,null,null,null,0.6213623320656938,434,0.66,350572.62775146449]
[null,null,null,null,null,0.62075933985476461,435,0.66,351039.4066878694]
[null,null,null,null,null,0.62015773224255288,436,0.66,351505.40263507899]
[null,null,null,null,null,0.61955750288495537,437,0.66,351970.61738894315]
[null,null,null,null,null,0.61895864548137092,438,0.66,352435.0527370926]
[null,null,null,null,null,0.61836115377430501,439,0.66,352898.71045899589]
[null,null,null,null,null,0.61776502154897561,440,0.66,353361.59232601407]
[null,null,null,null,null,0.61717024263292619,441,0.66,353823.7001014566]
[null,null,null,null,null,0.61657681089564309,442,0.66,354285.03554063651]
[null,null,null,null,null,0.6159847202481743,443,0.66,354745.60039092362]
[null,null,null,null,null,0.61539396464275686,444,0.66,355205.39639179927]
[null,null,null,null,null,0.61480453807244495,445,0.66,355664.42527490942]
[null,null,null,null,null,0.61421643457074304,446,0.66,356122.68876411679]
[null,null,null,null,null,0.61362964821124466,447,0.66,356580.18857555429]
[null,null,null,null,null,0.61304417310727377,448,0.66,357036.92641767621]
[null,null,null,null,null,{"$f":"-0.262*LN(G539)+2.2125","v":0.61246000341152906},449,0.66,{"$f":"$H$88*F539*1000*G539","v":357492.90399130952}]
[null,null,null,null,null,0.61187713331573601,450,0.66,357948.12298970559]
[null,null,null,null,null,0.61129555705029803,451,0.66,358402.58509858971]
[null,null,null,null,null,0.61071526888395522,452,0.66,358856.29199621209]
[null,null,null,null,null,0.61013626312344482,453,0.66,359309.24535339669]
[null,null,null,null,null,0.60955853411316663,454,0.66,359761.44683359098]
[null,null,null,null,null,0.60898207623485079,455,0.66,360212.89809291426]
[null,null,null,null,null,0.60840688390723052,456,0.66,360663.60078020627]
[null,null,null,null,null,0.60783295158571815,457,0.66,361113.5565370752]
[null,null,null,null,null,0.60726027376208336,458,0.66,361562.76699794445]
[null,null,null,null,null,0.606688844964137,459,0.66,362011.23379010055]
[null,null,null,null,null,0.6061186597554169,460,0.66,362458.95853373932]
[null,null,null,null,null,0.6055497127348779,461,0.66,362905.94284201233]
[null,null,null,null,null,0.6049819985365843,462,0.66,363352.18832107255]
[null,null,null,null,null,0.60441551182940656,463,0.66,363797.69657011982]
[null,null,null,null,null,0.60385024731672088,464,0.66,364242.46918144607]
[null,null,null,null,null,0.60328619973611253,465,0.66,364686.50774048007]
[null,null,null,null,null,0.60272336385908076,466,0.66,365129.81382583111]
[null,null,null,null,null,0.60216173449074861,467,0.66,365572.38900933345]
[null,null,null,null,null,0.60160130646957621,468,0.66,366014.23485609016]
[null,null,null,null,null,0.6010420746670746,469,0.66,366455.35292451538]
[null,null,null,null,null,0.60048403398752459,470,0.66,366895.74476637755]
[null,null,null,null,null,0.59992717936769835,471,0.66,367335.41192684171]
[null,null,null,null,null,0.59937150577658449,472,0.66,367774.35594451224]
[null,null,null,null,null,0.59881700821511341,473,0.66,368212.57835147326]
[null,null,null,null,null,0.59826368171588973,474,0.66,368650.08067333122]
[null,null,null,null,null,0.59771152134292382,475,0.66,369086.86442925548]
[null,null,null,null,null,0.59716052219136762,476,0.66,369522.93113201833]
[null,null,null,null,null,0.59661067938725432,477,0.66,369958.28228803637]
[null,null,null,null,null,0.5960619880872382,478,0.66,370392.91939740983]
[null,null,null,null,null,0.59551444347834015,479,0.66,370826.84395396244]
[null,null,null,null,null,0.5949680407776925,480,0.66,371260.05744528014]
[null,null,null,null,null,0.59442277523229037,481,0.66,371692.56135275116]
[null,null,null,null,null,0.59387864211874253,482,0.66,372124.35715160408]
[null,null,null,null,null,0.59333563674302581,483,0.66,372555.4463109459]
[null,null,null,null,null,0.59279375444024218,484,0.66,372985.83029380039]
[null,null,null,null,null,0.59225299057437919,485,0.66,373415.5105571461]
[null,null,null,null,null,0.59171334053807056,486,0.66,373844.48855195305]
[null,null,null,null,null,0.59117479975236131,487,0.66,374272.76572321996]
[null,null,null,null,null,0.59063736366647523,488,0.66,374700.34351001185]
[null,null,null,null,null,0.59010102775758333,489,0.66,375127.22334549576]
[null,null,null,null,null,0.58956578753057576,490,0.66,375553.40665697679]
[null,null,null,null,null,0.58903163851783558,491,0.66,375978.89486593445]
[null,null,null,null,null,0.58849857627901514,492,0.66,376403.68938805809]
[null,null,null,null,null,0.58796659640081517,493,0.66,376827.79163328244]
[null,null,null,null,null,0.58743569449676403,494,0.66,377251.20300582185]
[null,null,null,null,null,0.58690586620700302,495,0.66,377673.92490420648]
[null,null,null,null,null,0.58637710719806879,496,0.66,378095.95872131479]
[null,null,null,null,null,0.58584941316268302,497,0.66,378517.30584440951]
[null,null,null,null,null,0.58532277981954084,498,0.66,378937.96765517071]
[null,null,null,null,null,0.58479720291310189,499,0.66,379357.94552972919]
[null,null,null,null,null,0.5842726782133858,500,0.66,379777.24083870079]
[null,null,null,null,null,0.58374920151576526,501,0.49,380195.85494721791]
[null,null,null,null,null,0.58322676864076684,502,0.49,380613.78921496449]
[null,null,null,null,null,0.58270537543386824,503,0.49,381031.04499620647]
[null,null,null,null,null,0.58218501776530118,504,0.49,381447.62363982538]
[null,null,null,null,null,0.58166569152985548,505,0.49,381863.52648935013]
[null,null,null,null,null,0.58114739264668391,506,0.49,382278.75488298869]
[null,null,null,null,null,0.58063011705910972,507,0.49,382693.31015365926]
[null,null,null,null,null,0.5801138607344376,508,0.49,383107.19362902257]
[null,null,null,null,null,0.57959861966376303,509,0.49,383520.40663151199]
[null,null,null,null,null,0.57908438986178656,510,0.49,383932.95047836448]
[null,null,null,null,null,0.57857116736662939,511,0.49,384344.82648165186]
[null,null,null,null,null,0.57805894823964876,512,0.49,384756.03594831022]
[null,null,null,null,null,{"$f":"-0.262*LN(G603)+2.2125","v":0.57754772856525816},513,0.49,{"$f":"$H$88*F603*1000*G603","v":385166.58018017071}]
[null,null,null,null,null,0.57703750445074653,514,0.49,385576.46047398885]
[null,null,null,null,null,0.57652827202610091,515,0.49,385985.67812147457]
[null,null,null,null,null,0.57602002744383052,516,0.49,386394.23440932151]
[null,null,null,null,null,0.57551276687879138,517,0.49,386802.13061923569]
[null,null,null,null,null,0.57500648652801534,518,0.49,387209.36802796554]
[null,null,null,null,null,0.57450118261053706,519,0.49,387615.94790732936]
[null,null,null,null,null,0.573996851367226,520,0.49,388021.87152424478]
[null,null,null,null,null,0.57349348906061781,521,0.49,388427.1401407565]
[null,null,null,null,null,0.57299109197474829,522,0.49,388831.7550140642]
[null,null,null,null,null,0.57248965641498994,523,0.49,389235.71739655168]
[null,null,null,null,null,0.57198917870788679,524,0.49,389639.02853581245]
[null,null,null,null,null,0.57148965520099448,525,0.49,390041.68967467872]
[null,null,null,null,null,0.57099108226271977,526,0.49,390443.70205124782]
[null,null,null,null,null,0.57049345628216286,527,0.49,390845.0668989098]
[null,null,null,null,null,0.56999677366895929,528,0.49,391245.78544637363]
[null,null,null,null,null,0.56950103085312542,529,0.49,391645.85891769442]
[null,null,null,null,null,0.56900622428490388,530,0.49,392045.28853229881]
[null,null,null,null,null,0.5685123504346119,531,0.49,392444.07550501259]
[null,null,null,null,null,0.568019405792489,532,0.49,392842.22104608547]
[null,null,null,null,null,0.56752738686854864,533,0.49,393239.72636121733]
[null,null,null,null,null,0.56703629019242885,534,0.49,393636.59265158419]
[null,null,null,null,null,0.56654611231324625,535,0.49,394032.8211138628]
[null,null,null,null,null,0.56605684979944981,536,0.49,394428.41294025671]
[null,null,null,null,null,0.56556849923867714,537,0.49,394823.36931852048]
[null,null,null,null,null,0.56508105723761237,538,0.49,395217.69143198611]
[null,null,null,null,null,0.56459452042184255,539,0.49,395611.38045958511]
[null,null,null,null,null,0.56410888543571991,540,0.49,396004.43757587543]
[null,null,null,null,null,0.56362414894222179,541,0.49,396396.86395106465]
[null,null,null,null,null,0.56314030762281253,542,0.49,396788.66075103369]
[null,null,null,null,null,0.56265735817730889,543,0.49,397179.82913736237]
[null,null,null,null,null,0.56217529732374305,544,0.49,397570.3702673511]
[null,null,null,null,null,0.56169412179822986,545,0.49,397960.28529404593]
[null,null,null,null,null,0.56121382835483469,546,0.49,398349.57536626171]
[null,null,null,null,null,0.56073441376544086,547,0.49,398738.241628605]
[null,null,null,null,null,0.56025587481961958,548,0.49,399126.285221497]
[null,null,null,null,null,0.55977820832450287,549,0.49,399513.70728119771]
[null,null,null,null,null,0.55930141110465259,550,0.49,399900.50893982663]
[null,null,null,null,null,0.5588254800019361,551,0.49,400286.69132538687]
[null,null,null,null,null,0.55835041187540102,552,0.49,400672.25556178781]
[null,null,null,null,null,0.55787620360114798,553,0.49,401057.20276886527]
[null,null,null,null,null,0.55740285207221141,554,0.49,401441.53406240669]
[null,null,null,null,null,0.55693035419843406,555,0.49,401825.25055417023]
[null,null,null,null,null,0.55645870690634736,556,0.49,402208.35335190792]
[null,null,null,null,null,0.55598790713905144,557,0.49,402590.84355938714]
[null,null,null,null,null,0.55551795185609643,558,0.49,402972.7222764123]
[null,null,null,null,null,0.5550488380333638,559,0.49,403353.99059884553]
[null,null,null,null,null,0.55458056266295075,560,0.49,403734.64961862814]
[null,null,null,null,null,0.55411312275305358,561,0.49,404114.70042380202]
[null,null,null,null,null,0.55364651532785292,562,0.49,404494.14409852936]
[null,null,null,null,null,0.55318073742740093,563,0.49,404872.98172311479]
[null,null,null,null,null,0.55271578610750827,564,0.49,405251.21437402506]
[null,null,null,null,null,0.5522516584396322,565,0.49,405628.84312390984]
[null,null,null,null,null,0.55178835151076577,566,0.49,406005.86904162151]
[null,null,null,null,null,0.55132586242332882,567,0.49,406382.29319223569]
[null,null,null,null,null,0.55086418829505801,568,0.49,406758.11663707084]
[null,null,null,null,null,0.5504033262589012,569,0.49,407133.34043370927]
[null,null,null,null,null,0.54994327346290772,570,0.49,407507.96563601459]
[null,null,null,null,null,0.54948402707012511,571,0.49,407881.99329415389]
[null,null,null,null,null,0.54902558425849279,572,0.49,408255.42445461522]
[null,null,null,null,null,0.5485679422207379,573,0.49,408628.26016022766]
[null,null,null,null,null,0.54811109816427339,574,0.49,409000.50145018077]
[null,null,null,null,null,0.54765504931109388,575,0.49,409372.14936004271]
[null,null,null,null,null,0.54719979289767617,576,0.49,409743.20492177992]
[null,null,null,null,null,{"$f":"-0.262*LN(G667)+2.2125","v":0.54674532617487759},577,0.49,{"$f":"$H$88*F667*1000*G667","v":410113.66916377575}]
[null,null,null,null,null,0.54629164640783689,578,0.49,410483.5431108487]
[null,null,null,null,null,0.54583875087587508,579,0.49,410852.82778427121]
[null,null,null,null,null,0.54538663687239808,580,0.49,411221.52420178818]
[null,null,null,null,null,0.54493530170479931,581,0.49,411589.63337763498]
[null,null,null,null,null,0.54448474269436309,582,0.49,411957.15632255515]
[null,null,null,null,null,0.5440349571761709,583,0.49,412324.09404381987]
[null,null,null,null,null,0.54358594249900438,584,0.49,412690.44754524413]
[null,null,null,null,null,0.54313769602525341,585,0.49,413056.21782720526]
[null,null,null,null,null,0.54269021513082261,586,0.49,413421.40588666062]
[null,null,null,null,null,0.5422434972050385,587,0.49,413786.01271716488]
[null,null,null,null,null,0.54179753965055966,588,0.49,414150.03930888779]
[null,null,null,null,null,0.54135233988328424,589,0.49,414513.48664863076]
[null,null,null,null,null,0.54090789533226147,590,0.49,414876.35571984452]
[null,null,null,null,null,0.54046420343960211,591,0.49,415238.64750264632]
[null,null,null,null,null,0.54002126166039033,592,0.49,415600.36297383643]
[null,null,null,null,null,0.53957906746259576,593,0.49,415961.5031069151]
[null,null,null,null,null,0.5391376183269867,594,0.49,416322.06887209922]
[null,null,null,null,null,0.53869691174704482,595,0.49,416682.06123633921]
[null,null,null,null,null,0.53825694522887813,596,0.49,417041.48116333474]
[null,null,null,null,null,0.53781771629113795,597,0.49,417400.32961355214]
[null,null,null,null,null,0.53737922246493453,598,0.49,417758.60754424013]
[null,null,null,null,null,0.5369414612937522,599,0.49,418116.31590944488]
[null,null,null,null,null,0.53650443033336948,600,0.49,418473.45566002821]
[null,null,null,null,null,0.53606812715177554,601,0.49,418830.02774368227]
[null,null,null,null,null,0.53563254932908877,602,0.49,419186.03310494486]
[null,null,null,null,null,0.53519769445747722,603,0.49,419541.4726852164]
[null,null,null,null,null,0.53476356014107829,604,0.49,419896.34742277465]
[null,null,null,null,null,0.53433014399591938,605,0.49,420250.65825279057]
[null,null,null,null,null,0.5338974436498396,606,0.49,420604.40610734362]
[null,null,null,null,null,0.5334654567424113,607,0.49,420957.59191543673]
[null,null,null,null,null,0.53303418092486399,608,0.49,421310.21660301252]
[null,null,null,null,null,0.53260361386000676,609,0.49,421662.28109296737]
[null,null,null,null,null,0.53217375322215221,610,0.49,422013.78630516672]
[null,null,null,null,null,0.53174459669704177,611,0.49,422364.73315646028]
[null,null,null,null,null,0.53131614198177046,612,0.49,422715.12256069656]
[null,null,null,null,null,0.53088838678471251,613,0.49,423064.95542873739]
[null,null,null,null,null,0.5304613288254485,614,0.49,423414.23266847298]
[null,null,null,null,null,0.53003496583469234,615,0.49,423762.95518483652]
[null,null,null,null,null,0.52960929555421776,616,0.49,424111.12387981761]
[null,null,null,null,null,0.52918431573678815,617,0.49,424458.73965247779]
[null,null,null,null,null,0.52876002414608503,618,0.49,424805.80339896475]
[null,null,null,null,null,0.52833641855663571,619,0.49,425152.31601252477]
[null,null,null,null,null,0.52791349675374577,620,0.49,425498.27838351903]
[null,null,null,null,null,0.52749125653342843,621,0.49,425843.69139943679]
[null,null,null,null,null,0.52706969570233486,622,0.49,426188.55594490794]
[null,null,null,null,null,0.5266488120776871,623,0.49,426532.87290171883]
[null,null,null,null,null,0.52622860348720968,624,0.49,426876.64314882457]
[null,null,null,null,null,0.52580906776906278,625,0.49,427219.86756236356]
[null,null,null,null,null,0.52539020277177406,626,0.49,427562.54701566976]
[null,null,null,null,null,0.52497200635417451,627,0.49,427904.68237928767]
[null,null,null,null,null,0.52455447638533181,628,0.49,428246.27452098491]
[null,null,null,null,null,0.52413761074448439,629,0.49,428587.32430576487]
[null,null,null,null,null,0.52372140732097838,630,0.49,428927.83259588131]
[null,null,null,null,null,0.52330586401420209,631,0.49,429267.80025084998]
[null,null,null,null,null,0.52289097873352319,632,0.49,429607.22812746267]
[null,null,null,null,null,0.52247674939822586,633,0.49,429946.11707980005]
[null,null,null,null,null,0.52206317393744661,634,0.49,430284.46795924345]
[null,null,null,null,null,0.52165025029011458,635,0.49,430622.28161448962]
[null,null,null,null,null,0.52123797640488778,636,0.49,430959.55889156129]
[null,null,null,null,null,0.52082635024009316,637,0.49,431296.30063382117]
[null,null,null,null,null,0.52041536976366487,638,0.49,431632.50768198364]
[null,null,null,null,null,0.52000503295308587,639,0.49,431968.18087412848]
[null,null,null,null,null,0.51959533779532596,640,0.49,432303.32104571117]
[null,null,null,null,null,{"$f":"-0.262*LN(G731)+2.2125","v":0.51918628228678432},641,0.49,{"$f":"$H$88*F731*1000*G731","v":432637.92902957735}]
[null,null,null,null,null,0.51877786443322993,642,0.49,432972.00565597368]
[null,null,null,null,null,0.51837008224974368,643,0.49,433305.55175256077]
[null,null,null,null,null,0.51796293376065905,644,0.49,433638.56814442377]
[null,null,null,null,null,0.5175564169995075,645,0.49,433971.0556540871]
[null,null,null,null,null,0.51715053000895805,646,0.49,434303.01510152296]
[null,null,null,null,null,0.51674527084076383,647,0.49,434634.4473041665]
[null,null,null,null,null,0.51634063755570403,648,0.49,434965.35307692509]
[null,null,null,null,null,0.51593662822352826,649,0.49,435295.73323219077]
[null,null,null,null,null,0.51553324092290298,650,0.49,435625.58857985301]
[null,null,null,null,null,0.5151304737413549,651,0.49,435954.91992730863]
[null,null,null,null,null,0.51472832477521679,652,0.49,436283.72807947377]
[null,null,null,null,null,0.51432679212957488,653,0.49,436612.01383879618]
[null,null,null,null,null,0.51392587391821376,654,0.49,436939.7780052654]
[null,null,null,null,null,0.51352556826356399,655,0.49,437267.02137642482]
[null,null,null,null,null,0.5131258732966486,656,0.49,437593.74474738189]
[null,null,null,null,null,0.51272678715703202,657,0.49,437919.94891082111]
[null,null,null,null,null,0.51232830799276674,658,0.49,438245.63465701271]
[null,null,null,null,null,0.51193043396034299,659,0.49,438570.80277382582]
[null,null,null,null,null,0.51153316322463649,660,0.49,438895.45404673816]
[null,null,null,null,null,0.51113649395885807,661,0.49,439219.58925884677]
[null,null,null,null,null,0.51074042434450373,662,0.49,439543.20919087995]
[null,null,null,null,null,0.51034495257130397,663,0.49,439866.31462120696]
[null,null,null,null,null,0.5099500768371743,664,0.49,440188.90632584895]
[null,null,null,null,null,0.50955579534816597,665,0.49,440510.98507848947]
[null,null,null,null,null,0.50916210631841774,666,0.49,440832.55165048607]
[null,null,null,null,null,0.5087690079701066,667,0.49,441153.60681087949]
[null,null,null,null,null,0.50837649853339872,668,0.49,441474.15132640343]
[null,null,null,null,null,0.50798457624640392,669,0.49,441794.18596149754]
[null,null,null,null,null,0.50759323935512679,670,0.49,442113.71147831547]
[null,null,null,null,null,0.50720248611341923,671,0.49,442432.7286367357]
[null,null,null,null,null,0.50681231478293465,672,0.49,442751.23819437175]
[null,null,null,null,null,0.50642272363308116,673,0.49,443069.24090658274]
[null,null,null,null,null,0.50603371094097538,674,0.49,443386.73752648267]
[null,null,null,null,null,0.50564527499139689,675,0.49,443703.72880495078]
[null,null,null,null,null,0.50525741407674318,676,0.49,444020.21549064195]
[null,null,null,null,null,0.50487012649698371,677,0.49,444336.19832999544]
[null,null,null,null,null,0.50448341055961632,678,0.49,444651.67806724581]
[null,null,null,null,null,0.50409726457962134,679,0.49,444966.65544443182]
[null,null,null,null,null,0.50371168687942003,680,0.49,445281.13120140735]
[null,null,null,null,null,0.50332667578882773,681,0.49,445595.10607584921]
[null,null,null,null,null,0.50294222964501278,682,0.49,445908.58080326836]
[null,null,null,null,null,0.50255834679245281,683,0.49,446221.55611701886]
[null,null,null,null,null,0.50217502558289162,684,0.49,446534.03274830722]
[null,null,null,null,null,0.50179226437529678,685,0.49,446846.01142620185]
[null,null,null,null,null,0.50141006153581791,686,0.49,447157.49287764239]
[null,null,null,null,null,0.50102841543774446,687,0.49,447468.47782744962]
[null,null,null,null,null,0.50064732446146376,688,0.49,447778.96699833323]
[null,null,null,null,null,0.50026678699442129,689,0.49,448088.96111090318]
[null,null,null,null,null,0.499886801431078,690,0.49,448398.46088367689]
[null,null,null,null,null,0.49950736617287017,691,0.49,448707.46703308931]
[null,null,null,null,null,0.49912847962817053,692,0.49,449015.98027350224]
[null,null,null,null,null,0.49875014021224517,693,0.49,449324.00131721172]
[null,null,null,null,null,0.49837234634721694,694,0.49,449631.53087445913]
[null,null,null,null,null,0.49799509646202433,695,0.49,449938.56965343899]
[null,null,null,null,null,0.49761838899238175,696,0.49,450245.11836030701]
[null,null,null,null,null,0.49724222238074245,697,0.49,450551.1776991908]
[null,null,null,null,null,0.4968665950762583,698,0.49,450856.7483721968]
[null,null,null,null,null,0.49649150553474164,699,0.49,451161.83107941982]
[null,null,null,null,null,0.49611695221862795,700,0.49,451466.42651895154]
[null,null,null,null,null,0.49574293359693722,701,0.49,451770.53538688895]
[null,null,null,null,null,0.49536944814523731,702,0.49,452074.15837734361]
[null,null,null,null,null,0.49499649434560555,703,0.49,452377.29618244898]
[null,null,null,null,null,0.49462407068659275,704,0.49,452679.94949236966]
[null,null,null,null,null,{"$f":"-0.262*LN(G795)+2.2125","v":0.49425217566318547},705,0.49,{"$f":"$H$88*F795*1000*G795","v":452982.11899530952}]
[null,null,null,null,null,0.49388080777677046,706,0.49,453283.80537751998]
[null,null,null,null,null,0.49350996553509763,707,0.49,453585.00932330819]
[null,null,null,null,null,0.49313964745224537,708,0.49,453885.73151504662]
[null,null,null,null,null,0.49276985204858237,709,0.49,454185.97263317835]
[null,null,null,null,null,0.49240057785073521,710,0.49,454485.73335622862]
[null,null,null,null,null,0.49203182339155083,711,0.49,454785.01436081051]
[null,null,null,null,null,0.49166358721006209,712,0.49,455083.81632163347]
[null,null,null,null,null,0.49129586785145429,713,0.49,455382.13991151308]
[null,null,null,null,null,0.49092866386702871,714,0.49,455679.98580137611]
[null,null,null,null,null,0.49056197381416999,715,0.49,455977.35466027103]
[null,null,null,null,null,0.4901957962563106,716,0.49,456274.24715537392]
[null,null,null,null,null,0.4898301297628993,717,0.49,456570.66395199846]
[null,null,null,null,null,0.48946497290936519,718,0.49,456866.60571360146]
[null,null,null,null,null,0.4891003242770855,719,0.49,457162.07310179184]
[null,null,null,null,null,0.48873618245335337,720,0.49,457457.06677633879]
[null,null,null,null,null,0.48837254603134306,721,0.49,457751.5873951778]
[null,null,null,null,null,0.48800941361007943,722,0.49,458045.63561442058]
[null,null,null,null,null,0.4876467837944034,723,0.49,458339.21208835981]
[null,null,null,null,null,0.48728465519494235,724,0.49,458632.31746947975]
[null,null,null,null,null,0.48692302642807506,725,0.49,458924.95240846078]
[null,null,null,null,null,0.48656189611590328,726,0.49,459217.11755418952]
[null,null,null,null,null,0.48620126288621779,727,0.49,459508.81355376443]
[null,null,null,null,null,0.48584112537246815,728,0.49,459800.04105250386]
[null,null,null,null,null,0.48548148221373144,729,0.49,460090.80069395324]
[null,null,null,null,null,0.48512233205468136,730,0.49,460381.09311989264]
[null,null,null,null,null,0.48476367354555805,731,0.49,460670.91897034383]
[null,null,null,null,null,0.48440550534213633,732,0.49,460960.27888357692]
[null,null,null,null,null,0.4840478261056973,733,0.49,461249.17349611898]
[null,null,null,null,null,0.48369063450299676,734,0.49,461537.60344275954]
[null,null,null,null,null,0.48333392920623663,735,0.49,461825.56935655914]
[null,null,null,null,null,0.48297770889303426,736,0.49,462113.07186885516]
[null,null,null,null,null,0.4826219722463938,737,0.49,462400.11160926992]
[null,null,null,null,null,0.48226671795467602,738,0.49,462686.68920571619]
[null,null,null,null,null,0.48191194471157095,739,0.49,462972.80528440623]
[null,null,null,null,null,0.48155765121606753,740,0.49,463258.46046985697]
[null,null,null,null,null,0.48120383617242513,741,0.49,463543.65538489708]
[null,null,null,null,null,0.48085049829014626,742,0.49,463828.39065067511]
[null,null,null,null,null,0.48049763628394704,743,0.49,464112.6668866644]
[null,null,null,null,null,0.48014524887372989,744,0.49,464396.48471067159]
[null,null,null,null,null,0.4797933347845551,745,0.49,464679.84473884164]
[null,null,null,null,null,0.47944189274661464,746,0.49,464962.74758566695]
[null,null,null,null,null,0.47909092149520172,747,0.49,465245.19386399037]
[null,null,null,null,null,0.4787404197706866,748,0.49,465527.18418501568]
[null,null,null,null,null,0.4783903863184884,749,0.49,465808.71915831219]
[null,null,null,null,null,0.47804081988904645,750,0.49,466089.79939182033]
[null,null,null,null,null,0.47769171923779652,751,0.4,466370.42549186072]
[null,null,null,null,null,0.47734308312514173,752,0.4,466650.59806313855]
[null,null,null,null,null,0.47699491031642771,753,0.4,466930.31770875113]
[null,null,null,null,null,0.47664719958191526,754,0.4,467209.58503019338]
[null,null,null,null,null,0.47629994969675526,755,0.4,467488.40062736534]
[null,null,null,null,null,0.47595315944096206,756,0.4,467766.76509857748]
[null,null,null,null,null,0.47560682759938833,757,0.4,468044.67904055805]
[null,null,null,null,null,0.47526095296169846,758,0.4,468322.14304845763]
[null,null,null,null,null,0.47491553432234479,759,0.4,468599.15771585761]
[null,null,null,null,null,0.47457057048054119,760,0.4,468875.72363477474]
[null,null,null,null,null,0.47422606024023817,761,0.4,469151.84139566758]
[null,null,null,null,null,0.47388200241009848,762,0.4,469427.51158744359]
[null,null,null,null,null,0.47353839580347223,763,0.4,469702.7347974641]
[null,null,null,null,null,0.47319523923837137,764,0.4,469977.51161155041]
[null,null,null,null,null,0.47285253153744744,765,0.4,470251.84261399152]
[null,null,null,null,null,0.47251027152796499,766,0.4,470525.72838754748]
[null,null,null,null,null,0.47216845804177887,767,0.4,470799.16951345769]
[null,null,null,null,null,0.47182708991530964,768,0.4,471072.16657144518]
[null,null,null,null,null,{"$f":"-0.262*LN(G859)+2.2125","v":0.47148616598952109},769,0.4,{"$f":"$H$88*F859*1000*G859","v":471344.7201397242}]
[null,null,null,null,null,0.47114568510989474,770,0.4,471616.83079500467]
[null,null,null,null,null,0.47080564612640763,771,0.4,471888.49911249836]
[null,null,null,null,null,0.47046604789350832,772,0.4,472159.72566592501]
[null,null,null,null,null,0.47012688927009516,773,0.4,472430.51102751872]
[null,null,null,null,null,0.46978816911949117,774,0.4,472700.85576803208]
[null,null,null,null,null,0.46944988630942275,775,0.4,472970.76045674342]
[null,null,null,null,null,0.46911203971199655,776,0.4,473240.22566146217]
[null,null,null,null,null,0.46877462820367621,777,0.4,473509.25194853341]
[null,null,null,null,null,0.46843765066526122,778,0.4,473777.83988284523]
[null,null,null,null,null,0.46810110598186383,779,0.4,474045.9900278335]
[null,null,null,null,null,0.46776499304288688,780,0.4,474313.70294548728]
[null,null,null,null,null,0.467429310742002,781,0.4,474580.97919635469]
[null,null,null,null,null,0.46709405797712833,782,0.4,474847.8193395487]
[null,null,null,null,null,0.46675923365040961,783,0.4,475114.22393275192]
[null,null,null,null,null,0.46642483666819312,784,0.4,475380.19353222247]
[null,null,null,null,null,0.46609086594100879,785,0.4,475645.72869279952]
[null,null,null,null,null,0.46575732038354767,786,0.4,475910.82996790909]
[null,null,null,null,null,0.46542419891464015,787,0.4,476175.49790956837]
[null,null,null,null,null,0.46509150045723557,788,0.4,476439.7330683922]
[null,null,null,null,null,0.46475922393838087,789,0.4,476703.5359935973]
[null,null,null,null,null,0.46442736828920017,790,0.4,476966.90723300853]
[null,null,null,null,null,0.46409593244487435,791,0.4,477229.84733306436]
[null,null,null,null,null,0.46376491534462017,792,0.4,477492.35683882097]
[null,null,null,null,null,0.46343431593166984,793,0.4,477754.43629395851]
[null,null,null,null,null,0.46310413315325016,794,0.4,478016.08624078485]
[null,null,null,null,null,0.46277436596056476,795,0.4,478277.30722024362]
[null,null,null,null,null,0.46244501330877141,796,0.4,478538.09977191669]
[null,null,null,null,null,0.46211607415696343,797,0.4,478798.46443402983]
[null,null,null,null,null,0.46178754746814987,798,0.4,479058.40174345864]
[null,null,null,null,null,0.4614594322092358,799,0.4,479317.91223573324]
[null,null,null,null,null,0.46113172735100294,800,0.4,479576.99644504307]
[null,null,null,null,null,0.4608044318680895,801,0.4,479835.65490424162]
[null,null,null,null,null,0.46047754473897307,802,0.4,480093.88814485329]
[null,null,null,null,null,0.46015106494594837,803,0.4,480351.69669707556]
[null,null,null,null,null,0.45982499147511069,804,0.4,480609.08108978567]
[null,null,null,null,null,0.45949932331633625,805,0.4,480866.04185054591]
[null,null,null,null,null,0.4591740594632634,806,0.4,481122.57950560749]
[null,null,null,null,null,0.45884919891327325,807,0.4,481378.69457991503]
[null,null,null,null,null,0.45852474066747306,808,0.4,481634.38759711367]
[null,null,null,null,null,0.45820068373067513,809,0.4,481889.65907955106]
[null,null,null,null,null,0.45787702711138101,810,0.4,482144.50954828429]
[null,null,null,null,null,0.45755376982176155,811,0.4,482398.93952308322]
[null,null,null,null,null,0.45723091087764023,812,0.4,482652.94952243706]
[null,null,null,null,null,0.45690844929847363,813,0.4,482906.54006355675]
[null,null,null,null,null,0.45658638410733432,814,0.4,483159.71166238119]
[null,null,null,null,null,0.45626471433089377,815,0.4,483412.46483358199]
[null,null,null,null,null,0.45594343899940393,816,0.4,483664.80009056773]
[null,null,null,null,null,0.45562255714667899,817,0.4,483916.71794548782]
[null,null,null,null,null,0.45530206781008031,818,0.4,484168.21890923945]
[null,null,null,null,null,0.45498197003049556,819,0.4,484419.30349146866]
[null,null,null,null,null,0.45466226285232558,820,0.4,484669.97220057907]
[null,null,null,null,null,0.45434294532346375,821,0.4,484920.22554373293]
[null,null,null,null,null,0.45402401649528068,822,0.4,485170.06402685697]
[null,null,null,null,null,0.45370547542260753,823,0.4,485419.48815464781]
[null,null,null,null,null,0.45338732116371827,824,0.4,485668.49843057501]
[null,null,null,null,null,0.45306955278031347,825,0.4,485917.09535688622]
[null,null,null,null,null,0.45275216933750362,826,0.4,486165.27943461144]
[null,null,null,null,null,0.45243516990379273,827,0.4,486413.05116356758]
[null,null,null,null,null,0.4521185535510619,828,0.4,486660.41104236298]
[null,null,null,null,null,0.45180231935455262,829,0.4,486907.35956840136]
[null,null,null,null,null,0.45148646639285128,830,0.4,487153.8972378865]
[null,null,null,null,null,0.45117099374787228,831,0.4,487400.02454582648]
[null,null,null,null,null,0.45085590050484314,832,0.4,487645.7419860384]
[null,null,null,null,null,{"$f":"-0.262*LN(G923)+2.2125","v":0.45054118575228697},833,0.4,{"$f":"$H$88*F923*1000*G923","v":487891.0500511516}]
[null,null,null,null,null,0.45022684858200823,834,0.4,488135.94923261338]
[null,null,null,null,null,0.44991288808907592,835,0.4,488380.44002069195]
[null,null,null,null,null,0.44959930337180798,836,0.4,488624.52290448098]
[null,null,null,null,null,0.4492860935317573,837,0.4,488868.19837190513]
[null,null,null,null,null,0.44897325767369423,838,0.4,489111.46690972248]
[null,null,null,null,null,0.44866079490559185,839,0.4,489354.3290035291]
[null,null,null,null,null,0.44834870433861163,840,0.4,489596.78513776395]
[null,null,null,null,null,0.44803698508708734,841,0.4,489838.83579571254]
[null,null,null,null,null,0.44772563626851025,842,0.4,490080.48145951133]
[null,null,null,null,null,0.44741465700351379,843,0.4,490321.72261015081]
[null,null,null,null,null,0.44710404641585888,844,0.4,490562.5597274804]
[null,null,null,null,null,0.44679380363242016,845,0.4,490802.99329021364]
[null,null,null,null,null,0.44648392778316937,846,0.4,491043.02377592959]
[null,null,null,null,null,0.44617441800116153,847,0.4,491282.65166107903]
[null,null,null,null,null,0.44586527342252125,848,0.4,491521.87742098747]
[null,null,null,null,null,0.44555649318642665,849,0.4,491760.7015298591]
[null,null,null,null,null,0.44524807643509678,850,0.4,491999.12446078198]
[null,null,null,null,null,0.44494002231377583,851,0.4,492237.1466857302]
[null,null,null,null,null,0.44463232997071911,852,0.4,492474.76867556851]
[null,null,null,null,null,0.44432499855717977,853,0.4,492711.99090005673]
[null,null,null,null,null,0.44401802722739436,854,0.4,492948.81382785324]
[null,null,null,null,null,0.44371141513856882,855,0.4,493185.23792651936]
[null,null,null,null,null,0.44340516145086339,856,0.4,493421.26366252085]
[null,null,null,null,null,0.44309926532738153,857,0.4,493656.89150123583]
[null,null,null,null,null,0.44279372593415367,858,0.4,493892.12190695503]
[null,null,null,null,null,0.44248854244012503,859,0.4,494126.95534288761]
[null,null,null,null,null,0.44218371401714096,860,0.4,494361.39227116358]
[null,null,null,null,null,0.44187923983993449,861,0.4,494595.43315283867]
[null,null,null,null,null,0.44157511908611236,862,0.4,494829.07844789757]
[null,null,null,null,null,0.44127135093614167,863,0.4,495062.3286152574]
[null,null,null,null,null,0.44096793457333727,864,0.4,495295.18411277246]
[null,null,null,null,null,0.44066486918384751,865,0.4,495527.64539723651]
[null,null,null,null,null,0.4403621539566418,866,0.4,495759.71292438736]
[null,null,null,null,null,0.44005978808349799,867,0.4,495991.38714891067]
[null,null,null,null,null,0.43975777075898792,868,0.4,496222.66852444201]
[null,null,null,null,null,0.43945610118046718,869,0.4,496453.55750357377]
[null,null,null,null,null,0.43915477854805895,870,0.4,496684.05453785474]
[null,null,null,null,null,0.43885380206464397,871,0.4,496914.16007779643]
[null,null,null,null,null,0.43855317093584723,872,0.4,497143.87457287649]
[null,null,null,null,null,0.43825288437002419,873,0.4,497373.19847154047]
[null,null,null,null,null,0.43795294157824949,874,0.4,497602.13222120702]
[null,null,null,null,null,0.43765334177430493,875,0.4,497830.67626827181]
[null,null,null,null,null,0.43735408417466526,876,0.4,498058.83105810877]
[null,null,null,null,null,0.43705516799848798,877,0.4,498286.59703507618]
[null,null,null,null,null,0.43675659246759913,878,0.4,498513.97464251763]
[null,null,null,null,null,0.43645835680648348,879,0.4,498740.96432276873]
[null,null,null,null,null,0.43616046024226995,880,0.4,498967.56651715684]
[null,null,null,null,null,0.43586290200472066,881,0.4,499193.7816660066]
[null,null,null,null,null,0.43556568132622053,882,0.4,499419.61020864453]
[null,null,null,null,null,0.43526879744176239,883,0.4,499645.05258339911]
[null,null,null,null,null,0.43497224958893721,884,0.4,499870.10922760674]
[null,null,null,null,null,0.43467603700792234,885,0.4,500094.78057761467]
[null,null,null,null,null,0.43438015894146864,886,0.4,500319.06706878362]
[null,null,null,null,null,0.43408461463489001,887,0.4,500542.96913549164]
[null,null,null,null,null,0.4337894033360512,888,0.4,500766.48721113749]
[null,null,null,null,null,0.43349452429535673,889,0.4,500989.62172814377]
[null,null,null,null,null,0.43319997676573929,890,0.4,501212.37311796047]
[null,null,null,null,null,0.4329057600026478,891,0.4,501434.74181106698]
[null,null,null,null,null,0.43261187326403738,892,0.4,501656.72823697783]
[null,null,null,null,null,0.43231831581035718,893,0.4,501878.33282424358]
[null,null,null,null,null,0.43202508690453922,894,0.4,502099.55600045557]
[null,null,null,null,null,0.4317321858119878,895,0.4,502320.39819224784]
[null,null,null,null,null,0.43143961180056811,896,0.4,502540.85982530174]
[null,null,null,null,null,{"$f":"-0.262*LN(G987)+2.2125","v":0.4311473641405954},897,0.4,{"$f":"$H$88*F987*1000*G987","v":502760.94132434833}]
[null,null,null,null,null,0.43085544210482341,898,0.4,502980.64311317081]
[null,null,null,null,null,0.43056384496843547,899,0.4,503199.96561461064]
[null,null,null,null,null,0.43027257200903035,900,0.4,503418.90925056557]
[null,null,null,null,null,0.42998162250661531,901,0.4,503637.47444199858]
[null,null,null,null,null,0.42969099574359237,902,0.4,503855.66160893638]
[null,null,null,null,null,0.42940069100474965,903,0.4,504073.47117047565]
[null,null,null,null,null,0.42911070757724978,904,0.4,504290.90354478388]
[null,null,null,null,null,0.42882104475061933,905,0.4,504507.95914910373]
[null,null,null,null,null,0.42853170181673916,906,0.4,504724.63839975547]
[null,null,null,null,null,0.42824267806983407,907,0.4,504940.94171214139]
[null,null,null,null,null,0.42795397280646097,908,0.4,505156.8695007466]
[null,null,null,null,null,0.42766558532550047,909,0.4,505372.42217914399]
[null,null,null,null,null,0.42737751492814513,910,0.4,505587.60015999572]
[null,null,null,null,null,0.42708976091789075,911,0.4,505802.40385505796]
[null,null,null,null,null,0.42680232260052509,912,0.4,506016.83367518248]
[null,null,null,null,null,0.4265151992841183,913,0.4,506230.89003032004]
[null,null,null,null,null,0.42622839027901271,914,0.4,506444.57332952297]
[null,null,null,null,null,0.42594189489781331,915,0.4,506657.88398094894]
[null,null,null,null,null,0.42565571245537792,916,0.4,506870.82239186403]
[null,null,null,null,null,0.42536984226880614,917,0.4,507083.38896864379]
[null,null,null,null,null,0.42508428365743134,918,0.4,507295.58411677851]
[null,null,null,null,null,0.42479903594280977,919,0.4,507507.40824087488]
[null,null,null,null,null,0.42451409844871124,920,0.4,507718.86174465867]
[null,null,null,null,null,0.42422947050110937,921,0.4,507929.9450309783]
[null,null,null,null,null,0.42394515142817224,922,0.4,508140.65850180725]
[null,null,null,null,null,0.42366114056025261,923,0.4,508351.00255824713]
[null,null,null,null,null,0.42337743722987864,924,0.4,508560.9776005302]
[null,null,null,null,null,0.42309404077174451,925,0.4,508770.58402802283]
[null,null,null,null,null,0.4228109505227009,926,0.4,508979.82223922736]
[null,null,null,null,null,0.4225281658217459,927,0.4,509188.69263178611]
[null,null,null,null,null,0.42224568601001522,928,0.4,509397.19560248242]
[null,null,null,null,null,0.42196351043077418,929,0.4,509605.33154724597]
[null,null,null,null,null,0.42168163842940687,930,0.4,509813.10086115287]
[null,null,null,null,null,0.42140006935340835,931,0.4,510020.50393843022]
[null,null,null,null,null,0.4211188025523751,932,0.4,510227.54117245768]
[null,null,null,null,null,0.42083783737799574,933,0.4,510434.21295577101]
[null,null,null,null,null,0.42055717318404295,934,0.4,510640.51968006493]
[null,null,null,null,null,0.4202768093263638,935,0.4,510846.4617361952]
[null,null,null,null,null,0.41999674516287078,936,0.4,511052.03951418115]
[null,null,null,null,null,0.4197169800535332,937,0.4,511257.2534032088]
[null,null,null,null,null,0.41943751336036894,938,0.4,511462.10379163391]
[null,null,null,null,null,0.41915834444743494,939,0.4,511666.59106698388]
[null,null,null,null,null,0.41887947268081871,940,0.4,511870.71561596048]
[null,null,null,null,null,0.41860089742863038,941,0.4,512074.47782444354]
[null,null,null,null,null,0.41832261806099269,942,0.4,512277.87807749165]
[null,null,null,null,null,0.41804463395003388,943,0.4,512480.91675934655]
[null,null,null,null,null,0.41776694446987883,944,0.4,512683.59425343521]
[null,null,null,null,null,0.41748954899663926,945,0.4,512885.91094237135]
[null,null,null,null,null,0.41721244690840775,946,0.4,513087.86720795993]
[null,null,null,null,null,0.41693563758524732,947,0.4,513289.46343119798]
[null,null,null,null,null,0.41665912040918429,948,0.4,513490.69999227877]
[null,null,null,null,null,0.41638289476419876,949,0.4,513691.57727059204]
[null,null,null,null,null,0.41610696003621817,950,0.4,513892.09564472939]
[null,null,null,null,null,0.41583131561310749,951,0.4,514092.25549248484]
[null,null,null,null,null,0.41555596088466218,952,0.4,514292.05719085794]
[null,null,null,null,null,0.41528089524259904,953,0.4,514491.50111605594]
[null,null,null,null,null,0.41500611808054866,954,0.4,514690.5876434964]
[null,null,null,null,null,0.41473162879404857,955,0.4,514889.31714781129]
[null,null,null,null,null,0.41445742678053277,956,0.4,515087.69000284607]
[null,null,null,null,null,0.41418351143932575,957,0.4,515285.7065816652]
[null,null,null,null,null,0.41390988217163449,958,0.4,515483.36725655367]
[null,null,null,null,null,0.41363653838053893,959,0.4,515680.6723990179]
[null,null,null,null,null,0.41336347947098684,960,0.4,515877.62237979163]
[null,null,null,null,null,{"$f":"-0.262*LN(G1051)+2.2125","v":0.41309070484978316},961,0.4,{"$f":"$H$88*F1051*1000*G1051","v":516074.21756883414}]
[null,null,null,null,null,0.41281821392558471,962,0.4,516270.45833533618]
[null,null,null,null,null,0.41254600610889081,963,0.4,516466.34504772036]
[null,null,null,null,null,0.41227408081203687,964,0.4,516661.87807364459]
[null,null,null,null,null,0.41200243744918552,965,0.4,516857.05778000329]
[null,null,null,null,null,0.41173107543632015,966,0.4,517051.88453293085]
[null,null,null,null,null,0.41145999419123669,967,0.4,517246.35869780369]
[null,null,null,null,null,0.41118919313353675,968,0.4,517440.48063924274]
[null,null,null,null,null,0.41091867168461893,969,0.4,517634.25072111451]
[null,null,null,null,null,0.41064842926767353,970,0.4,517827.66930653644]
[null,null,null,null,null,0.41037846530767252,971,0.4,518020.73675787501]
[null,null,null,null,null,0.41010877923136491,972,0.4,518213.45343675278]
[null,null,null,null,null,0.40983937046726648,973,0.4,518405.81970404537]
[null,null,null,null,null,0.40957023844565565,974,0.4,518597.83591988921]
[null,null,null,null,null,0.40930138259856386,975,0.4,518789.50244367972]
[null,null,null,null,null,0.4090328023597698,976,0.4,518980.81963407598]
[null,null,null,null,null,0.4087644971647908,977,0.4,519171.78784900083]
[null,null,null,null,null,0.40849646645087767,978,0.4,519362.40744564583]
[null,null,null,null,null,0.40822870965700608,979,0.4,519552.67878047167]
[null,null,null,null,null,0.4079612262238701,980,0.4,519742.60220921051]
[null,null,null,null,null,0.40769401559387464,981,0.4,519932.17808686831]
[null,null,null,null,null,0.40742707721112992,982,0.4,520121.40676772845]
[null,null,null,null,null,0.40716041052144214,983,0.4,520310.28860535094]
[null,null,null,null,null,0.40689401497230948,984,0.4,520498.82395257836]
[null,null,null,null,null,0.40662789001291255,985,0.4,520687.01316153456]
[null,null,null,null,null,0.40636203509410951,986,0.4,520874.85658362962]
[null,null,null,null,null,0.40609644966842762,987,0.4,521062.35456955945]
[null,null,null,null,null,0.40583113319005837,988,0.4,521249.50746931095]
[null,null,null,null,null,0.40556608511484926,989,0.4,521436.31563216174]
[null,null,null,null,null,0.40530130490029737,990,0.4,521622.77940668276]
[null,null,null,null,null,0.40503679200554288,991,0.4,521808.89914074098]
[null,null,null,null,null,0.40477254589136336,992,0.4,521994.67518150224]
[null,null,null,null,null,0.40450856602016461,993,0.4,522180.10787543049]
[null,null,null,null,null,0.40424485185597736,994,0.4,522365.19756829395]
[null,null,null,null,null,0.40398140286444861,995,0.4,522549.94460516429]
[null,null,null,null,null,0.40371821851283518,996,0.4,522734.34933041898]
[null,null,null,null,null,0.40345529826999815,997,0.4,522918.41208774468]
[null,null,null,null,null,0.40319264160639623,998,0.4,523102.13322013838]
[null,null,null,null,null,0.40293024799407862,999,0.4,523285.51306991]
[null,null,null,null,null,0.40266811690667992,1000,0.4,523468.55197868386]
[null,null,null,null,null,0.40240624781941214,1001,0.34,523651.25028740108]
[null,null,null,null,null,0.4021446402090596,1002,0.34,523833.60833632108]
[null,null,null,null,null,0.40188329355397268,1003,0.34,524015.62646502501]
[null,null,null,null,null,0.40162220733406118,1004,0.34,524197.30501241673]
[null,null,null,null,null,0.40136138103078767,1005,0.34,524378.64431672404]
[null,null,null,null,null,0.40110081412716236,1006,0.34,524559.64471550309]
[null,null,null,null,null,0.40084050610773647,1007,0.34,524740.30654563778]
[null,null,null,null,null,0.40058045645859552,1008,0.34,524920.6301433437]
[null,null,null,null,null,0.4003206646673545,1009,0.34,525100.61584416882]
[null,null,null,null,null,0.40006113022315004,1010,0.34,525280.263982996]
[null,null,null,null,null,0.39980185261663626,1011,0.34,525459.57489404501]
[null,null,null,null,null,0.39954283133997803,1012,0.34,525638.54891087511]
[null,null,null,null,null,0.39928406588684484,1013,0.34,525817.18636638601]
[null,null,null,null,null,0.39902555575240406,1014,0.34,525995.48759281903]
[null,null,null,null,null,0.39876730043331721,1015,0.34,526173.45292176213]
[null,null,null,null,null,0.39850929942773194,1016,0.34,526351.08268414834]
[null,null,null,null,null,0.3982515522352772,1017,0.34,526528.37721026002]
[null,null,null,null,null,0.39799405835705715,1018,0.34,526705.33682972949]
[null,null,null,null,null,0.39773681729564592,1019,0.34,526881.96187154215]
[null,null,null,null,null,0.39747982855508091,1020,0.34,527058.25266403728]
[null,null,null,null,null,0.39722309164085745,1021,0.34,527234.20953491016]
[null,null,null,null,null,0.39696660605992351,1022,0.34,527409.83281121438]
[null,null,null,null,null,0.39671037132067388,1023,0.34,527585.1228193643]
[null,null,null,null,null,0.3964543869329431,1024,0.34,527760.07988513389]
[null,null,null,null,null,{"$f":"-0.262*LN(G1115)+2.2125","v":0.39619865240800256},1025,0.34,{"$f":"$H$88*F1115*1000*G1115","v":527934.70433366345}]
[null,null,null,null,null,0.3959431672585525,1026,0.34,528108.99648945744]
[null,null,null,null,null,0.3956879309987178,1027,0.34,528282.95667638816]
[null,null,null,null,null,0.39543294314404109,1028,0.34,528456.5852176965]
[null,null,null,null,null,0.39517820321147878,1029,0.34,528629.88243599515]
[null,null,null,null,null,0.39492371071939525,1030,0.34,528802.84865327016]
[null,null,null,null,null,0.39466946518755619,1031,0.34,528975.4841908816]
[null,null,null,null,null,0.39441546613712464,1032,0.34,529147.78936956637]
[null,null,null,null,null,0.39416171309065451,1033,0.34,529319.76450943993]
[null,null,null,null,null,0.39390820557208572,1034,0.34,529491.40992999764]
[null,null,null,null,null,0.39365494310673887,1035,0.34,529662.72595011711]
[null,null,null,null,null,0.39340192522130968,1036,0.34,529833.7128880599]
[null,null,null,null,null,0.39314915144386364,1037,0.34,530004.37106147257]
[null,null,null,null,null,0.39289662130383141,1038,0.34,530174.70078739012]
[null,null,null,null,null,0.3926443343320023,1039,0.34,530344.70238223544]
[null,null,null,null,null,0.39239229006052012,1040,0.34,530514.37616182328]
[null,null,null,null,null,0.39214048802287782,1041,0.34,530683.72244136059]
[null,null,null,null,null,0.39188892775391193,1042,0.34,530852.74153544917]
[null,null,null,null,null,0.39163760878979748,1043,0.34,531021.43375808652]
[null,null,null,null,null,0.39138653066804285,1044,0.34,531189.79942266783]
[null,null,null,null,null,0.39113569292748496,1045,0.34,531357.83884198824]
[null,null,null,null,null,0.39088509510828429,1046,0.34,531525.55232824502]
[null,null,null,null,null,0.39063473675191918,1047,0.34,531692.94019303727]
[null,null,null,null,null,0.39038461740118113,1048,0.34,531860.00274736923]
[null,null,null,null,null,0.39013473660016995,1049,0.34,532026.74030165176]
[null,null,null,null,null,0.38988509389428883,1050,0.34,532193.15316570422]
[null,null,null,null,null,0.38963568883023858,1051,0.34,532359.24164875504]
[null,null,null,null,null,0.38938652095601411,1052,0.34,532525.00605944498]
[null,null,null,null,null,0.38913758982089819,1053,0.34,532690.44670582761]
[null,null,null,null,null,0.3888888949754572,1054,0.34,532855.56389537151]
[null,null,null,null,null,0.38864043597153608,1055,0.34,533020.35793496168]
[null,null,null,null,null,0.38839221236225363,1056,0.34,533184.82913090184]
[null,null,null,null,null,0.38814422370199764,1057,0.34,533348.97778891493]
[null,null,null,null,null,0.38789646954641976,1058,0.34,533512.80421414576]
[null,null,null,null,null,0.38764894945243134,1059,0.34,533676.3087111623]
[null,null,null,null,null,0.38740166297819822,1060,0.34,533839.49158395722]
[null,null,null,null,null,0.38715460968313642,1061,0.34,534002.35313595005]
[null,null,null,null,null,0.38690778912790624,1062,0.34,534164.89366998745]
[null,null,null,null,null,0.38666120087440947,1063,0.34,534327.11348834657]
[null,null,null,null,null,0.38641484448578334,1064,0.34,534489.01289273542]
[null,null,null,null,null,0.38616871952639631,1065,0.34,534650.59218429564]
[null,null,null,null,null,0.38592282556184299,1066,0.34,534811.85166360205]
[null,null,null,null,null,0.38567716215894032,1067,0.34,534972.79163066624]
[null,null,null,null,null,0.38543172888572297,1068,0.34,535133.41238493775]
[null,null,null,null,null,0.38518652531143793,1069,0.34,535293.71422530536]
[null,null,null,null,null,0.38494155100654059,1070,0.34,535453.697450098]
[null,null,null,null,null,0.38469680554268959,1071,0.34,535613.36235708673]
[null,null,null,null,null,0.38445228849274393,1072,0.34,535772.70924348803]
[null,null,null,null,null,0.38420799943075679,1073,0.34,535931.73840596259]
[null,null,null,null,null,0.38396393793197148,1074,0.34,536090.4501406186]
[null,null,null,null,null,0.38372010357281794,1075,0.34,536248.84474301315]
[null,null,null,null,null,0.38347649593090671,1076,0.34,536406.92250815232]
[null,null,null,null,null,0.38323311458502607,1077,0.34,536564.68373049505]
[null,null,null,null,null,0.38298995911513711,1078,0.34,536722.12870395323]
[null,null,null,null,null,0.38274702910236869,1079,0.34,536879.25772189256]
[null,null,null,null,null,0.38250432412901425,1080,0.34,537036.07107713609]
[null,null,null,null,null,0.38226184377852723,1081,0.34,537192.56906196428]
[null,null,null,null,null,0.38201958763551613,1082,0.34,537348.75196811697]
[null,null,null,null,null,0.38177755528574031,1083,0.34,537504.62008679379]
[null,null,null,null,null,0.38153574631610687,1084,0.34,537660.17370865785]
[null,null,null,null,null,0.38129416031466512,1085,0.34,537815.41312383523]
[null,null,null,null,null,0.38105279687060323,1086,0.34,537970.33862191765]
[null,null,null,null,null,0.3808116555742429,1087,0.34,538124.95049196272]
[null,null,null,null,null,0.38057073601703717,1088,0.34,538279.24902249733]
[null,null,null,null,null,{"$f":"-0.262*LN(G1179)+2.2125","v":0.38033003779156416},1089,0.34,{"$f":"$H$88*F1179*1000*G1179","v":538433.23450151738}]
[null,null,null,null,null,0.3800895604915242,1090,0.34,538586.90721648978]
[null,null,null,null,null,0.37984930371173542,1091,0.34,538740.26745435433]
[null,null,null,null,null,0.37960926704812903,1092,0.34,538893.31550152402]
[null,null,null,null,null,0.3793694500977467,1093,0.34,539046.05164388835]
[null,null,null,null,null,0.37912985245873498,1094,0.34,539198.47616681294]
[null,null,null,null,null,0.37889047373034224,1095,0.34,539350.58935514221]
[null,null,null,null,null,0.37865131351291392,1096,0.34,539502.39149319974]
[null,null,null,null,null,0.37841237140788953,1097,0.34,539653.88286479132]
[null,null,null,null,null,0.37817364701779721,1098,0.34,539805.06375320372]
[null,null,null,null,null,0.37793513994625116,1099,0.34,539955.93444120907]
[null,null,null,null,null,0.37769684979794693,1100,0.34,540106.49521106412]
[null,null,null,null,null,0.37745877617865764,1101,0.34,540256.74634451268]
[null,null,null,null,null,0.37722091869523067,1102,0.34,540406.68812278751]
[null,null,null,null,null,0.37698327695558209,1103,0.34,540556.32082660915]
[null,null,null,null,null,0.37674585056869536,1104,0.34,540705.64473619161]
[null,null,null,null,null,0.37650863914461441,1105,0.34,540854.66013123863]
[null,null,null,null,null,0.37627164229444232,1106,0.34,541003.36729094922]
[null,null,null,null,null,0.37603485963033689,1107,0.34,541151.76649401779]
[null,null,null,null,null,0.37579829076550575,1108,0.34,541299.85801863449]
[null,null,null,null,null,0.37556193531420368,1109,0.34,541447.64214248746]
[null,null,null,null,null,0.3753257928917284,1110,0.34,541595.11914276413]
[null,null,null,null,null,0.37508986311441661,1111,0.34,541742.28929615195]
[null,null,null,null,null,0.37485414559964148,1112,0.34,541889.15287884173]
[null,null,null,null,null,0.37461863996580713,1113,0.34,542035.71016652626]
[null,null,null,null,null,0.37438334583234556,1114,0.34,542181.96143440285]
[null,null,null,null,null,0.37414826281971436,1115,0.34,542327.90695717605]
[null,null,null,null,null,0.37391339054939077,1116,0.34,542473.54700905608]
[null,null,null,null,null,0.3736787286438692,1117,0.34,542618.88186376251]
[null,null,null,null,null,0.37344427672665814,1118,0.34,542763.91179452499]
[null,null,null,null,null,0.37321003442227552,1119,0.34,542908.63707408414]
[null,null,null,null,null,0.37297600135624509,1120,0.34,543053.0579746929]
[null,null,null,null,null,0.37274217715509383,1121,0.34,543197.1747681183]
[null,null,null,null,null,0.3725085614463477,1122,0.34,543340.98772564274]
[null,null,null,null,null,0.37227515385852783,1123,0.34,543484.49711806478]
[null,null,null,null,null,0.37204195402114726,1124,0.34,543627.70321570034]
[null,null,null,null,null,0.37180896156470733,1125,0.34,543770.60628838453]
[null,null,null,null,null,0.37157617612069527,1126,0.34,543913.20660547377]
[null,null,null,null,null,0.3713435973215784,1127,0.34,544055.50443584449]
[null,null,null,null,null,0.37111122480080261,1128,0.34,544197.50004789699]
[null,null,null,null,null,0.37087905819278855,1129,0.34,544339.19370955578]
[null,null,null,null,null,0.37064709713292676,1130,0.34,544480.58568826946]
[null,null,null,null,null,0.37041534125757614,1131,0.34,544621.67625101411]
[null,null,null,null,null,0.37018379020406011,1132,0.34,544762.4656642949]
[null,null,null,null,null,0.36995244361066204,1133,0.34,544902.95419414411]
[null,null,null,null,null,0.36972130111662316,1134,0.34,545043.14210612583]
[null,null,null,null,null,0.36949036236213795,1135,0.34,545183.0296653345]
[null,null,null,null,null,0.36925962698835235,1136,0.34,545322.6171363988]
[null,null,null,null,null,0.36902909463735933,1137,0.34,545461.90478348092]
[null,null,null,null,null,0.36879876495219555,1138,0.34,545600.8928702781]
[null,null,null,null,null,0.36856863757683822,1139,0.34,545739.58166002436]
[null,null,null,null,null,0.36833871215620184,1140,0.34,545877.97141549119]
[null,null,null,null,null,0.36810898833613592,1141,0.34,546016.0623989905]
[null,null,null,null,null,0.36787946576341946,1142,0.34,546153.85487237258]
[null,null,null,null,null,0.36765014408575958,1143,0.34,546291.34909703012]
[null,null,null,null,null,0.36742102295178714,1144,0.34,546428.54533389781]
[null,null,null,null,null,0.36719210201105468,1145,0.34,546565.44384345494]
[null,null,null,null,null,0.36696338091403224,1146,0.34,546702.04488572525]
[null,null,null,null,null,0.3667348593121047,1147,0.34,546838.34872027929]
[null,null,null,null,null,0.36650653685756795,1148,0.34,546974.3556062344]
[null,null,null,null,null,0.36627841320362586,1149,0.34,547110.06580225588]
[null,null,null,null,null,0.36605048800438822,1150,0.34,547245.47956656036]
[null,null,null,null,null,0.36582276091486654,1151,0.34,547380.59715691477]
[null,null,null,null,null,0.36559523159097052,1152,0.34,547515.41883063747]
[null,null,null,null,null,{"$f":"-0.262*LN(G1243)+2.2125","v":0.36536789968950645},1153,0.34,{"$f":"$H$88*F1243*1000*G1243","v":547649.94484460121}]
[null,null,null,null,null,0.36514076486817193,1154,0.34,547784.17545523157]
[null,null,null,null,null,0.36491382678555562,1155,0.34,547918.11091851175]
[null,null,null,null,null,0.36468708510113124,1156,0.34,548051.75148998003]
[null,null,null,null,null,0.36446053947525647,1157,0.34,548185.09742473334]
[null,null,null,null,null,0.36423418956916942,1158,0.34,548318.14897742763]
[null,null,null,null,null,0.36400803504498502,1159,0.34,548450.90640227892]
[null,null,null,null,null,0.36378207556569242,1160,0.34,548583.36995306425]
[null,null,null,null,null,0.36355631079515227,1161,0.34,548715.53988312336]
[null,null,null,null,null,0.36333074039809343,1162,0.34,548847.41644535994]
[null,null,null,null,null,0.36310536404010985,1163,0.34,548978.99989224214]
[null,null,null,null,null,0.36288018138765765,1164,0.34,549110.29047580354]
[null,null,null,null,null,0.36265519210805208,1165,0.34,549241.28844764491]
[null,null,null,null,null,0.36243039586946524,1166,0.34,549371.99405893532]
[null,null,null,null,null,0.36220579234092209,1167,0.34,549502.407560413]
[null,null,null,null,null,0.36198138119229872,1168,0.34,549632.52920238639]
[null,null,null,null,null,0.36175716209431807,1169,0.34,549762.35923473514]
[null,null,null,null,null,0.36153313471854776,1170,0.34,549891.89790691109]
[null,null,null,null,null,0.36130929873739803,1171,0.34,550021.14546794107]
[null,null,null,null,null,0.36108565382411695,1172,0.34,550150.10216642462]
[null,null,null,null,null,0.36086219965278921,1173,0.34,550278.76825053827]
[null,null,null,null,null,0.36063893589833285,1174,0.34,550407.14396803558]
[null,null,null,null,null,0.36041586223649591,1175,0.34,550535.22956624755]
[null,null,null,null,null,0.360192978343854,1176,0.34,550663.02529208397]
[null,null,null,null,null,0.35997028389780739,1177,0.34,550790.53139203507]
[null,null,null,null,null,0.35974777857657858,1178,0.34,550917.74811217247]
[null,null,null,null,null,0.35952546205920854,1179,0.34,551044.67569814902]
[null,null,null,null,null,0.35930333402555581,1180,0.34,551171.31439520256]
[null,null,null,null,null,0.35908139415629092,1181,0.34,551297.66444815346]
[null,null,null,null,null,0.35885964213289623,1182,0.34,551423.72610140836]
[null,null,null,null,null,0.35863807763766253,1183,0.34,551549.49959896121]
[null,null,null,null,null,0.35841670035368467,1184,0.34,551674.98518439149]
[null,null,null,null,null,0.35819550996486127,1185,0.34,551800.18310086883]
[null,null,null,null,null,0.35797450615588988,1186,0.34,551925.09359115106]
[null,null,null,null,null,0.35775368861226675,1187,0.34,552049.71689758881]
[null,null,null,null,null,0.35753305702028104,1188,0.34,552174.05326212209]
[null,null,null,null,null,0.35731261106701506,1189,0.34,552298.10292628524]
[null,null,null,null,null,0.35709235044033938,1190,0.34,552421.86613120511]
[null,null,null,null,null,0.35687227482891126,1191,0.34,552545.34311760333]
[null,null,null,null,null,0.35665238392217247,1192,0.34,552668.5341257985]
[null,null,null,null,null,0.3564326774103459,1193,0.34,552791.43939570547]
[null,null,null,null,null,0.35621315498443229,1194,0.34,552914.05916683585]
[null,null,null,null,null,0.35599381633620975,1195,0.34,553036.39367830183]
[null,null,null,null,null,0.35577466115822864,1196,0.34,553158.44316881394]
[null,null,null,null,null,0.35555568914381097,1197,0.34,553280.20787668426]
[null,null,null,null,null,0.35533689998704654,1198,0.34,553401.68803982623]
[null,null,null,null,null,0.35511829338279122,1199,0.34,553522.88389575668]
[null,null,null,null,null,0.35489986902666382,1200,0.34,553643.79568159557]
[null,null,null,null,null,0.3546816266150441,1201,0.34,553764.42363406834]
[null,null,null,null,null,0.35446356584506966,1202,0.34,553884.7679895059]
[null,null,null,null,null,0.35424568641463416,1203,0.34,554004.82898384635]
[null,null,null,null,null,0.35402798802238311,1204,0.34,554124.60685263411]
[null,null,null,null,null,0.35381047036771385,1205,0.34,554244.1018310237]
[null,null,null,null,null,0.35359313315077157,1206,0.34,554363.31415377965]
[null,null,null,null,null,0.35337597607244664,1207,0.34,554482.24405527604]
[null,null,null,null,null,0.35315899883437263,1208,0.34,554600.89176949882]
[null,null,null,null,null,0.35294220113892427,1209,0.34,554719.25753004733]
[null,null,null,null,null,0.35272558268921372,1210,0.34,554837.34157013323]
[null,null,null,null,null,0.35250914318908966,1211,0.34,554955.14412258391]
[null,null,null,null,null,0.35229288234313372,1212,0.34,555072.66541984142]
[null,null,null,null,null,0.35207679985665874,1213,0.34,555189.90569396515]
[null,null,null,null,null,0.35186089543570565,1214,0.34,555306.86517663067]
[null,null,null,null,null,0.35164516878704188,1215,0.34,555423.54409913276]
[null,null,null,null,null,0.35142961961815833,1216,0.34,555539.94269238471]
[null,null,null,null,null,{"$f":"-0.262*LN(G1307)+2.2125","v":0.35121424763726772},1217,0.34,{"$f":"$H$88*F1307*1000*G1307","v":555656.06118692132}]
[null,null,null,null,null,0.35099905255330111,1218,0.34,555771.89981289697]
[null,null,null,null,null,0.35078403407590675,1219,0.34,555887.45880008943]
[null,null,null,null,null,0.35056919191544655,1220,0.34,556002.73837789823]
[null,null,null,null,null,0.3503545257829952,1221,0.34,556117.73877534829]
[null,null,null,null,null,0.35014003539033611,1222,0.34,556232.46022108791]
[null,null,null,null,null,0.34992572044996062,1223,0.34,556346.9029433924]
[null,null,null,null,null,0.3497115806750648,1224,0.34,556461.06717016315]
[null,null,null,null,null,0.34949761577954708,1225,0.34,556574.95312892867]
[null,null,null,null,null,0.34928382547800663,1226,0.34,556688.56104684703]
[null,null,null,null,null,0.34907020948574119,1227,0.34,556801.89115070575]
[null,null,null,null,null,0.34885676751874284,1228,0.34,556914.94366692111]
[null,null,null,null,null,0.34864349929369887,1229,0.34,557027.71882154269]
[null,null,null,null,null,0.34843040452798646,1230,0.34,557140.2168402503]
[null,null,null,null,null,0.34821748293967292,1231,0.34,557252.43794835859]
[null,null,null,null,null,0.3480047342475121,1232,0.34,557364.38237081538]
[null,null,null,null,null,0.34779215817094156,1233,0.34,557476.05033220223]
[null,null,null,null,null,0.34757975443008249,1234,0.34,557587.44205673831]
[null,null,null,null,null,0.34736752274573535,1235,0.34,557698.55776827806]
[null,null,null,null,null,0.34715546283937937,1236,0.34,557809.3976903148]
[null,null,null,null,null,0.34694357443316814,1237,0.34,557919.96204597771]
[null,null,null,null,null,0.34673185724992983,1238,0.34,558030.25105803704]
[null,null,null,null,null,0.34652031101316449,1239,0.34,558140.26494890405]
[null,null,null,null,null,0.34630893544704011,1240,0.34,558250.00394062873]
[null,null,null,null,null,0.34609773027639279,1241,0.34,558359.4682549045]
[null,null,null,null,null,0.34588669522672277,1242,0.34,558468.65811306657]
[null,null,null,null,null,0.34567583002419333,1243,0.34,558577.57373609405]
[null,null,null,null,null,0.3454651343956292,1244,0.34,558686.21534461156]
[null,null,null,null,null,0.34525460806851216,1245,0.34,558794.58315888699]
[null,null,null,null,null,0.34504425077098144,1246,0.34,558902.67739883577]
[null,null,null,null,null,0.34483406223183022,1247,0.34,559010.49828402]
[null,null,null,null,null,0.34462404218050402,1248,0.34,559118.04603364971]
[null,null,null,null,null,0.34441419034709853,1249,0.34,559225.32086658385]
[null,null,null,null,null,0.34420450646235712,1250,0.34,559332.32300133037]
[null,null,null,null,null,0.34399499025766911,1251,0.34,559439.05265604728]
[null,null,null,null,null,0.3437856414650684,1252,0.34,559545.51004854531]
[null,null,null,null,null,0.34357645981722995,1253,0.34,559651.69539628585]
[null,null,null,null,null,0.34336744504746886,1254,0.34,559757.6089163837]
[null,null,null,null,null,0.34315859688973815,1255,0.34,559863.2508256078]
[null,null,null,null,null,0.34294991507862616,1256,0.34,559968.62134038075]
[null,null,null,null,null,0.3427413993493551,1257,0.34,560073.72067678114]
[null,null,null,null,null,0.34253304943777874,1258,0.34,560178.54905054334]
[null,null,null,null,null,0.34232486508038096,1259,0.34,560283.10667705955]
[null,null,null,null,null,0.3421168460142725,1260,0.34,560387.39377137844]
[null,null,null,null,null,0.34190899197719071,1261,0.34,560491.41054820875]
[null,null,null,null,null,0.34170130270749643,1262,0.34,560595.15722191869]
[null,null,null,null,null,0.34149377794417113,1263,0.34,560698.63400653459]
[null,null,null,null,null,0.34128641742681753,1264,0.34,560801.84111574653]
[null,null,null,null,null,0.34107922089565523,1265,0.34,560904.77876290504]
[null,null,null,null,null,0.3408721880915202,1266,0.34,561007.44716102397]
[null,null,null,null,null,0.34066531875586148,1267,0.34,561109.84652277944]
[null,null,null,null,null,0.34045861263074095,1268,0.34,561211.97706051334]
[null,null,null,null,null,0.34025206945883024,1269,0.34,561313.83898623229]
[null,null,null,null,null,0.34004568898340892,1270,0.34,561415.43251160812]
[null,null,null,null,null,0.33983947094836275,1271,0.34,561516.75784797978]
[null,null,null,null,null,0.33963341509818212,1272,0.34,561617.81520635402]
[null,null,null,null,null,0.33942752117795916,1273,0.34,561718.60479740473]
[null,null,null,null,null,0.33922178893338728,1274,0.34,561819.12683147599]
[null,null,null,null,null,0.33901621811075788,1275,0.34,561919.38151858118]
[null,null,null,null,null,0.33881080845695921,1276,0.34,562019.36906840396]
[null,null,null,null,null,0.33860555971947459,1277,0.34,562119.0896902997]
[null,null,null,null,null,0.33840047164637999,1278,0.34,562218.54359329573]
[null,null,null,null,null,0.33819554398634288,1279,0.34,562317.73098609224]
[null,null,null,null,null,0.33799077648862008,1280,0.34,562416.6520770638]
[null,null,null,null,null,{"$f":"-0.262*LN(G1371)+2.2125","v":0.33778616890305546},1281,0.34,{"$f":"$H$88*F1371*1000*G1371","v":562515.30707425834}]
[null,null,null,null,null,0.33758172098007866,1282,0.34,562613.69618539908]
[null,null,null,null,null,0.33737743247070306,1283,0.34,562711.81961788563]
[null,null,null,null,null,0.33717330312652427,1284,0.34,562809.6775787943]
[null,null,null,null,null,0.33696933269971785,1285,0.34,562907.27027487871]
[null,null,null,null,null,0.33676552094303802,1286,0.34,563004.59791257104]
[null,null,null,null,null,0.33656186760981455,1287,0.34,563101.66069798067]
[null,null,null,null,null,0.33635837245395339,1288,0.34,563198.45883689949]
[null,null,null,null,null,0.33615503522993273,1289,0.34,563294.99253479834]
[null,null,null,null,null,0.33595185569280184,1290,0.34,563391.26199682872]
[null,null,null,null,null,0.33574883359817953,1291,0.34,563487.26742782467]
[null,null,null,null,null,0.3355459687022524,1292,0.34,563583.00903230312]
[null,null,null,null,null,0.33534326076177323,1293,0.34,563678.48701446468]
[null,null,null,null,null,0.33514070953405839,1294,0.34,563773.70157819299]
[null,null,null,null,null,0.33493831477698666,1295,0.34,563868.65292705712]
[null,null,null,null,null,0.33473607624899815,1296,0.34,563963.34126431204]
[null,null,null,null,null,0.33453399370909143,1297,0.34,564057.76679289911]
[null,null,null,null,null,0.3343320669168226,1298,0.34,564151.92971544643]
[null,null,null,null,null,0.33413029563230268,1299,0.34,564245.8302342695]
[null,null,null,null,null,0.33392867961619732,1300,0.34,564339.46855137346]
[null,null,null,null,null,0.33372721862972354,1301,0.34,564432.84486845147]
[null,null,null,null,null,0.33352591243464902,1302,0.34,564525.95938688691]
[null,null,null,null,null,0.33332476079329032,1303,0.34,564618.81230775453]
[null,null,null,null,null,0.33312376346851091,1304,0.34,564711.40383181977]
[null,null,null,null,null,0.33292292022371983,1305,0.34,564803.73415954073]
[null,null,null,null,null,0.33272223082286922,1306,0.34,564895.80349106737]
[null,null,null,null,null,0.3325216950304537,1307,0.34,564987.61202624394]
[null,null,null,null,null,0.3323213126115081,1308,0.34,565079.15996460838]
[null,null,null,null,null,0.33212108333160595,1309,0.34,565170.44750539388]
[null,null,null,null,null,0.33192100695685811,1310,0.34,565261.47484752932]
[null,null,null,null,null,0.33172108325391036,1311,0.34,565352.24218963948]
[null,null,null,null,null,0.33152131198994295,1312,0.34,565442.74973004672]
[null,null,null,null,null,0.33132169293266722,1313,0.34,565532.99766676978]
[null,null,null,null,null,0.33112222585032636,1314,0.34,565622.9861975275]
[null,null,null,null,null,0.33092291051169109,1315,0.34,565712.71551973606]
[null,null,null,null,null,0.33072374668606108,1316,0.34,565802.18583051325]
[null,null,null,null,null,0.33052473414326022,1317,0.34,565891.39732667583]
[null,null,null,null,null,0.33032587265363733,1318,0.34,565980.35020474216]
[null,null,null,null,null,0.33012716198806347,1319,0.34,566069.0446609325]
[null,null,null,null,null,0.32992860191793061,1320,0.34,566157.48089116893]
[null,null,null,null,null,0.32973019221515054,1321,0.34,566245.65909107809]
[null,null,null,null,null,0.32953193265215242,1322,0.34,566333.57945598918]
[null,null,null,null,null,0.32933382300188141,1323,0.34,566421.24218093592]
[null,null,null,null,null,0.32913586303779807,1324,0.34,566508.6474606581]
[null,null,null,null,null,0.32893805253387542,1325,0.34,566595.79548960051]
[null,null,null,null,null,0.32874039126459809,1326,0.34,566682.6864619141]
[null,null,null,null,null,0.3285428790049616,1327,0.34,566769.32057145925]
[null,null,null,null,null,0.32834551553046865,1328,0.34,566855.69801180111]
[null,null,null,null,null,0.32814830061712952,1329,0.34,566941.81897621474]
[null,null,null,null,null,0.32795123404146032,1330,0.34,567027.68365768495]
[null,null,null,null,null,0.32775431558048052,1331,0.34,567113.2922489054]
[null,null,null,null,null,0.32755754501171208,1332,0.34,567198.6449422806]
[null,null,null,null,null,0.32736092211317813,1333,0.34,567283.74192992633]
[null,null,null,null,null,0.32716444666340072,1334,0.34,567368.58340366953]
[null,null,null,null,null,0.32696811844140017,1335,0.34,567453.16955505009]
[null,null,null,null,null,0.32677193722669307,1336,0.34,567537.50057532045]
[null,null,null,null,null,0.32657590279929072,1337,0.34,567621.57665544725]
[null,null,null,null,null,0.32638001493969848,1338,0.34,567705.39798611158]
[null,null,null,null,null,0.32618427342891265,1339,0.34,567788.96475770825]
[null,null,null,null,null,0.32598867804842113,1340,0.34,567872.27716034965]
[null,null,null,null,null,0.3257932285802001,1341,0.34,567955.33538386284]
[null,null,null,null,null,0.32559792480671335,1342,0.34,568038.1396177921]
[null,null,null,null,null,0.3254027665109116,1343,0.34,568120.69005140057]
[null,null,null,null,null,0.32520775347622899,1344,0.34,568202.98687366734]
[null,null,null,null,null,{"$f":"-0.262*LN(G1435)+2.2125","v":0.32501288548658369},1345,0.34,{"$f":"$H$88*F1435*1000*G1435","v":568285.03027329163}]
[null,null,null,null,null,0.3248181623263755,1346,0.34,568366.82043869188]
[null,null,null,null,null,0.3246235837804845,1347,0.34,568448.35755800642]
[null,null,null,null,null,0.32442914963426972,1348,0.34,568529.64181909431]
[null,null,null,null,null,0.3242348596735678,1349,0.34,568610.67340953578]
[null,null,null,null,null,0.32404071368469123,1350,0.34,568691.45251663309]
[null,null,null,null,null,0.32384671145442767,1351,0.34,568771.97932741127]
[null,null,null,null,null,0.32365285277003752,1352,0.34,568852.25402861799]
[null,null,null,null,null,0.32345913741925347,1353,0.34,568932.27680672496]
[null,null,null,null,null,0.32326556519027805,1354,0.34,569012.04784792743]
[null,null,null,null,null,0.32307213587178385,1355,0.34,569091.5673381472]
[null,null,null,null,null,0.32287884925291066,1356,0.34,569170.83546303096]
[null,null,null,null,null,0.32268570512326411,1357,0.34,569249.85240795021]
[null,null,null,null,null,0.32249270327291568,1358,0.34,569328.61835800542]
[null,null,null,null,null,0.32229984349240026,1359,0.34,569407.13349802361]
[null,null,null,null,null,0.32210712557271437,1360,0.34,569485.39801255905]
[null,null,null,null,null,0.32191454930531571,1361,0.34,569563.41208589508]
[null,null,null,null,null,0.32172211448212207,1362,0.34,569641.17590204533]
[null,null,null,null,null,0.32152982089550819,1363,0.34,569718.68964475102]
[null,null,null,null,null,0.3213376683383069,1364,0.34,569795.95349748584]
[null,null,null,null,null,0.32114565660380601,1365,0.34,569872.96764345374]
[null,null,null,null,null,0.32095378548574716,1366,0.34,569949.73226558976]
[null,null,null,null,null,0.3207620547783252,1367,0.34,570026.24754656176]
[null,null,null,null,null,0.32057046427618596,1368,0.34,570102.51366876916]
[null,null,null,null,null,0.32037901377442624,1369,0.34,570178.53081434639]
[null,null,null,null,null,0.32018770306859112,1370,0.34,570254.29916516086]
[null,null,null,null,null,0.31999653195467359,1371,0.34,570329.81890281476]
[null,null,null,null,null,0.31980550022911225,1372,0.34,570405.09020864463]
[null,null,null,null,null,0.31961460768879135,1373,0.34,570480.11326372367]
[null,null,null,null,null,0.31942385413103858,1374,0.34,570554.88824886119]
[null,null,null,null,null,0.31923323935362391,1375,0.34,570629.41534460278]
[null,null,null,null,null,0.3190427631547581,1376,0.34,570703.69473123131]
[null,null,null,null,null,0.31885242533309244,1377,0.34,570777.72658876877]
[null,null,null,null,null,0.31866222568771563,1378,0.34,570851.51109697379]
[null,null,null,null,null,0.3184721640181547,1379,0.34,570925.04843534599]
[null,null,null,null,null,0.31828224012437234,1380,0.34,570998.338783124]
[null,null,null,null,null,0.31809245380676532,1381,0.34,571071.38231928577]
[null,null,null,null,null,0.31790280486616451,1382,0.34,571144.17922255117]
[null,null,null,null,null,0.31771329310383312,1383,0.34,571216.72967138153]
[null,null,null,null,null,0.31752391832146487,1384,0.34,571289.03384397959]
[null,null,null,null,null,0.31733468032118273,1385,0.34,571361.09191828954]
[null,null,null,null,null,0.31714557890553952,1386,0.34,571432.90407200111]
[null,null,null,null,null,0.31695661387751395,1387,0.34,571504.47048254544]
[null,null,null,null,null,0.31676778504051128,1388,0.34,571575.79132709862]
[null,null,null,null,null,0.31657909219836178,1389,0.34,571646.8667825819]
[null,null,null,null,null,0.31639053515531868,1390,0.34,571717.69702566089]
[null,null,null,null,null,0.31620211371605778,1391,0.34,571788.2822327473]
[null,null,null,null,null,0.3160138276856761,1392,0.34,571858.6225799995]
[null,null,null,null,null,0.31582567686969076,1393,0.34,571928.71824332303]
[null,null,null,null,null,0.31563766107403679,1394,0.34,571998.56939836952]
[null,null,null,null,null,0.31544978010506775,1395,0.34,572068.17622054042]
[null,null,null,null,null,0.31526203376955264,1396,0.34,572137.53888498421]
[null,null,null,null,null,0.31507442187467594,1397,0.34,572206.65756659897]
[null,null,null,null,null,0.31488694422803598,1398,0.34,572275.53244003269]
[null,null,null,null,null,0.31469960063764368,1399,0.34,572344.16367968253]
[null,null,null,null,null,0.31451239091192229,1400,0.34,572412.55145969859]
[null,null,null,null,null,0.31432531485970405,1401,0.34,572480.69595397904]
[null,null,null,null,null,0.31413837229023156,1402,0.34,572548.59733617597]
[null,null,null,null,null,0.31395156301315508,1403,0.34,572616.25577969349]
[null,null,null,null,null,0.31376488683853165,1404,0.34,572683.67145768797]
[null,null,null,null,null,0.31357834357682424,1405,0.34,572750.84454306948]
[null,null,null,null,null,0.31339193303889989,1406,0.34,572817.77520850126]
[null,null,null,null,null,0.31320565503602982,1407,0.34,572884.46362640208]
[null,null,null,null,null,0.3130195093798871,1408,0.34,572950.90996894531]
[null,null,null,null,null,{"$f":"-0.262*LN(G1499)+2.2125","v":0.31283349588254561},1409,0.34,{"$f":"$H$88*F1499*1000*G1499","v":573017.11440805881}]
[null,null,null,null,null,0.31264761435647959,1410,0.34,573083.077115427]
[null,null,null,null,null,0.31246186461456249,1411,0.34,573148.79826249194]
[null,null,null,null,null,0.3122762464700648,1412,0.34,573214.27802045096]
[null,null,null,null,null,0.31209075973665357,1413,0.34,573279.51656025893]
[null,null,null,null,null,0.31190540422839219,1414,0.34,573344.51405263052]
[null,null,null,null,null,0.31172017975973731,1415,0.34,573409.27066803689]
[null,null,null,null,null,0.31153508614553971,1416,0.34,573473.78657670948]
[null,null,null,null,null,0.31135012320104161,1417,0.34,573538.06194863876]
[null,null,null,null,null,0.31116529074187671,1418,0.34,573602.0969535755]
[null,null,null,null,null,0.31098058858406863,1419,0.34,573665.89176103147]
[null,null,null,null,null,0.31079601654402955,1420,0.34,573729.4465402785]
[null,null,null,null,null,0.31061157443855958,1421,0.34,573792.76146035106]
[null,null,null,null,null,0.31042726208484517,1422,0.34,573855.83669004485]
[null,null,null,null,null,0.31024307930045847,1423,0.34,573918.67239791807]
[null,null,null,null,null,0.31005902590335643,1424,0.34,573981.26875229343]
[null,null,null,null,null,0.30987510171187904,1425,0.34,574043.62592125603]
[null,null,null,null,null,0.30969130654474863,1426,0.34,574105.7440726551]
[null,null,null,null,null,0.30950764022106858,1427,0.34,574167.62337410427]
[null,null,null,null,null,0.30932410256032306,1428,0.34,574229.26399298373]
[null,null,null,null,null,0.3091406933823746,1429,0.34,574290.66609643726]
[null,null,null,null,null,0.30895741250746411,1430,0.34,574351.82985137578]
[null,null,null,null,null,0.30877425975620976,1431,0.34,574412.75542447704]
[null,null,null,null,null,0.30859123494960494,1432,0.34,574473.44298218458]
[null,null,null,null,null,0.30840833790901878,1433,0.34,574533.89269071107]
[null,null,null,null,null,0.30822556845619364,1434,0.34,574594.10471603624]
[null,null,null,null,null,0.30804292641324471,1435,0.34,574654.07922390802]
[null,null,null,null,null,0.30786041160265953,1436,0.34,574713.81637984479]
[null,null,null,null,null,0.30767802384729537,1437,0.34,574773.31634913245]
[null,null,null,null,null,0.30749576297037984,1438,0.34,574832.57929682813]
[null,null,null,null,null,0.30731362879550939,1439,0.34,574891.60538775939]
[null,null,null,null,null,0.30713162114664772,1440,0.34,574950.39478652459]
[null,null,null,null,null,0.30694973984812512,1441,0.34,575008.94765749283]
[null,null,null,null,null,0.3067679847246374,1442,0.34,575067.2641648053]
[null,null,null,null,null,0.30658635560124559,1443,0.34,575125.34447237663]
[null,null,null,null,null,0.30640485230337378,1444,0.34,575183.18874389329]
[null,null,null,null,null,0.30622347465680821,1445,0.34,575240.79714281426]
[null,null,null,null,null,0.30604222248769775,1446,0.34,575298.1698323742]
[null,null,null,null,null,0.30586109562255115,1447,0.34,575355.30697558098]
[null,null,null,null,null,0.30568009388823647,1448,0.34,575412.20873521629]
[null,null,null,null,null,0.30549921711198103,1449,0.34,575468.87527383864]
[null,null,null,null,null,0.3053184651213694,1450,0.34,575525.30675378127]
[null,null,null,null,null,0.30513783774434255,1451,0.34,575581.50333715335]
[null,null,null,null,null,0.30495733480919762,1452,0.34,575637.46518584155]
[null,null,null,null,null,0.30477695614458589,1453,0.34,575693.19246150821]
[null,null,null,null,null,0.30459670157951213,1454,0.34,575748.6853255938]
[null,null,null,null,null,0.30441657094333441,1455,0.34,575803.94393931702]
[null,null,null,null,null,0.30423656406576249,1456,0.34,575858.96846367524]
[null,null,null,null,null,0.3040566807768561,1457,0.34,575913.75905944314]
[null,null,null,null,null,0.30387692090702578,1458,0.34,575968.31588717666]
[null,null,null,null,null,0.30369728428703002,1459,0.34,576022.63910720986]
[null,null,null,null,null,0.3035177707479757,1460,0.34,576076.72887965792]
[null,null,null,null,null,0.30333838012131653,1461,0.34,576130.58536441647]
[null,null,null,null,null,0.30315911223885217,1462,0.34,576184.20872116252]
[null,null,null,null,null,0.30297996693272733,1463,0.34,576237.59910935408]
[null,null,null,null,null,0.30280094403543067,1464,0.34,576290.75668823172]
[null,null,null,null,null,0.30262204337979393,1465,0.34,576343.6816168176]
[null,null,null,null,null,0.30244326479899142,1466,0.34,576396.37405391783]
[null,null,null,null,null,0.30226460812653877,1467,0.34,576448.83415812219]
[null,null,null,null,null,0.3020860731962911,1468,0.34,576501.06208780198]
[null,null,null,null,null,0.30190765984244394,1469,0.34,576553.05800111522]
[null,null,null,null,null,0.30172936789953098,1470,0.34,576604.82205600373]
[null,null,null,null,null,0.30155119720242318,1471,0.34,576656.35441019386]
[null,null,null,null,null,0.3013731475863286,1472,0.34,576707.65522119845]
[null,null,null,null,null,{"$f":"-0.262*LN(G1563)+2.2125","v":0.30119521888679057},1473,0.34,{"$f":"$H$88*F1563*1000*G1563","v":576758.72464631521}]
[null,null,null,null,null,0.30101741093968792,1474,0.34,576809.56284262997]
[null,null,null,null,null,0.30083972358123279,1475,0.34,576860.16996701388]
[null,null,null,null,null,0.30066215664797036,1476,0.34,576910.54617612553]
[null,null,null,null,null,0.30048470997677823,1477,0.34,576960.69162641186]
[null,null,null,null,null,0.30030738340486529,1478,0.34,577010.60647410818]
[null,null,null,null,null,0.30013017676977016,1479,0.34,577060.2908752372]
[null,null,null,null,null,0.29995308990936165,1480,0.34,577109.74498561188]
[null,null,null,null,null,0.29977612266183651,1481,0.34,577158.96896083385]
[null,null,null,null,null,0.29959927486571947,1482,0.34,577207.96295629512]
[null,null,null,null,null,0.29942254635986165,1483,0.34,577256.72712717729]
[null,null,null,null,null,0.29924593698344037,1484,0.34,577305.26162845327]
[null,null,null,null,null,0.29906944657595824,1485,0.34,577353.56661488744]
[null,null,null,null,null,0.29889307497724116,1486,0.34,577401.64224103442]
[null,null,null,null,null,0.29871682202743921,1487,0.34,577449.48866124277]
[null,null,null,null,null,0.29854068756702423,1488,0.34,577497.10602965171]
[null,null,null,null,null,0.29836467143678935,1489,0.34,577544.49450019316]
[null,null,null,null,null,0.29818877347784944,1490,0.34,577591.65422659437]
[null,null,null,null,null,0.29801299353163846,1491,0.34,577638.5853623749]
[null,null,null,null,null,0.29783733143990898,1492,0.34,577685.28806084755]
[null,null,null,null,null,0.29766178704473201,1493,0.34,577731.76247512037]
[null,null,null,null,null,0.29748636018849606,1494,0.34,577778.00875809696]
[null,null,null,null,null,0.29731105071390584,1495,0.34,577824.02706247603]
[null,null,null,null,null,0.29713585846398116,1496,0.34,577869.81754075061]
[null,null,null,null,null,0.29696078328205711,1497,0.34,577915.38034521136]
[null,null,null,null,null,0.29678582501178274,1498,0.34,577960.71562794573]
[null,null,null,null,null,0.29661098349711934,1499,0.34,578005.82354083646]
[null,null,null,null,null,0.29643625858234079,1500,0.34,578050.70423556457]
[null,null,null,null,null,0.29626165011203276,1501,0.3,578095.35786360956]
[null,null,null,null,null,0.29608715793109086,1502,0.3,578139.78457624803]
[null,null,null,null,null,0.29591278188472048,1503,0.3,578183.98452455539]
[null,null,null,null,null,0.29573852181843607,1504,0.3,578227.95785940625]
[null,null,null,null,null,0.29556437757806009,1505,0.3,578271.70473147451]
[null,null,null,null,null,0.29539034900972205,1506,0.3,578315.22529123386]
[null,null,null,null,null,0.29521643595985791,1507,0.3,578358.5196889576]
[null,null,null,null,null,0.2950426382752096,1508,0.3,578401.58807472093]
[null,null,null,null,null,0.29486895580282324,1509,0.3,578444.43059839832]
[null,null,null,null,null,0.29469538839004961,1510,0.3,578487.04740966728]
[null,null,null,null,null,0.2945219358845419,1511,0.3,578529.43865800556]
[null,null,null,null,null,0.29434859813425662,1512,0.3,578571.60449269472]
[null,null,null,null,null,0.29417537498745072,1513,0.3,578613.54506281682]
[null,null,null,null,null,0.29400226629268267,1514,0.3,578655.26051725808]
[null,null,null,null,null,0.29382927189881092,1515,0.3,578696.75100470812]
[null,null,null,null,null,0.2936563916549928,1516,0.3,578738.01667365979]
[null,null,null,null,null,0.29348362541068451,1517,0.3,578779.05767241097]
[null,null,null,null,null,0.29331097301563913,1518,0.3,578819.87414906221]
[null,null,null,null,null,0.29313843431990727,1519,0.3,578860.46625152091]
[null,null,null,null,null,0.29296600917383531,1520,0.3,578900.83412749856]
[null,null,null,null,null,0.29279369742806516,1521,0.3,578940.97792451328]
[null,null,null,null,null,0.29262149893353229,1522,0.3,578980.89778988704]
[null,null,null,null,null,0.29244941354146747,1523,0.3,579020.59387075144]
[null,null,null,null,null,0.29227744110339282,1524,0.3,579060.06631404185]
[null,null,null,null,null,0.29210558147112353,1525,0.3,579099.31526650244]
[null,null,null,null,null,0.29193383449676635,1526,0.3,579138.34087468521]
[null,null,null,null,null,0.29176220003271802,1527,0.3,579177.14328494854]
[null,null,null,null,null,0.29159067793166571,1528,0.3,579215.72264346073]
[null,null,null,null,null,0.29141926804658547,1529,0.3,579254.07909619785]
[null,null,null,null,null,0.29124797023074178,1530,0.3,579292.21278894541]
[null,null,null,null,null,0.29107678433768669,1531,0.3,579330.12386729789]
[null,null,null,null,null,0.29090571022125933,1532,0.3,579367.81247666012]
[null,null,null,null,null,0.29073474773558439,1533,0.3,579405.27876224613]
[null,null,null,null,null,0.29056389673507299,1534,0.3,579442.52286908263]
[null,null,null,null,null,0.29039315707442004,1535,0.3,579479.54494200519]
[null,null,null,null,null,0.29022252860860398,1536,0.3,579516.34512566053]
[null,null,null,null,null,{"$f":"-0.262*LN(G1627)+2.2125","v":0.2900520111928877},1537,0.3,{"$f":"$H$88*F1627*1000*G1627","v":579552.92356450902}]
[null,null,null,null,null,0.28988160468281565,1538,0.3,579589.28040282161]
[null,null,null,null,null,0.28971130893421337,1539,0.3,579625.41578468075]
[null,null,null,null,null,0.28954112380318908,1540,0.3,579661.32985398453]
[null,null,null,null,null,0.28937104914612966,1541,0.3,579697.02275444148]
[null,null,null,null,null,0.28920108481970197,1542,0.3,579732.49462957459]
[null,null,null,null,null,0.28903123068085179,1543,0.3,579767.74562272057]
[null,null,null,null,null,0.28886148658680266,1544,0.3,579802.77587703033]
[null,null,null,null,null,0.28869185239505635,1545,0.3,579837.58553547063]
[null,null,null,null,null,0.28852232796338972,1546,0.3,579872.17474082066]
[null,null,null,null,null,0.28835291314985656,1547,0.3,579906.5436356765]
[null,null,null,null,null,0.28818360781278551,1548,0.3,579940.6923624496]
[null,null,null,null,null,0.28801441181078036,1549,0.3,579974.62106336839]
[null,null,null,null,null,0.28784532500271709,1550,0.3,580008.32988047495]
[null,null,null,null,null,0.2876763472477466,1551,0.3,580041.81895563146]
[null,null,null,null,null,0.28750747840529067,1552,0.3,580075.08843051444]
[null,null,null,null,null,0.28733871833504376,1553,0.3,580108.13844661985]
[null,null,null,null,null,0.28717006689697055,1554,0.3,580140.96914525994]
[null,null,null,null,null,0.28700152395130618,1555,0.3,580173.58066756546]
[null,null,null,null,null,0.28683308935855556,1556,0.3,580205.97315448616]
[null,null,null,null,null,0.28666476297949228,1557,0.3,580238.14674679039]
[null,null,null,null,null,0.28649654467515817,1558,0.3,580270.10158506536]
[null,null,null,null,null,0.28632843430686239,1559,0.3,580301.8378097181]
[null,null,null,null,null,0.286160431736181,1560,0.3,580333.35556097503]
[null,null,null,null,null,0.28599253682495651,1561,0.3,580364.65497888427]
[null,null,null,null,null,0.28582474943529634,1562,0.3,580395.73620331276]
[null,null,null,null,null,0.28565706942957281,1563,0.3,580426.59937394911]
[null,null,null,null,null,0.28548949667042267,1564,0.3,580457.24463030335]
[null,null,null,null,null,0.28532203102074538,1565,0.3,580487.67211170646]
[null,null,null,null,null,0.28515467234370373,1566,0.3,580517.881957312]
[null,null,null,null,null,0.2849874205027223,1567,0.3,580547.87430609553]
[null,null,null,null,null,0.28482027536148724,1568,0.3,580577.64929685555]
[null,null,null,null,null,0.28465323678394538,1569,0.3,580607.20706821349]
[null,null,null,null,null,0.28448630463430313,1570,0.3,580636.54775861278]
[null,null,null,null,null,0.28431947877702712,1571,0.3,580665.67150632245]
[null,null,null,null,null,0.28415275907684201,1572,0.3,580694.57844943437]
[null,null,null,null,null,0.28398614539873113,1573,0.3,580723.26872586529]
[null,null,null,null,null,0.28381963760793449,1574,0.3,580751.74247335561]
[null,null,null,null,null,0.2836532355699497,1575,0.3,580779.99982947204]
[null,null,null,null,null,0.28348693915052969,1576,0.3,580808.04093160527]
[null,null,null,null,null,0.28332074821568365,1577,0.3,580835.8659169731]
[null,null,null,null,null,0.28315466263167521,1578,0.3,580863.47492261848]
[null,null,null,null,null,0.28298868226502161,1579,0.3,580890.86808540986]
[null,null,null,null,null,0.28282280698249451,1580,0.3,580918.04554204375]
[null,null,null,null,null,0.28265703665111808,1581,0.3,580945.00742904306]
[null,null,null,null,null,0.28249137113816891,1582,0.3,580971.7538827582]
[null,null,null,null,null,0.28232581031117454,1583,0.3,580998.28503936611]
[null,null,null,null,null,0.28216035403791451,1584,0.3,581024.60103487363]
[null,null,null,null,null,0.28199500218641815,1585,0.3,581050.70200511452]
[null,null,null,null,null,0.28182975462496396,1586,0.3,581076.58808575058]
[null,null,null,null,null,0.28166461122208064,1587,0.3,581102.25941227458]
[null,null,null,null,null,0.28149957184654473,1588,0.3,581127.71612000698]
[null,null,null,null,null,0.2813346363673801,1589,0.3,581152.95834409713]
[null,null,null,null,null,0.2811698046538591,1590,0.3,581177.98621952673]
[null,null,null,null,null,0.28100507657549967,1591,0.3,581202.79988110601]
[null,null,null,null,null,0.28084045200206575,1592,0.3,581227.39946347522]
[null,null,null,null,null,0.28067593080356712,1593,0.3,581251.78510110721]
[null,null,null,null,null,0.28051151285025777,1594,0.3,581275.95692830416]
[null,null,null,null,null,0.28034719801263619,1595,0.3,581299.91507920111]
[null,null,null,null,null,0.28018298616144421,1596,0.3,581323.65968776448]
[null,null,null,null,null,0.2800188771676666,1597,0.3,581347.19088779273]
[null,null,null,null,null,0.27985487090253014,1598,0.3,581370.50881291612]
[null,null,null,null,null,0.27969096723750386,1599,0.3,581393.6135965992]
[null,null,null,null,null,0.27952716604429728,1600,0.3,581416.50537213834]
[null,null,null,null,null,{"$f":"-0.262*LN(G1691)+2.2125","v":0.2793634671948606},1601,0.3,{"$f":"$H$88*F1691*1000*G1691","v":581439.18427266343}]
[null,null,null,null,null,0.27919987056138407,1602,0.3,581461.65043113846]
[null,null,null,null,null,0.27903637601629705,1603,0.3,581483.90398036153]
[null,null,null,null,null,0.27887298343226719,1604,0.3,581505.94505296357]
[null,null,null,null,null,0.27870969268220147,1605,0.3,581527.77378141333]
[null,null,null,null,null,0.27854650363924249,1606,0.3,581549.39029801055]
[null,null,null,null,null,0.27838341617677154,1607,0.3,581570.79473489337]
[null,null,null,null,null,0.27822043016840481,1608,0.3,581591.98722403345]
[null,null,null,null,null,0.27805754548799544,1609,0.3,581612.96789723996]
[null,null,null,null,null,0.27789476200963037,1610,0.3,581633.73688615637]
[null,null,null,null,null,0.27773207960763258,1611,0.3,581654.29432226496]
[null,null,null,null,null,0.27756949815655751,1612,0.3,581674.64033688197]
[null,null,null,null,null,0.27740701753119512,1613,0.3,581694.775061163]
[null,null,null,null,null,0.27724463760656759,1614,0.3,581714.69862610009]
[null,null,null,null,null,0.2770823582579296,1615,0.3,581734.41116252309]
[null,null,null,null,null,0.27692017936076718,1616,0.3,581753.91280109971]
[null,null,null,null,null,0.27675810079079799,1617,0.3,581773.20367233641]
[null,null,null,null,null,0.27659612242396947,1618,0.3,581792.28390657739]
[null,null,null,null,null,0.27643424413645934,1619,0.3,581811.15363400604]
[null,null,null,null,null,0.27627246580467535,1620,0.3,581829.8129846463]
[null,null,null,null,null,0.27611078730525263,1621,0.3,581848.26208835887]
[null,null,null,null,null,0.27594920851505589,1622,0.3,581866.50107484683]
[null,null,null,null,null,0.27578772931117701,1623,0.3,581884.53007365239]
[null,null,null,null,null,0.27562634957093457,1624,0.3,581902.34921415697]
[null,null,null,null,null,0.2754650691718743,1625,0.3,581919.95862558449]
[null,null,null,null,null,0.27530388799176797,1626,0.3,581937.35843699914]
[null,null,null,null,null,0.27514280590861184,1627,0.3,581954.54877730494]
[null,null,null,null,null,0.27498182280062866,1628,0.3,581971.52977525047]
[null,null,null,null,null,0.27482093854626388,1629,0.3,581988.3015594231]
[null,null,null,null,null,0.27466015302418811,1630,0.3,582004.86425825465]
[null,null,null,null,null,0.27449946611329423,1631,0.3,582021.21800001781]
[null,null,null,null,null,0.27433887769269805,1632,0.3,582037.36291282822]
[null,null,null,null,null,0.27417838764173807,1633,0.3,582053.29912464577]
[null,null,null,null,null,0.27401799583997333,1634,0.3,582069.02676327142]
[null,null,null,null,null,0.27385770216718508,1635,0.3,582084.54595635191]
[null,null,null,null,null,0.27369750650337443,1636,0.3,582099.85683137667]
[null,null,null,null,null,0.27353740872876253,1637,0.3,582114.95951567951]
[null,null,null,null,null,0.27337740872378991,1638,0.3,582129.85413643834]
[null,null,null,null,null,0.27321750636911646,1639,0.3,582144.54082067637]
[null,null,null,null,null,0.27305770154561992,1640,0.3,582159.01969526173]
[null,null,null,null,null,0.27289799413439586,1641,0.3,582173.29088690667]
[null,null,null,null,null,0.2727383840167581,1642,0.3,582187.3545221719]
[null,null,null,null,null,0.27257887107423562,1643,0.3,582201.21072745987]
[null,null,null,null,null,0.27241945518857502,1644,0.3,582214.85962902254]
[null,null,null,null,null,0.27226013624173806,1645,0.3,582228.30135295691]
[null,null,null,null,null,0.27210091411590187,1646,0.3,582241.53602520691]
[null,null,null,null,null,0.27194178869345809,1647,0.3,582254.56377156312]
[null,null,null,null,null,0.27178275985701239,1648,0.3,582267.3847176634]
[null,null,null,null,null,0.27162382748938496,1649,0.3,582279.99898899463]
[null,null,null,null,null,0.27146499147360781,1650,0.3,582292.40671088872]
[null,null,null,null,null,0.2713062516929261,1651,0.3,582304.60800852743]
[null,null,null,null,null,0.27114760803079796,1652,0.3,582316.60300694173]
[null,null,null,null,null,0.27098906037089154,1653,0.3,582328.39183100883]
[null,null,null,null,null,0.27083060859708707,1654,0.3,582339.97460545658]
[null,null,null,null,null,0.27067225259347505,1655,0.3,582351.35145486158]
[null,null,null,null,null,0.27051399224435602,1656,0.3,582362.5225036497]
[null,null,null,null,null,0.27035582743424036,1657,0.3,582373.48787609721]
[null,null,null,null,null,0.27019775804784674,1658,0.3,582384.24769632879]
[null,null,null,null,null,0.27003978397010342,1659,0.3,582394.80208832212]
[null,null,null,null,null,0.26988190508614562,1660,0.3,582405.15117590223]
[null,null,null,null,null,0.26972412128131662,1661,0.3,582415.29508274712]
[null,null,null,null,null,0.26956643244116663,1662,0.3,582425.23393238476]
[null,null,null,null,null,0.2694088384514528,1663,0.3,582434.96784819581]
[null,null,null,null,null,0.26925133919813748,1664,0.3,582444.49695341103]
[null,null,null,null,null,{"$f":"-0.262*LN(G1755)+2.2125","v":0.26909393456738928},1665,0.3,{"$f":"$H$88*F1755*1000*G1755","v":582453.82137111411}]
[null,null,null,null,null,0.26893662444558153,1666,0.3,582462.94122424047]
[null,null,null,null,null,0.26877940871929185,1667,0.3,582471.85663557739]
[null,null,null,null,null,0.26862228727530235,1668,0.3,582480.56772776565]
[null,null,null,null,null,0.26846526000059923,1669,0.3,582489.07462330023]
[null,null,null,null,null,0.26830832678237004,1670,0.3,582497.37744452548]
[null,null,null,null,null,0.26815148750800688,1671,0.3,582505.47631364339]
[null,null,null,null,null,0.26799474206510232,1672,0.3,582513.37135270645]
[null,null,null,null,null,0.26783809034145212,1673,0.3,582521.06268362422]
[null,null,null,null,null,0.26768153222505164,1674,0.3,582528.55042815744]
[null,null,null,null,null,0.26752506760409811,1675,0.3,582535.8347079237]
[null,null,null,null,null,0.26736869636698835,1676,0.3,582542.91564439423]
[null,null,null,null,null,0.26721241840231902,1677,0.3,582549.79335889569]
[null,null,null,null,null,0.26705623359888619,1678,0.3,582556.46797261038]
[null,null,null,null,null,0.26690014184568422,1679,0.3,582562.93960657495]
[null,null,null,null,null,0.26674414303190597,1680,0.3,582569.20838168263]
[null,null,null,null,null,0.26658823704694257,1681,0.3,582575.27441868361]
[null,null,null,null,null,0.26643242378038168,1682,0.3,582581.13783818251]
[null,null,null,null,null,0.26627670312200857,1683,0.3,582586.79876064265]
[null,null,null,null,null,0.26612107496180459,1684,0.3,582592.25730638264]
[null,null,null,null,null,0.2659655391899467,1685,0.3,582597.51359557838]
[null,null,null,null,null,0.26581009569680791,1686,0.3,582602.56774826359]
[null,null,null,null,null,0.26565474437295622,1687,0.3,582607.41988433024]
[null,null,null,null,null,0.26549948510915322,1688,0.3,582612.0701235258]
[null,null,null,null,null,0.26534431779635637,1689,0.3,582616.51858545968]
[null,null,null,null,null,0.2651892423257145,1690,0.3,582620.76538959483]
[null,null,null,null,null,0.26503425858857188,1691,0.3,582624.81065525766]
[null,null,null,null,null,0.26487936647646371,1692,0.3,582628.65450162953]
[null,null,null,null,null,0.26472456588111837,1693,0.3,582632.29704775347]
[null,null,null,null,null,0.2645698566944561,1694,0.3,582635.73841253121]
[null,null,null,null,null,0.26441523880858764,1695,0.3,582638.97871472279]
[null,null,null,null,null,0.26426071211581559,1696,0.3,582642.01807295019]
[null,null,null,null,null,0.26410627650863239,1697,0.3,582644.85660569393]
[null,null,null,null,null,0.26395193187972121,1698,0.3,582647.4944312966]
[null,null,null,null,null,0.26379767812195354,1699,0.3,582649.93166795885]
[null,null,null,null,null,0.26364351512839135,1700,0.3,582652.16843374481]
[null,null,null,null,null,0.26348944279228403,1701,0.3,582654.2048465776]
[null,null,null,null,null,0.26333546100706995,1702,0.3,582656.04102424299]
[null,null,null,null,null,0.26318156966637551,1703,0.3,582657.67708438868]
[null,null,null,null,null,0.26302776866401345,1704,0.3,582659.11314452265]
[null,null,null,null,null,0.2628740578939841,1705,0.3,582660.34932201589]
[null,null,null,null,null,0.26272043725047411,1706,0.3,582661.38573410152]
[null,null,null,null,null,0.26256690662785642,1707,0.3,582662.22249787615]
[null,null,null,null,null,0.2624134659206887,1708,0.3,582662.85973029723]
[null,null,null,null,null,0.26226011502371516,1709,0.3,582663.29754818801]
[null,null,null,null,null,0.26210685383186294,1710,0.3,582663.53606823122]
[null,null,null,null,null,0.26195368224024507,1711,0.3,582663.57540697721]
[null,null,null,null,null,0.26180060014415774,1712,0.3,582663.41568083747]
[null,null,null,null,null,0.26164760743908055,1713,0.3,582663.05700608855]
[null,null,null,null,null,0.26149470402067587,1714,0.3,582662.49949886999]
[null,null,null,null,null,0.26134188978478945,1715,0.3,582661.74327518814]
[null,null,null,null,null,0.26118916462744801,1716,0.3,582660.78845091094]
[null,null,null,null,null,0.26103652844486125,1717,0.3,582659.63514177478]
[null,null,null,null,null,0.26088398113341937,1718,0.3,582658.2834633789]
[null,null,null,null,null,0.26073152258969334,1719,0.3,582656.73353118775]
[null,null,null,null,null,0.26057915271043508,1720,0.3,582654.98546053283]
[null,null,null,null,null,0.26042687139257659,1721,0.3,582653.03936661163]
[null,null,null,null,null,0.26027467853322883,1722,0.3,582650.89536448615]
[null,null,null,null,null,0.2601225740296822,1723,0.3,582648.5535690852]
[null,null,null,null,null,0.2599705577794067,1724,0.3,582646.01409520628]
[null,null,null,null,null,0.25981862968004932,1725,0.3,582643.27705751057]
[null,null,null,null,null,0.25966678962943601,1726,0.3,582640.3425705285]
[null,null,null,null,null,0.25951503752557015,1727,0.3,582637.21074865758]
[null,null,null,null,null,0.25936337326663161,1728,0.3,582633.88170616131]
[null,null,null,null,null,{"$f":"-0.262*LN(G1819)+2.2125","v":0.25921179675097772},1729,0.3,{"$f":"$H$88*F1819*1000*G1819","v":582630.35555717268}]
[null,null,null,null,null,0.25906030787714185,1730,0.3,582626.63241569209]
[null,null,null,null,null,0.25890890654383303,1731,0.3,582622.71239558747]
[null,null,null,null,null,0.25875759264993614,1732,0.3,582618.59561059624]
[null,null,null,null,null,0.25860636609451104,1733,0.3,582614.28217432392]
[null,null,null,null,null,0.25845522677679234,1734,0.3,582609.77220024529]
[null,null,null,null,null,0.25830417459618826,1735,0.3,582605.06580170267]
[null,null,null,null,null,0.25815320945228226,1736,0.3,582600.16309191065]
[null,null,null,null,null,0.2580023312448303,1737,0.3,582595.06418395136]
[null,null,null,null,null,0.2578515398737613,1738,0.3,582589.76919077628]
[null,null,null,null,null,0.25770083523917764,1739,0.3,582584.27822520887]
[null,null,null,null,null,0.25755021724135307,1740,0.3,582578.59139994066]
[null,null,null,null,null,0.25739968578073436,1741,0.3,582572.70882753609]
[null,null,null,null,null,0.25724924075793831,1742,0.3,582566.63062042708]
[null,null,null,null,null,0.25709888207375431,1743,0.3,582560.35689091985]
[null,null,null,null,null,0.25694860962914157,1744,0.3,582553.88775118976]
[null,null,null,null,null,0.25679842332522962,1745,0.3,582547.22331328341]
[null,null,null,null,null,0.25664832306331853,1746,0.3,582540.36368912039]
[null,null,null,null,null,0.25649830874487711,1747,0.3,582533.30899049039]
[null,null,null,null,null,0.25634838027154383,1748,0.3,582526.05932905618]
[null,null,null,null,null,0.25619853754512611,1749,0.3,582518.61481635319]
[null,null,null,null,null,0.25604878046759927,1750,0.3,582510.97556378832]
[null,null,null,null,null,0.25589910894110668,1751,0.3,582503.14168264123]
[null,null,null,null,null,0.2557495228679596,1752,0.3,582495.11328406469]
[null,null,null,null,null,0.25560002215063649,1753,0.3,582486.89047908562]
[null,null,null,null,null,0.2554506066917821,1754,0.3,582478.4733786016]
[null,null,null,null,null,0.25530127639420885,1755,0.3,582469.86209338752]
[null,null,null,null,null,0.25515203116089347,1756,0.3,582461.05673408753]
[null,null,null,null,null,0.25500287089498053,1757,0.3,582452.05741122505]
[null,null,null,null,null,0.25485379549977782,1758,0.3,582442.8642351923]
[null,null,null,null,null,0.25470480487875968,1759,0.3,582433.47731625987]
[null,null,null,null,null,0.25455589893556407,1760,0.3,582423.89676457061]
[null,null,null,null,null,0.25440707757399394,1761,0.3,582414.12269014434]
[null,null,null,null,null,0.25425834069801523,1762,0.3,582404.15520287375]
[null,null,null,null,null,0.25410968821175794,1763,0.3,582393.994412528]
[null,null,null,null,null,0.25396112001951487,1764,0.3,582383.64042875147]
[null,null,null,null,null,0.25381263602574178,1765,0.3,582373.09336106456]
[null,null,null,null,null,0.25366423613505673,1766,0.3,582362.35331886332]
[null,null,null,null,null,0.25351592025223924,1767,0.3,582351.42041141877]
[null,null,null,null,null,0.25336768828223155,1768,0.3,582340.29474788101]
[null,null,null,null,null,0.25321954013013626,1769,0.3,582328.97643727425]
[null,null,null,null,null,0.25307147570121669,1770,0.3,582317.46558849956]
[null,null,null,null,null,0.25292349490089738,1771,0.3,582305.76231033611]
[null,null,null,null,null,0.25277559763476298,1772,0.3,582293.86671144003]
[null,null,null,null,null,0.25262778380855733,1773,0.3,582281.77890034381]
[null,null,null,null,null,0.25248005332818435,1774,0.3,582269.49898545875]
[null,null,null,null,null,0.25233240609970653,1775,0.3,582257.02707507287]
[null,null,null,null,null,0.25218484202934555,1776,0.3,582244.36327735311]
[null,null,null,null,null,0.25203736102348118,1777,0.3,582231.50770034397]
[null,null,null,null,null,0.25188996298865107,1778,0.3,582218.46045196813]
[null,null,null,null,null,0.25174264783155098,1779,0.3,582205.22164002794]
[null,null,null,null,null,0.25159541545903363,1780,0.3,582191.79137220385]
[null,null,null,null,null,0.25144826577810853,1781,0.3,582178.16975605476]
[null,null,null,null,null,0.25130119869594214,1782,0.3,582164.35689901968]
[null,null,null,null,null,0.25115421411985706,1783,0.3,582150.35290841677]
[null,null,null,null,null,0.2510073119573315,1784,0.3,582136.15789144323]
[null,null,null,null,null,0.25086049211600026,1785,0.3,582121.77195517858]
[null,null,null,null,null,0.25071375450365152,1786,0.3,582107.19520657812]
[null,null,null,null,null,0.25056709902822982,1787,0.3,582092.42775248073]
[null,null,null,null,null,0.25042052559783357,1788,0.3,582077.46969960444]
[null,null,null,null,null,0.25027403412071547,1789,0.3,582062.32115454797]
[null,null,null,null,null,0.25012762450528192,1790,0.3,582046.98222379107]
[null,null,null,null,null,0.24998129666009339,1791,0.3,582031.45301369543]
[null,null,null,null,null,0.24983505049386245,1792,0.3,582015.73363050201]
[null,null,null,null,null,{"$f":"-0.262*LN(G1883)+2.2125","v":0.24968888591545491},1793,0.3,{"$f":"$H$88*F1883*1000*G1883","v":581999.82418033388}]
[null,null,null,null,null,0.24954280283388952,1794,0.3,581983.72476919717]
[null,null,null,null,null,0.24939680115833651,1795,0.3,581967.43550297827]
[null,null,null,null,null,0.24925088079811775,1796,0.3,581950.95648744528]
[null,null,null,null,null,0.24910504166270742,1797,0.3,581934.28782825079]
[null,null,null,null,null,0.24895928366172981,1798,0.3,581917.42963092728]
[null,null,null,null,null,0.24881360670496,1799,0.3,581900.38200088998]
[null,null,null,null,null,0.24866801070232469,1800,0.3,581883.14504343981]
[null,null,null,null,null,0.24852249556389938,1801,0.3,581865.71886375768]
[null,null,null,null,null,0.24837706119990965,1802,0.3,581848.10356690839]
[null,null,null,null,null,0.24823170752073054,1803,0.3,581830.29925784026]
[null,null,null,null,null,0.24808643443688694,1804,0.3,581812.30604138726]
[null,null,null,null,null,0.24794124185905075,1805,0.3,581794.12402226252]
[null,null,null,null,null,0.24779612969804399,1806,0.3,581775.75330506777]
[null,null,null,null,null,0.24765109786483586,1807,0.3,581757.193994286]
[null,null,null,null,null,0.2475061462705439,1808,0.3,581738.44619428634]
[null,null,null,null,null,0.24736127482643266,1809,0.3,581719.51000932173]
[null,null,null,null,null,0.24721648344391367,1810,0.3,581700.38554352894]
[null,null,null,null,null,0.24707177203454567,1811,0.3,581681.07290093089]
[null,null,null,null,null,0.24692714051003373,1812,0.3,581661.57218543545]
[null,null,null,null,null,0.24678258878222903,1813,0.3,581641.88350083563]
[null,null,null,null,null,0.24663811676312841,1814,0.3,581622.00695080939]
[null,null,null,null,null,0.2464937243648746,1815,0.3,581601.94263892155]
[null,null,null,null,null,0.24634941149975531,1816,0.3,581581.69066862238]
[null,null,null,null,null,0.24620517808020304,1817,0.3,581561.25114324759]
[null,null,null,null,null,0.24606102401879459,1818,0.3,581540.62416601914]
[null,null,null,null,null,0.2459169492282518,1819,0.3,581519.80984004703]
[null,null,null,null,null,0.24577295362143947,1820,0.3,581498.80826832587]
[null,null,null,null,null,0.24562903711136652,1821,0.3,581477.61955373804]
[null,null,null,null,null,0.24548519961118509,1822,0.3,581456.24379905302]
[null,null,null,null,null,0.24534144103419009,1823,0.3,581434.68110692711]
[null,null,null,null,null,0.24519776129381943,1824,0.3,581412.93157990463]
[null,null,null,null,null,0.24505416030365268,1825,0.3,581390.99532041594]
[null,null,null,null,null,0.24491063797741242,1826,0.3,581368.8724307816]
[null,null,null,null,null,0.2447671942289622,1827,0.3,581346.5630132081]
[null,null,null,null,null,0.24462382897230683,1828,0.3,581324.06716978992]
[null,null,null,null,null,0.24448054212159298,1829,0.3,581301.38500251167]
[null,null,null,null,null,0.24433733359110765,1830,0.3,581278.51661324513]
[null,null,null,null,null,0.24419420329527819,1831,0.3,581255.46210375067]
[null,null,null,null,null,0.24405115114867204,1832,0.3,581232.22157567739]
[null,null,null,null,null,0.24390817706599721,1833,0.3,581208.79513056483]
[null,null,null,null,null,0.24376528096210048,1834,0.3,581185.18286983995]
[null,null,null,null,null,0.24362246275196831,1835,0.3,581161.3848948204]
[null,null,null,null,null,0.24347972235072568,1836,0.3,581137.40130671207]
[null,null,null,null,null,0.24333705967363706,1837,0.3,581113.23220661271]
[null,null,null,null,null,0.24319447463610411,1838,0.3,581088.87769550725]
[null,null,null,null,null,0.24305196715366773,1839,0.3,581064.33787427342]
[null,null,null,null,null,0.2429095371420058,1840,0.3,581039.61284367787]
[null,null,null,null,null,0.24276718451693324,1841,0.3,581014.70270437631]
[null,null,null,null,null,0.24262490919440372,1842,0.3,580989.60755691922]
[null,null,null,null,null,0.24248271109050612,1843,0.3,580964.32750174357]
[null,null,null,null,null,0.24234059012146658,1844,0.3,580938.86263917969]
[null,null,null,null,null,0.24219854620364734,1845,0.3,580913.21306944825]
[null,null,null,null,null,0.24205657925354696,1846,0.3,580887.37889266189]
[null,null,null,null,null,0.24191468918779901,1847,0.3,580861.36020882416]
[null,null,null,null,null,0.24177287592317298,1848,0.3,580835.15711783071]
[null,null,null,null,null,0.2416311393765731,1849,0.3,580808.76971946878]
[null,null,null,null,null,0.24148947946503885,1850,0.3,580782.19811341842]
[null,null,null,null,null,0.24134789610574359,1851,0.3,580755.44239925069]
[null,null,null,null,null,0.24120638921599502,1852,0.3,580728.50267642958]
[null,null,null,null,null,0.24106495871323563,1853,0.3,580701.37904431345]
[null,null,null,null,null,0.24092360451504002,1854,0.3,580674.07160214952]
[null,null,null,null,null,0.24078232653911757,1855,0.3,580646.58044908196]
[null,null,null,null,null,0.24064112470330956,1856,0.3,580618.9056841454]
[null,null,null,null,null,{"$f":"-0.262*LN(G1947)+2.2125","v":0.24049999892559071},1857,0.3,{"$f":"$H$88*F1947*1000*G1947","v":580591.04740626854}]
[null,null,null,null,null,0.24035894912406852,1858,0.3,580563.00571427518]
[null,null,null,null,null,0.24021797521698152,1859,0.3,580534.78070687922]
[null,null,null,null,null,0.24007707712270121,1860,0.3,580506.37248269154]
[null,null,null,null,null,0.23993625475973013,1861,0.3,580477.78114021511]
[null,null,null,null,null,0.23979550804670247,1862,0.3,580449.006777848]
[null,null,null,null,null,0.23965483690238365,1863,0.3,580420.04949388304]
[null,null,null,null,null,0.23951424124566922,1864,0.3,580390.90938650572]
[null,null,null,null,null,0.23937372099558596,1865,0.3,580361.58655379817]
[null,null,null,null,null,0.23923327607129008,1866,0.3,580332.08109373541]
[null,null,null,null,null,0.23909290639206859,1867,0.3,580302.39310418966]
[null,null,null,null,null,0.2389526118773373,1868,0.3,580272.52268292592]
[null,null,null,null,null,0.23881239244664232,1869,0.3,580242.46992760675]
[null,null,null,null,null,0.23867224801965814,1870,0.3,580212.2349357889]
[null,null,null,null,null,0.23853217851618846,1871,0.3,580181.81780492526]
[null,null,null,null,null,0.23839218385616512,1872,0.3,580151.21863236348]
[null,null,null,null,null,0.23825226395964871,1873,0.3,580120.43751534866]
[null,null,null,null,null,0.23811241874682754,1874,0.3,580089.47455102124]
[null,null,null,null,null,0.23797264813801799,1875,0.3,580058.32983641897]
[null,null,null,null,null,0.23783295205366328,1876,0.3,580027.00346847414]
[null,null,null,null,null,0.23769333041433449,1877,0.3,579995.49554401764]
[null,null,null,null,null,0.23755378314072928,1878,0.3,579963.8061597764]
[null,null,null,null,null,0.23741431015367209,1879,0.3,579931.93541237479]
[null,null,null,null,null,0.23727491137411305,1880,0.3,579899.8833983324]
[null,null,null,null,null,0.23713558672312995,1881,0.3,579867.65021406976]
[null,null,null,null,null,0.23699633612192472,1882,0.3,579835.23595590098]
[null,null,null,null,null,0.23685715949182584,1883,0.3,579802.64072004042]
[null,null,null,null,null,0.23671805675428703,1884,0.3,579769.86460259976]
[null,null,null,null,null,0.23657902783088658,1885,0.3,579736.90769958764]
[null,null,null,null,null,0.23644007264332823,1886,0.3,579703.77010691212]
[null,null,null,null,null,0.23630119111343961,1887,0.3,579670.4519203786]
[null,null,null,null,null,0.23616238316317295,1888,0.3,579636.95323569165]
[null,null,null,null,null,0.23602364871460435,1889,0.3,579603.27414845396]
[null,null,null,null,null,0.23588498768993338,1890,0.3,579569.41475416638]
[null,null,null,null,null,0.23574640001148395,1891,0.3,579535.37514823105]
[null,null,null,null,null,0.23560788560170209,1892,0.3,579501.15542594646]
[null,null,null,null,null,0.23546944438315731,1893,0.3,579466.75568251184]
[null,null,null,null,null,0.23533107627854166,1894,0.3,579432.17601302534]
[null,null,null,null,null,0.23519278121066978,1895,0.3,579397.41651248501]
[null,null,null,null,null,0.23505455910247863,1896,0.3,579362.47727578937]
[null,null,null,null,null,0.234916409877026,1897,0.3,579327.35839773389]
[null,null,null,null,null,0.23477833345749288,1898,0.3,579292.05997301789]
[null,null,null,null,null,0.23464032976718086,1899,0.3,579256.58209623932]
[null,null,null,null,null,0.23450239872951251,1900,0.3,579220.92486189585]
[null,null,null,null,null,0.23436454026803144,1901,0.3,579185.08836438612]
[null,null,null,null,null,0.23422675430640183,1902,0.3,579149.0726980092]
[null,null,null,null,null,0.23408904076840886,1903,0.3,579112.87795696675]
[null,null,null,null,null,0.23395139957795652,1904,0.3,579076.50423535798]
[null,null,null,null,null,0.2338138306590698,1905,0.3,579039.95162718638]
[null,null,null,null,null,0.23367633393589338,1906,0.3,579003.22022635664]
[null,null,null,null,null,0.23353890933269006,1907,0.3,578966.31012667192]
[null,null,null,null,null,0.23340155677384322,1908,0.3,578929.22142184083]
[null,null,null,null,null,0.23326427618385392,1909,0.3,578891.95420547028]
[null,null,null,null,null,0.23312706748734269,1910,0.3,578854.50857107202]
[null,null,null,null,null,0.23298993060904816,1911,0.3,578816.88461205841]
[null,null,null,null,null,0.23285286547382711,1912,0.3,578779.08242174471]
[null,null,null,null,null,0.23271587200665356,1913,0.3,578741.10209334677]
[null,null,null,null,null,0.23257895013262009,1914,0.3,578702.94371998531]
[null,null,null,null,null,0.23244209977693631,1915,0.3,578664.60739468294]
[null,null,null,null,null,0.23230532086492883,1916,0.3,578626.09321036481]
[null,null,null,null,null,0.23216861332204086,1917,0.3,578587.40125985804]
[null,null,null,null,null,0.23203197707383327,1918,0.3,578548.53163589595]
[null,null,null,null,null,0.23189541204598241,1919,0.3,578509.4844311123]
[null,null,null,null,null,0.23175891816428096,1920,0.3,578470.25973804528]
[null,null,null,null,null,{"$f":"-0.262*LN(G2011)+2.2125","v":0.23162249535463797},1921,0.3,{"$f":"$H$88*F2011*1000*G2011","v":578430.8576491375}]
[null,null,null,null,null,0.2314861435430775,1922,0.3,578391.27825673355]
[null,null,null,null,null,0.23134986265573954,1923,0.3,578351.52165308327]
[null,null,null,null,null,0.23121365261887905,1924,0.3,578311.58793034032]
[null,null,null,null,null,0.23107751335886606,1925,0.3,578271.47718056233]
[null,null,null,null,null,0.23094144480218515,1926,0.3,578231.18949571112]
[null,null,null,null,null,0.23080544687543592,1927,0.3,578190.72496765456]
[null,null,null,null,null,0.23066951950533121,1928,0.3,578150.08368816203]
[null,null,null,null,null,0.2305336626186989,1929,0.3,578109.2657489113]
[null,null,null,null,null,0.23039787614247986,1930,0.3,578068.27124148188]
[null,null,null,null,null,0.23026216000372912,1931,0.3,578027.10025736119]
[null,null,null,null,null,0.23012651412961449,1932,0.3,577985.7528879398]
[null,null,null,null,null,0.22999093844741703,1933,0.3,577944.22922451422]
[null,null,null,null,null,0.22985543288453103,1934,0.3,577902.52935828792]
[null,null,null,null,null,0.22971999736846271,1935,0.3,577860.6533803679]
[null,null,null,null,null,0.22958463182683109,1936,0.3,577818.60138176847]
[null,null,null,null,null,0.22944933618736707,1937,0.3,577776.37345340895]
[null,null,null,null,null,0.22931411037791327,1938,0.3,577733.96968611481]
[null,null,null,null,null,0.2291789543264251,1939,0.3,577691.39017061982]
[null,null,null,null,null,0.22904386796096787,1940,0.3,577648.63499756111]
[null,null,null,null,null,0.22890885120971927,1941,0.3,577605.70425748453]
[null,null,null,null,null,0.22877390400096687,1942,0.3,577562.59804084105]
[null,null,null,null,null,0.22863902626311039,1943,0.3,577519.31643799064]
[null,null,null,null,null,0.22850421792465903,1944,0.3,577475.85953919822]
[null,null,null,null,null,0.22836947891423276,1945,0.3,577432.22743463761]
[null,null,null,null,null,0.22823480916056083,1946,0.3,577388.42021438689]
[null,null,null,null,null,0.22810020859248348,1947,0.3,577344.43796843488]
[null,null,null,null,null,0.22796567713895,1948,0.3,577300.28078667703]
[null,null,null,null,null,0.2278312147290189,1949,0.3,577255.94875891518]
[null,null,null,null,null,0.2276968212918582,1950,0.3,577211.4419748605]
[null,null,null,null,null,0.22756249675674467,1951,0.3,577166.76052413147]
[null,null,null,null,null,0.22742824105306392,1952,0.3,577121.90449625498]
[null,null,null,null,null,0.2272940541103099,1953,0.3,577076.8739806657]
[null,null,null,null,null,0.22715993585808514,1954,0.3,577031.66906670784]
[null,null,null,null,null,0.22702588622609965,1955,0.3,576986.28984363226]
[null,null,null,null,null,0.22689190514417223,1956,0.3,576940.7364006011]
[null,null,null,null,null,0.22675799254222784,1957,0.3,576895.00882668188]
[null,null,null,null,null,0.22662414835030043,1958,0.3,576849.10721085477]
[null,null,null,null,null,0.2264903724985301,1959,0.3,576803.03164200659]
[null,null,null,null,null,0.22635666491716444,1960,0.3,576756.78220893501]
[null,null,null,null,null,0.22622302553655715,1961,0.3,576710.35900034523]
[null,null,null,null,null,0.2260894542871692,1962,0.3,576663.76210485387]
[null,null,null,null,null,0.22595595109956701,1963,0.3,576616.99161098502]
[null,null,null,null,null,0.22582251590442404,1964,0.3,576570.04760717554]
[null,null,null,null,null,0.22568914863251899,1965,0.3,576522.93018176977]
[null,null,null,null,null,0.22555584921473648,1966,0.3,576475.63942302356]
[null,null,null,null,null,0.22542261758206639,1967,0.3,576428.17541910196]
[null,null,null,null,null,0.22528945366560382,1968,0.3,576380.53825808084]
[null,null,null,null,null,0.22515635739654893,1969,0.3,576332.72802794632]
[null,null,null,null,null,0.22502332870620689,1970,0.3,576284.74481659592]
[null,null,null,null,null,0.22489036752598723,1971,0.3,576236.58871183707]
[null,null,null,null,null,0.22475747378740363,1972,0.3,576188.2598013879]
[null,null,null,null,null,0.22462464742207455,1973,0.3,576139.75817287911]
[null,null,null,null,null,0.22449188836172196,1974,0.3,576091.08391385095]
[null,null,null,null,null,0.22435919653817149,1975,0.3,576042.23711175541]
[null,null,null,null,null,0.22422657188335293,1976,0.3,575993.21785395709]
[null,null,null,null,null,0.22409401432929821,1977,0.3,575944.0262277294]
[null,null,null,null,null,0.2239615238081436,1978,0.3,575894.66232026054]
[null,null,null,null,null,0.22382910025212777,1979,0.3,575845.12621864909]
[null,null,null,null,null,0.22369674359359148,1980,0.3,575795.41800990456]
[null,null,null,null,null,0.22356445376497946,1981,0.3,575745.53778095159]
[null,null,null,null,null,0.22343223069883722,1982,0.3,575695.48561862402]
[null,null,null,null,null,0.22330007432781329,1983,0.3,575645.26160966989]
[null,null,null,null,null,0.22316798458465748,1984,0.3,575594.86584074865]
[null,null,null,null,null,{"$f":"-0.262*LN(G2075)+2.2125","v":0.22303596140222171},1985,0.3,{"$f":"$H$88*F2075*1000*G2075","v":575544.29839843302}]
[null,null,null,null,null,0.22290400471345895,1986,0.3,575493.55936920829]
[null,null,null,null,null,0.22277211445142364,1987,0.3,575442.64883947244]
[null,null,null,null,null,0.2226402905492717,1988,0.3,575391.56689553789]
[null,null,null,null,null,0.22250853294025896,1989,0.3,575340.31362362765]
[null,null,null,null,null,0.22237684155774273,1990,0.3,575288.88910988055]
[null,null,null,null,null,0.22224521633518046,1991,0.3,575237.29344034765]
[null,null,null,null,null,0.22211365720612952,1992,0.3,575185.52670099307]
[null,null,null,null,null,0.22198216410424765,1993,0.3,575133.58897769521]
[null,null,null,null,null,0.22185073696329249,1994,0.3,575081.48035624682]
[null,null,null,null,null,0.22171937571712119,1995,0.3,575029.20092235378]
[null,null,null,null,null,0.22158808029969057,1996,0.3,574976.75076163711]
[null,null,null,null,null,0.22145685064505627,1997,0.3,574924.12995963066]
[null,null,null,null,null,0.22132568668737318,1998,0.3,574871.33860178315]
[null,null,null,null,null,0.22119458836089501,1999,0.3,574818.37677345786]
[null,null,null,null,null,0.22106355559997426,2000,0.3,574765.24455993308]

{"sheet":"Tevékenységi lista","index":4,"n_rows":23,"n_cols":10,"rows_kept":23,"cut":false,"hidden":true,"merged":[]}
["Biztosított tevékenység:","kockázati osztály","munkáltatói felelősség díj /fő"]
["(nép)művészeti, kulturális rendezvény (nem zenei)",3,null,null,null,null,{"$f":"IF(--ISNUMBER(SEARCH(tev.lista,A2)),MAX($G$1:G1)+1,\"\")","v":1},{"$f":"IFERROR(INDEX($A$2:$A$23,MATCH(ROWS($G$2:G2),$G$2:$G$23,0)),\"\")","v":"(nép)művészeti, kulturális rendezvény (nem zenei)"},null,{"$f":"$H$2:INDEX($H$2:$H$23,COUNTIF($H$2:$H$23,\"?*\"))","v":"(nép)művészeti, kulturális rendezvény (nem zenei)"}]
["bál",3,null,null,null,null,{"$f":"IF(--ISNUMBER(SEARCH(tev.lista,A3)),MAX($G$1:G2)+1,\"\")","v":2},{"$f":"IFERROR(INDEX($A$2:$A$23,MATCH(ROWS($G$2:G3),$G$2:$G$23,0)),\"\")","v":"bál"}]
["búcsú",3,null,null,null,null,{"$f":"IF(--ISNUMBER(SEARCH(tev.lista,A4)),MAX($G$1:G3)+1,\"\")","v":3},{"$f":"IFERROR(INDEX($A$2:$A$23,MATCH(ROWS($G$2:G4),$G$2:$G$23,0)),\"\")","v":"búcsú"}]
["családi nap",3,null,null,null,null,{"$f":"IF(--ISNUMBER(SEARCH(tev.lista,A5)),MAX($G$1:G4)+1,\"\")","v":4},{"$f":"IFERROR(INDEX($A$2:$A$23,MATCH(ROWS($G$2:G5),$G$2:$G$23,0)),\"\")","v":"családi nap"}]
["csapatépítő tréning",1,null,null,null,null,{"$f":"IF(--ISNUMBER(SEARCH(tev.lista,A6)),MAX($G$1:G5)+1,\"\")","v":5},{"$f":"IFERROR(INDEX($A$2:$A$23,MATCH(ROWS($G$2:G6),$G$2:$G$23,0)),\"\")","v":"csapatépítő tréning"}]
["értekezlet, workshop",1,null,null,null,null,{"$f":"IF(--ISNUMBER(SEARCH(tev.lista,A7)),MAX($G$1:G6)+1,\"\")","v":6},{"$f":"IFERROR(INDEX($A$2:$A$23,MATCH(ROWS($G$2:G7),$G$2:$G$23,0)),\"\")","v":"értekezlet, workshop"}]
["falunap",3,null,null,null,null,{"$f":"IF(--ISNUMBER(SEARCH(tev.lista,A8)),MAX($G$1:G7)+1,\"\")","v":7},{"$f":"IFERROR(INDEX($A$2:$A$23,MATCH(ROWS($G$2:G8),$G$2:$G$23,0)),\"\")","v":"falunap"}]
["fogadás, parti",1,null,null,null,null,{"$f":"IF(--ISNUMBER(SEARCH(tev.lista,A9)),MAX($G$1:G8)+1,\"\")","v":8},{"$f":"IFERROR(INDEX($A$2:$A$23,MATCH(ROWS($G$2:G9),$G$2:$G$23,0)),\"\")","v":"fogadás, parti"}]
["gasztronómiai fesztivál",3,null,null,null,null,{"$f":"IF(--ISNUMBER(SEARCH(tev.lista,A10)),MAX($G$1:G9)+1,\"\")","v":9},{"$f":"IFERROR(INDEX($A$2:$A$23,MATCH(ROWS($G$2:G10),$G$2:$G$23,0)),\"\")","v":"gasztronómiai fesztivál"}]
["gyermekrendezvény",3,null,null,null,null,{"$f":"IF(--ISNUMBER(SEARCH(tev.lista,A11)),MAX($G$1:G10)+1,\"\")","v":10},{"$f":"IFERROR(INDEX($A$2:$A$23,MATCH(ROWS($G$2:G11),$G$2:$G$23,0)),\"\")","v":"gyermekrendezvény"}]
["hagyományőrző, illetve történelmi helyszínhez kötődő rendezvény",3,null,null,null,null,{"$f":"IF(--ISNUMBER(SEARCH(tev.lista,A12)),MAX($G$1:G11)+1,\"\")","v":11},{"$f":"IFERROR(INDEX($A$2:$A$23,MATCH(ROWS($G$2:G12),$G$2:$G$23,0)),\"\")","v":"hagyományőrző, illetve történelmi helyszínhez kötődő rendezvény"}]
["kiállítás, vásár",2,null,null,null,null,{"$f":"IF(--ISNUMBER(SEARCH(tev.lista,A13)),MAX($G$1:G12)+1,\"\")","v":12},{"$f":"IFERROR(INDEX($A$2:$A$23,MATCH(ROWS($G$2:G13),$G$2:$G$23,0)),\"\")","v":"kiállítás, vásár"}]
["komolyzenei koncert, hangverseny",3,null,null,null,null,{"$f":"IF(--ISNUMBER(SEARCH(tev.lista,A14)),MAX($G$1:G13)+1,\"\")","v":13},{"$f":"IFERROR(INDEX($A$2:$A$23,MATCH(ROWS($G$2:G14),$G$2:$G$23,0)),\"\")","v":"komolyzenei koncert, hangverseny"}]
["koncert (könnyűzenei)",4,null,null,null,null,{"$f":"IF(--ISNUMBER(SEARCH(tev.lista,A15)),MAX($G$1:G14)+1,\"\")","v":14},{"$f":"IFERROR(INDEX($A$2:$A$23,MATCH(ROWS($G$2:G15),$G$2:$G$23,0)),\"\")","v":"koncert (könnyűzenei)"}]
["konferencia",1,null,null,null,null,{"$f":"IF(--ISNUMBER(SEARCH(tev.lista,A16)),MAX($G$1:G15)+1,\"\")","v":15},{"$f":"IFERROR(INDEX($A$2:$A$23,MATCH(ROWS($G$2:G16),$G$2:$G$23,0)),\"\")","v":"konferencia"}]
["kongresszus",1,null,null,null,null,{"$f":"IF(--ISNUMBER(SEARCH(tev.lista,A17)),MAX($G$1:G16)+1,\"\")","v":16},{"$f":"IFERROR(INDEX($A$2:$A$23,MATCH(ROWS($G$2:G17),$G$2:$G$23,0)),\"\")","v":"kongresszus"}]
["önkormányzati, fesztivál jellegű rendezvény",3,null,null,null,null,{"$f":"IF(--ISNUMBER(SEARCH(tev.lista,A18)),MAX($G$1:G17)+1,\"\")","v":17},{"$f":"IFERROR(INDEX($A$2:$A$23,MATCH(ROWS($G$2:G18),$G$2:$G$23,0)),\"\")","v":"önkormányzati, fesztivál jellegű rendezvény"}]
["promóciós rendezvény",2,null,null,null,null,{"$f":"IF(--ISNUMBER(SEARCH(tev.lista,A19)),MAX($G$1:G18)+1,\"\")","v":18},{"$f":"IFERROR(INDEX($A$2:$A$23,MATCH(ROWS($G$2:G19),$G$2:$G$23,0)),\"\")","v":"promóciós rendezvény"}]
["sajtótájékoztató",1,null,null,null,null,{"$f":"IF(--ISNUMBER(SEARCH(tev.lista,A20)),MAX($G$1:G19)+1,\"\")","v":19},{"$f":"IFERROR(INDEX($A$2:$A$23,MATCH(ROWS($G$2:G20),$G$2:$G$23,0)),\"\")","v":"sajtótájékoztató"}]
["sport rendezvény (kivéve futball, extrém, autós, motoros, kerékpáros sportok)",4,null,null,null,null,{"$f":"IF(--ISNUMBER(SEARCH(tev.lista,A21)),MAX($G$1:G20)+1,\"\")","v":20},{"$f":"IFERROR(INDEX($A$2:$A$23,MATCH(ROWS($G$2:G21),$G$2:$G$23,0)),\"\")","v":"sport rendezvény (kivéve futball, extrém, autós, motoros, kerékpáros sportok)"}]
["termékbemutató",2,null,null,null,null,{"$f":"IF(--ISNUMBER(SEARCH(tev.lista,A22)),MAX($G$1:G21)+1,\"\")","v":21},{"$f":"IFERROR(INDEX($A$2:$A$23,MATCH(ROWS($G$2:G22),$G$2:$G$23,0)),\"\")","v":"termékbemutató"}]
["zenei fesztivál",4,null,null,null,null,{"$f":"IF(--ISNUMBER(SEARCH(tev.lista,A23)),MAX($G$1:G22)+1,\"\")","v":22},{"$f":"IFERROR(INDEX($A$2:$A$23,MATCH(ROWS($G$2:G23),$G$2:$G$23,0)),\"\")","v":"zenei fesztivál"}]