{"text_format":"1","workbook":"xlsx","n_sheets":13,"sheets":["Biztosítási termékismertető 1","Biztosítási termékismertető 2","Biztosítási termékismertető 3","Díjösszesítő","ELBER","Géptörés","All Risks Gépbiztosítás","Társbiztosítotti nyilatkozat","Zálogkötelezetti nyilatkozat","Verzió","elberlista","geptoreslista","allrisklista"],"not_rendered":{"charts":0,"images":52,"macros":1,"external_links":0,"defined_names":78,"comments":0,"pivot_tables":0},"unopened":[],"bounds":{"document_bytes":16777216,"sheet_cells":100000,"rows_first":2000,"rows_last":500,"rows_between":2000,"halvings":0,"cell_chars":16384,"cell_head_chars":4096},"cells_cut":0,"cells_raw":0,"read":"whole","date_system":"1900"}

{"sheet":"Biztosítási termékismertető 1","index":0,"n_rows":0,"n_cols":0,"rows_kept":0,"cut":false,"hidden":false,"merged":[]}

{"sheet":"Biztosítási termékismertető 2","index":1,"n_rows":0,"n_cols":0,"rows_kept":0,"cut":false,"hidden":false,"merged":[]}

{"sheet":"Biztosítási termékismertető 3","index":2,"n_rows":0,"n_cols":0,"rows_kept":0,"cut":false,"hidden":false,"merged":[]}

{"sheet":"Díjösszesítő","index":3,"n_rows":200,"n_cols":42,"rows_kept":200,"cut":false,"hidden":false,"merged":[[157,18,157,26],[157,31,157,39],[38,35,38,40],[38,6,38,11],[155,4,155,10],[155,12,155,15],[147,7,147,40],[98,26,98,30],[92,26,92,30],[93,26,93,30],[94,26,94,30],[95,26,95,30],[96,26,96,30],[107,23,107,25],[110,26,110,30],[43,28,43,40],[46,33,46,36],[108,26,108,30],[100,26,100,30],[104,26,104,30],[105,26,105,30],[106,26,106,30],[97,26,97,30],[57,7,57,40],[50,33,50,36],[72,12,72,40],[82,12,82,16],[43,16,43,23],[46,2,46,4],[50,2,50,4],[50,7,50,16],[50,20,50,30],[49,8,49,10],[46,20,46,30],[46,7,46,16],[59,4,59,6],[59,9,59,17],[59,21,59,31],[59,34,59,36],[69,12,69,40],[34,34,34,40],[1,39,1,41],[2,39,2,41],[3,21,6,32],[16,3,16,16],[18,2,18,40],[8,0,8,6],[34,5,34,8],[19,2,19,40],[34,15,34,27],[23,2,24,40],[21,2,22,40],[36,6,36,7],[104,23,104,25],[105,23,105,25],[92,7,92,25],[93,7,93,25],[94,7,94,25],[95,7,95,25],[96,7,96,25],[97,7,97,25],[98,7,98,25],[36,15,36,19],[41,11,41,40],[43,6,43,12],[51,6,51,7],[53,21,53,26],[36,37,36,40],[121,3,121,9],[106,23,106,25],[112,2,113,40],[156,31,156,39],[140,2,142,40],[144,2,144,40],[156,18,156,26],[123,3,123,4],[107,26,107,30],[145,7,145,40],[146,7,146,40],[152,2,152,40]]}
[]
[null,null,null,null,null,null,null,null,null,null,null,null,null,null,null,null,"Választható kedvezmények:",null,null,null,null,null,null,null,null,null,null,null,null,null,null,null,null,null,null,null,null,null,"Előzetes kármentességi engedmény:"]
[null,null,null,null,null,null,null,null,null,null,null,null,null,null,null,null,"Díjfizetési engedmény",null,null,null,null,null,null,null,null,null,null,null,null,null,null,null,null,null,null,null,null,null,"Egyedi engedmény:"]
[null,null,null,null,null,null,null,null,null,null,null,null,null,null,null,null,null,null,null,null,null,"60 E és 100 E Ft közötti éves díj esetén a gyakoriság választható, de díjkedvezmény nincs! (60 E Ft alatt csak éves lehet)"]
[null,null,null,null,null,null,null,null," "]
[]
[]
[]
[]
[]
[]
[]
[]
[]
[]
[]
[null,null,null,"Kötvényszám: "]
[]
[null,null,"BIZTOSÍTÁSI KÖTVÉNY"]
[null,null,{"$f":"IFERROR(IF(A176=1,\"Elektromos és elektronikus gépek és berendezések biztosítása\",IF(A176=2,\"Gép-, géptörés-biztosítás\",\"All Risks Gépbiztosítás\")),\"Elektromos és elektronikus gépek és berendezések biztosítására\")","v":"All Risks Gépbiztosítás"}]
{"$rows_left_out":181}
{"sheet":"ELBER","index":4,"n_rows":193,"n_cols":28,"rows_kept":193,"cut":false,"hidden":true,"merged":[[29,3,29,4],[35,3,35,4],[36,3,36,4],[37,3,37,4],[38,3,38,4],[30,3,30,4],[31,3,31,4],[32,3,32,4],[33,3,33,4],[34,3,34,4],[128,3,131,12],[134,3,134,12],[162,3,162,13],[174,8,174,11],[138,7,138,12],[139,7,139,12],[4,3,4,8],[19,4,19,7],[19,9,19,10],[110,3,110,13],[10,3,10,11],[50,4,51,11],[71,3,71,11],[20,3,20,4],[21,3,21,4],[22,3,22,4],[23,3,23,4],[24,3,24,4],[25,3,25,4],[26,3,26,4],[27,3,27,4],[28,3,28,4],[32,9,32,11],[38,9,38,11],[39,9,39,11],[33,9,33,11],[34,9,34,11],[35,9,35,11],[36,9,36,11],[37,9,37,11],[27,9,27,11],[28,9,28,11],[29,9,29,11],[30,9,30,11],[31,9,31,11],[125,3,125,12],[46,7,46,8],[111,3,111,11],[40,5,40,8],[42,5,42,6],[121,3,121,12],[116,3,116,12],[118,3,119,12],[112,3,112,11],[122,3,122,12],[9,0,117,0],[75,4,76,11],[98,3,99,3],[98,5,99,5],[46,5,46,6],[39,3,39,4],[18,9,18,11],[20,9,20,11],[21,9,21,11],[22,9,22,11],[23,9,23,11],[24,9,24,11],[25,9,25,11],[26,9,26,11],[18,3,18,4],[15,5,15,12]]}
["ELBER biztosítás"]
[]
[null,"Géplista:"]
[]
[null,"Biztosított gépkategória:",null,"grafikai, nyomdatechnikai eszközök"]
[]
[null,"Önrész:",null,"10%, de min."]
[]
[null,null,null,null,null,null,null,null,null,null,null,null,null,null,null,null,null,null,null,null,false]
[" ELBER"]
[null,null,null,"Elektromos és elektronikus gépek és berendezések biztosítása"]
[]
[null,null,null,"I. Dologi károk biztosítása"]
[]
[]
[null,null,null,"Biztosított kockázatok:",null,"Ha a kár oka: a biztosított vagyontárgyakban előre nem látható,véletlenül, váratlanul bekövetkezett fizikai károsodás, mellyel kapcsolatban a biztosító a kártérítési kötelezettségét nem zárta ki.",null,null,null,null,null,null,null,null,null,null,null,null,null,null,"Értékelés alapja"]
[null,null,null,null,null,null,null,null,null,null,null,null,null,null,null,null,null,null,null,null,"új érték"]
[null,null,null,"Géplista",null,null,null,null,null,null,null,null,null,null,null,null,null,null,null,null,"műszaki avult"]
[null,null,null,"Megnevezés",null,"Gyártmány, Típus","Azonosító szám","Gyárt. év","Egyedi gépérték (bizt. összeg)","Értékelés alapja",null,null,"Alapdíj (Ft)",null,"Gépcsoport",null,null,null,50000000,"Gépcsoport",null,null,"Alapdíj"]
[null,null,null,null,"Az ajánlatkéréshez csatolt adatközlő szerint",null,null,null,null,0,null,null,"új érték",null,null,null,null,null,500000000]
{"$rows_left_out":174}
{"sheet":"Géptörés","index":5,"n_rows":180,"n_cols":29,"rows_kept":180,"cut":false,"hidden":true,"merged":[[116,7,116,12],[33,3,33,4],[34,3,34,4],[115,8,115,11],[33,9,33,11],[34,9,34,11],[45,5,45,6],[98,3,98,12],[96,3,96,12],[13,9,13,11],[15,9,15,11],[16,9,16,11],[17,9,17,11],[18,9,18,11],[31,3,31,4],[32,3,32,4],[19,9,19,11],[20,9,20,11],[21,9,21,11],[22,9,22,11],[23,9,23,11],[27,9,27,11],[28,9,28,11],[29,9,29,11],[30,9,30,11],[31,9,31,11],[32,9,32,11],[4,3,4,8],[139,3,139,12],[95,3,95,12],[97,3,97,12],[68,3,68,11],[70,3,70,11],[93,3,93,11],[65,3,65,5],[26,3,26,4],[13,3,13,4],[15,3,15,4],[16,3,16,4],[17,3,17,4],[18,3,18,4],[27,3,27,4],[29,3,29,4],[151,8,151,11],[14,9,14,10],[14,4,14,7],[99,3,99,12],[94,3,94,12],[102,3,102,12],[105,3,108,12],[111,3,111,12],[22,3,22,4],[23,3,23,4],[24,3,24,4],[25,3,25,4],[24,9,24,11],[25,9,25,11],[26,9,26,11],[30,3,30,4],[11,4,11,12],[9,0,68,0],[71,5,71,11],[92,3,92,12],[9,3,9,11],[50,7,50,8],[53,3,53,11],[63,3,63,5],[56,3,56,5],[58,3,58,5],[50,5,50,6],[43,5,43,8],[19,3,19,4],[20,3,20,4],[21,3,21,4],[28,3,28,4]]}
["Géptörés biztosítás"]
[]
[null,"Géplista:"]
[]
[null,"Biztosított gépkategória:",null,"mezőgazdasági és erdészeti gépek (kivéve kombájnok, arató-, cséplőgépek, szárítók)"]
[]
[null,"Önrész:",null,"10%, de min."]
[]
[null,null,null,null,null,null,null,null,null,null,null,null,null,null,null,null,null,null,null,null,true]
["Géptörés",null,null,"Gép-, géptörés-biztosítás"]
[]
[null,null,null,"Biztosított kockázatok:","Tervezési vagy kivitelezési hiba, anyaghiba, rázkódás, alkatrészek kilazulása, hibás beállítás vagy szabályozás, rossz elhelyezés, kenés kimaradás, túlterhelés, túlhevülés, túlpörgés, rövidzárlat, szigetelési hiba, mérő-szabályozó berendezések meghibásodása, leesés, lökés, ütközés, gépet üzemeltető dolgozó figyelmetlensége.",null,null,null,null,null,null,null,null,null,null,null,null,null,null,null,"Értékelés alapja"]
[null,null,null,"Géplista",null,null,null,null,null,null,null,null,null,null,null,null,null,null,null,null,"új érték"]
[null,null,null,"Megnevezés",null,"Gyártmány, Típus","Azonosító szám","Gyárt. év","Egyedi gépérték (bizt. összeg)","Értékelés alapja",null,null,"Alapdíj (Ft)",null,"Gépcsoport",null,null,null,null,"Gépcsoport","műszaki avult",null,"Alapdíj"]
[null,null,null,null,"Az ajánlatkéréshez csatolt adatközlő szerint",null,null,null,null,44225000,null,null,"új érték"]
[null,null,null,null,null,null,null,null,null,null,null,null,{"$f":"IF(AND($M$44=gepmindij,W16<>\"\",W16>0),\"Minimum díj!\",W16)","v":""},null,{"$f":"IF(AND(U16>2,U16<6),geptorcsop1,IF(AND(U16>6,U16<24),geptorcsop2,IF(AND(U16>24,U16<68),geptorcsop3,IF(AND(U16>68,U16<106),geptorcsop4,\"\"))))","v":""},null,null,null,null,"",{"$f":"IFERROR(VLOOKUP(T16,geptoreslista!$A$3:$B$121,2,FALSE),0)","v":0},{"$f":"IF(I16<=$T$155,$AA$155,IF(I16<=T156,$AA$156,IF(I16<=$T$157,$AA$157,IF(I16<=$T$158,$AA$158,IF(I16<=$T$159,$AA$159,\"túl nagy b.ö.\")))))*IF(O16=$U$153,$U$155,IF(O16=$V$153,$V$155,IF(O16=$W$153,$W$155,IF(O16=$X$153,$X$155))))*$V$166","v":0},{"$f":"IF($F$44>$S$21,0,IF(V16=0,IF(I16>0,0,\"\"),I16*V16/1000))","v":""}]
[null,null,null,null,null,null,null,null,null,null,null,null,"",null,"",null,null,null,null,"",{"$f":"IFERROR(VLOOKUP(T17,geptoreslista!$A$3:$B$121,2,FALSE),0)","v":0},{"$f":"IF(I17<=$T$155,$AA$155,IF(I17<=T157,$AA$156,IF(I17<=$T$157,$AA$157,IF(I17<=$T$158,$AA$158,IF(I17<=$T$159,$AA$159,\"túl nagy b.ö.\")))))*IF(O17=$U$153,$U$155,IF(O17=$V$153,$V$155,IF(O17=$W$153,$W$155,IF(O17=$X$153,$X$155))))*$V$166","v":0},{"$f":"IF($F$44>$S$21,0,IF(V17=0,IF(I17>0,0,\"\"),I17*V17/1000))","v":""}]
[null,null,null,null,null,null,null,null,null,null,null,null,"",null,"",null,null,null,null,"",{"$f":"IFERROR(VLOOKUP(T18,geptoreslista!$A$3:$B$121,2,FALSE),0)","v":0},0,""]
[null,null,null,null,null,null,null,null,null,null,null,null,"",null,"",null,null,null,50000000,"",{"$f":"IFERROR(VLOOKUP(T19,geptoreslista!$A$3:$B$121,2,FALSE),0)","v":0},0,""]
[null,null,null,null,null,null,null,null,null,null,null,null,"",null,"",null,null,null,500000000,"",{"$f":"IFERROR(VLOOKUP(T20,geptoreslista!$A$3:$B$121,2,FALSE),0)","v":0},0,""]
{"$rows_left_out":161}
{"sheet":"All Risks Gépbiztosítás","index":6,"n_rows":186,"n_cols":44,"rows_kept":186,"cut":false,"hidden":false,"merged":[[60,3,61,6],[88,7,88,12],[35,9,35,11],[52,10,52,12],[54,10,54,12],[48,6,48,8],[42,3,42,4],[69,3,69,12],[70,3,70,12],[31,9,31,11],[58,3,58,6],[58,8,58,12],[33,3,33,4],[34,3,34,4],[34,9,34,11],[32,3,32,4],[28,3,28,4],[29,3,29,4],[30,3,30,4],[22,9,22,11],[23,9,23,11],[24,9,24,11],[25,9,25,11],[26,9,26,11],[28,9,28,11],[29,9,29,11],[30,9,30,11],[22,3,22,4],[23,3,23,4],[27,9,27,11],[27,3,27,4],[18,3,18,4],[19,3,19,4],[20,3,20,4],[21,3,21,4],[26,3,26,4],[21,22,21,25],[13,21,13,25],[15,9,15,11],[16,9,16,11],[17,9,17,11],[18,9,18,11],[19,9,19,11],[20,9,20,11],[21,9,21,11],[17,3,17,4],[9,0,123,0],[111,3,111,13],[123,8,123,11],[103,3,103,10],[53,6,53,8],[54,6,54,8],[83,3,83,12],[74,3,74,12],[77,3,80,12],[33,9,33,11],[15,3,15,4],[16,3,16,4],[71,3,71,12],[24,3,24,4],[25,3,25,4],[89,7,89,12],[87,7,87,11],[0,6,0,8],[9,3,9,11],[4,1,4,6],[12,5,12,11],[43,5,43,8],[35,3,35,4],[36,3,36,4],[37,3,37,4],[38,3,38,4],[39,3,39,4],[40,3,40,4],[41,3,41,4],[32,9,32,11],[31,3,31,4]]}
["All Risks Gépbiztosítás",null,null,null,null,null,"Záradékok:"]
["Telephelyen kívüli a munkavégzés:"]
["Géplista:"]
[null,null,null,null,null,null,null,null,null,null,null,null,null,null,null,null,null,null,null,null,null,null,null,null,null,null,null,null,null,null,null,null,null,null,null,null,null,null,null,null,null,null,null,"Beviteli sorok száma:"]
["Biztosított gépkategória","mezőgazd. és erdészeti gépek, targoncák (kivéve kombájnok, arató-, cséplőgépek, szárítók)"]
[null,null,null,null,null,null,null,null,null,null,null,null,null,null,null,null,null,null,null,null,true]
["Önrész",null,null,"de min."]
[]
[null,null,null,null,null,null,null,null,null,null,null,null,null,null,null,null,null,null,null,null,false]
["All Risks Gépbiztosítás",null,null,"All Risks Gépbiztosítás",null,null,null,null,null,null,null,null,null,null,null,null,null,null,null,{"$f":"IF(AND(U62=FALSE,U63=FALSE,U64=FALSE,U65=FALSE,U66=FALSE,U67=FALSE),1,0)","v":0}]
[]
[]
[null,null,null,"Biztosított kockázatok:",null,"az All Risks Gépbiztosítás feltételei szerint",null,null,null,null,null,null,null,null,null,null,null,null,null,null,"biztosítási összeg (M Ft)",null,"1) Mezőgazdasági és erdészeti gépek, targoncák","2) építőipari gépek","3.) Fa-, fém-, nyomda-, műanyag-, textilipari gépek és gépsorok","4.) Élelmiszeripari-, raktározás és logisztikai gépek; épületgépészet"]
[null,null,null,null,null,null,null,null,null,null,null,null,null,null,null,null,null,null,null,null,null,"Legutolsó módosítás: 2014.10.16 - *0,85"]
[null,null,null,"Géplista",null,null,null,null,null,null,null,null,null,null,null,null,null,null,null,null,0,10000000,{"$f":"5.23*0.85*1.1","v":4.8900500000000005},{"$f":"5.54*0.85*1.1","v":5.1798999999999999},{"$f":"4.96*0.85*1.1","v":4.6376000000000008},{"$f":"4.72*0.85*1.1","v":4.4131999999999998},1]
[null,null,null,"Megnevezés",null,"Gyártmány, Típus","Azonosító szám","Gyárt. év","Egyedi gépérték (bizt. összeg)","Értékelés alapja",null,null,"Alapdíj (Ft)",null,"Gépcsoport",null,null,null,"új érték",null,10000001,25000000,{"$f":"W15*0.89","v":4.3521445000000005},{"$f":"X15*0.89","v":4.6101109999999998},{"$f":"Y15*0.89","v":4.1274640000000007},{"$f":"Z15*0.89","v":3.9277479999999998},0.89,"Gépcsoport",null,"Szorzó","Alapdíj"]
[null,null,null,null,null,null,null,null,null,null,null,null,{"$f":"IF(AND($M$44=allriskmindij,AE17<>\"\",AE17>0),\"Minimum díj!\",AE17)","v":""},null,{"$f":"IF(AND(AC17>2,AC17<19),allriskcsop1,IF(AND(AC17>19,AC17<40),allriskcsop2,IF(AND(AC17>40,AC17<84),allriskcsop3,IF(AND(AC17>84,AC17<122),allriskcsop4,\"\"))))","v":""},null,null,null,"műszaki avult",null,25000001,50000000,{"$f":"W16*0.9*1.1","v":4.3086230550000009},{"$f":"X16*0.9","v":4.1490999000000004},{"$f":"Y16*0.9","v":3.7147176000000006},{"$f":"Z16*0.9","v":3.5349732},{"$f":"AA16*0.9","v":0.80100000000000005},"",{"$f":"IFERROR(VLOOKUP(AB17,allrisklista!$A$3:$B$139,2,FALSE),0)","v":0},{"$f":"IF(I17<=$V$15,$AA$15,IF(I17<=$V$16,$AA$16,IF(I17<=$V$17,$AA$17,IF(I17<=$V$18,$AA$18,IF(I17<=$V$19,$AA$19,\"túl nagy b.ö.\")))))*$V$57*IF(O17=allriskcsop1,$W$15,IF(O17=allriskcsop2,$X$15,IF(O17=allriskcsop3,$Y$15,IF(O17=allriskcsop4,$Z$15,0))))","v":0},{"$f":"IF($F$44>$S$21,0,IF(AD17=0,IF(I17>0,0,\"\"),I17*AD17/1000))","v":""}]
[null,null,null,null,null,null,null,null,null,null,null,null,"",null,"",null,null,null,null,null,50000001,100000000,{"$f":"W17*0.91","v":3.9208469800500008},{"$f":"X17*0.91","v":3.7756809090000005},{"$f":"Y17*0.91","v":3.3803930160000006},{"$f":"Z17*0.91","v":3.2168256120000001},{"$f":"AA17*0.91","v":0.72891000000000006},"",{"$f":"IFERROR(VLOOKUP(AB18,allrisklista!$A$3:$B$139,2,FALSE),0)","v":0},{"$f":"IF(I18<=$V$15,$AA$15,IF(I18<=$V$16,$AA$16,IF(I18<=$V$17,$AA$17,IF(I18<=$V$18,$AA$18,IF(I18<=$V$19,$AA$19,\"túl nagy b.ö.\")))))*$V$57*IF(O18=allriskcsop1,$W$15,IF(O18=allriskcsop2,$X$15,IF(O18=allriskcsop3,$Y$15,IF(O18=allriskcsop4,$Z$15,0))))","v":0},{"$f":"IF($F$44>$S$21,0,IF(AD18=0,IF(I18>0,0,\"\"),I18*AD18/1000))","v":""}]
[null,null,null,null,null,null,null,null,null,null,null,null,"",null,"",null,null,null,50000000,null,100000001,250000000,{"$f":"W18*0.92","v":3.607179221646001},{"$f":"X18*0.92","v":3.4736264362800005},{"$f":"Y18*0.92","v":3.1099615747200007},{"$f":"Z18*0.92","v":2.9594795630400004},{"$f":"AA18*0.92","v":0.67059720000000012},"",{"$f":"IFERROR(VLOOKUP(AB19,allrisklista!$A$3:$B$139,2,FALSE),0)","v":0},0,""]
[null,null,null,null,null,null,null,null,null,null,null,null,"",null,"",null,null,null,null,null,null,null,null,null,null,null,null,"",{"$f":"IFERROR(VLOOKUP(AB20,allrisklista!$A$3:$B$139,2,FALSE),0)","v":0},0,""]
{"$rows_left_out":167}
{"sheet":"Társbiztosítotti nyilatkozat","index":7,"n_rows":43,"n_cols":14,"rows_kept":43,"cut":false,"hidden":true,"merged":[[42,9,42,12],[38,1,38,6],[31,2,31,4],[31,7,31,9],[28,3,28,5],[41,9,41,12],[27,3,27,5],[0,0,0,13],[12,0,12,13],[19,0,19,13],[33,0,33,13],[26,6,26,9],[22,8,22,9],[23,2,23,5],[23,8,23,12],[1,2,1,3],[14,6,14,8],[16,0,16,3],[16,5,16,12],[21,4,21,7],[13,1,13,5],[14,0,14,2]]}
["NYILATKOZAT TÁRSBIZTOSÍTOTT BEJEGYZÉSÉHEZ"]
[null,"Értesítés a",null,null,"kötvényszámú biztosítási szerződéshez kapcsolódó változásról"]
[]
[]
["Union Vienna Insurance Group Biztosító Zrt."]
["Vezérigazgatóság"]
[]
["Budapest"]
["Baross u. 1."]
[1082]
[]
[]
["1. A(z) …………………..(szerződő)…………….. cégszerű képviseletében ezúton kérem Önöket, hogy a ………………. kockázatviselési kezdettel ……………………kötvényszámon Önökkel megkötött, egyedi vagyonbiztosítási szerződés esetében a szolgáltatási összeg tekintetében a finanszírozás futamidejére a …………………………….(lízingcég neve) re ( lízingcég címe.), mint Társbiztosítottat bejegyezni szíveskedjenek."]
["1. A(z)",{"$f":"Díjösszesítő!L42","v":0},null,null,null,null,"cégszerű képviseletében ezúton kérem Önöket, hogy a"]
[null,null,null,"kockázatviselési kezdettel",null,null,null,null,null,"kötvényszámon Önökkel megkötött,"]
["egyedi vagyonbiztosítási szerződés esetében a szolgáltatási összeg tekintetében a finanszírozás futamidejére a "]
[{"$f":"IF(Díjösszesítő!H58<>\"\",Díjösszesítő!H58,\"\")","v":""},null,null,null,"re cím",{"$f":"Díjösszesítő!E60&\" \"&Díjösszesítő!J60&\", \"&Díjösszesítő!V60&\" \"&Díjösszesítő!AI60","v":" ,  "},null,null,null,null,null,null,null,","]
["mint Társbiztosítottat bejegyezni szíveskedjenek."]
[]
["2. Kérem, hogy jelen levelünk kézhezvételét követően a fent megjelölt biztosítási szerződésben meghatározott biztosítási események által a biztosított ………………………………………… vagyontárgyakban bekövetkezett káresemények esetén az önrészesedést meghaladó szolgáltatási összeget legfeljebb… …………………..Ft értékhatárig  közvetlenül a Társbiztosított …………………. banknál  vezetett ……………………………………………………………………………..számú  számlájára  átutalással teljesíteni szíveskedjenek."]
{"$rows_left_out":24}
{"sheet":"Zálogkötelezetti nyilatkozat","index":8,"n_rows":53,"n_cols":9,"rows_kept":53,"cut":false,"hidden":true,"merged":[[52,6,52,7],[43,4,43,8],[44,4,44,8],[45,3,45,4],[45,7,45,8],[46,3,46,4],[46,7,46,8],[49,1,49,3],[26,1,26,8],[39,0,39,8],[42,4,42,8],[51,6,51,7],[34,3,34,4],[35,3,35,4],[36,3,36,4],[37,3,37,4],[38,3,38,4],[15,0,15,8],[19,0,19,8],[20,0,20,8],[21,0,21,8],[25,3,25,4],[11,0,11,8],[12,0,12,8],[14,0,14,1],[14,2,14,8],[13,3,13,8],[1,0,1,8],[4,1,4,8],[5,2,5,8],[7,3,7,4],[8,0,8,8]]}
[]
["ZÁLOGKÖTELEZETTI NYILATKOZAT"]
[]
["Szerződő/Biztosított adatai"]
["Név:",{"$f":"Díjösszesítő!L42","v":0}]
["Adószáma:",null,{"$f":"Díjösszesítő!G44","v":0}]
["Székhelye"]
["Ir.sz.",{"$f":"szerz.irsz","v":0},"helység",{"$f":"Díjösszesítő!H47","v":0},null,"utca",{"$f":"szerz.cim","v":0},"házsz.em.ajtó",{"$f":"szerz.hsz","v":0}]
["Hozzájárulok, hogy a Biztosító az itt megadott, biztosítási titoknak minősülő adataimat, a jelen nyilatkozatban megjelölt Zálogjogosult hitelintézetnek átadja."]
[]
["Biztosított/Zálogkötelezett nyilatkozata"]
["Alulírott Biztosított tájékoztatom az UNION Vienna Insurance Group Biztosító Zrt-t (továbbiakban: Biztosító), hogy a jelen nyomtatványon megjelölt kockázatviselési címen fellelhető vagyontárgyra, mint Zálogtárgyra vonatkozóan köztem – mint Zálogkötelezett – és a lent megjelölt hitelintézet – mint Zálogjogosult – között Zálogszerződés jött létre. Felhatalmazom a Biztosítót, hogy az itt hivatkozott Zálogtárgyra kötött biztosítási szerződésen a Zálogjogosultat megillető hitelbiztosítéki záradékot jegyezzen be."]
["Felhatalmazom a Biztosítót, hogylegfeljebb a biztosított vagyontárgyak biztosítási összegének mértékéig terjedő teljes szolgáltatási összeget, közvetlenül a(z) "]
["Zálogjogosult neve:",null,null,{"$f":"Díjösszesítő!H58","v":0}]
["Székhelye:",null,{"$f":"Díjösszesítő!E60&\" \"&Díjösszesítő!J60&\", \"&Díjösszesítő!V60&\" \"&Díjösszesítő!AI60","v":" ,  "}]
["Zálogjogosult  által vezetett számlára való átutalással teljesítse."]
[]
["Szerződő nyilatkozata"]
["Alulírott Szerződő felhatalmazom a Biztosítót az alábbiakra:"]
["- amennyiben a lentebb megjelölt biztosítási szerződés nem jön létre, úgy ennek tényéről a biztosítási ajánlat elutasításával egyidejűleg tájékoztathassa a Zálogjogosultat."]
{"$rows_left_out":34}
{"sheet":"Verzió","index":9,"n_rows":5,"n_cols":4,"rows_kept":5,"cut":false,"hidden":true,"merged":[]}
[]
[]
[]
[null,"Dátum érvényesség","Verzió","Jelszó"]
[null,"2021-12-31","1.96","Csillagharcosok"]

{"sheet":"elberlista","index":10,"n_rows":45,"n_cols":2,"rows_kept":45,"cut":false,"hidden":true,"merged":[]}
["ELBER besorolás"]
[]
["--- 1. Számítás- és irodatechnikai gépek (kizárólag kockázatviselési helyen), épületgépészethez tartozó elektronikus eszközök ---",3]
["Garázstechnika: sorompó, kapu, jegyautomata",4]
["Helyiségvédő, riasztó és tűzjelző berendezések",5]
["Irodagépek (írógép, számológép, másológép)",6]
["Munkaidő ellenőrző berendezés, beléptető rendszer",7]
["Számítógépek (rendszerek) ",8]
["Telefax készülék ",9]
["Telefon központok",10]
["Telex készülék",11]
[null,12]
["--- 2. Orvosi, kozmetikai és tudományos kutatás gépei ---",13]
["Orvosi berendezések",14]
["Fogorvosi berendezések",15]
["Orvosi computertomográf",16]
["Orvosi nukleáris (izotópos) kezelő berendezések",17]
["Orvosi nukleáris (izotópos) vizsgáló berendezések",18]
["Orvosi röntgen berendezések",19]
["Orvosi ultrahang készülékek",20]
{"$rows_left_out":26}
{"sheet":"geptoreslista","index":11,"n_rows":121,"n_cols":2,"rows_kept":121,"cut":false,"hidden":true,"merged":[]}
["Géptörés besorolás"]
[]
["--- 1) Mezőgazdasági és erdészeti gépek, targoncák ---",3]
["Siló: szabad téren",4]
["Siló: zárt térben",5]
[null,6]
["--- 2) építőipari gépek ---",7]
["aszfaltkeverő telep",8]
["betonkeverő telep",9]
["betonkő-, műkő gyártás gépei",10]
["betonszivattyú",11]
["darabológép",12]
["égető/szárító kemence",13]
["hidraulikus  kalapács",14]
["keverő-, szállító berendezés ",15]
["kő/tégla sajtó",16]
["kőfeldolgozás gépei",17]
["osztályozógép  rosta, szita, ülepítő",18]
["tömörítő (vibrátor): ",19]
["útburkolatfestő",20]
{"$rows_left_out":102}
{"sheet":"allrisklista","index":12,"n_rows":139,"n_cols":2,"rows_kept":139,"cut":false,"hidden":true,"merged":[]}
["All risk gépbiztosítás"]
[]
["--- 1) Mezőgazdasági és erdészeti gépek, targoncák ---",3]
["bálázó",4]
["betakarító gép",5]
["gallyazó gép",6]
["kéregtelenítő gép",7]
["mosó berendezés",8]
["műtrágya/vegyszer szórógép",9]
["rönkszállító jármű",10]
["Siló: szabad téren",11]
["Siló: zárt térben",12]
["talajmegmunkáló gép",13]
["tehergépkocsira szerelt daru",14]
["traktor",15]
["vetőgép",16]
["vontatógép",17]
["zöldtakarmány szárító",18]
[null,19]
["--- 2) építőipari gépek ---",20]
{"$rows_left_out":119}