{"text_format":"1","workbook":"xlsx","n_sheets":5,"sheets":["Biztosítási termékismertetők","Ajánlat1","Ajánlat2","Tarifa","Tevékenységi lista"],"not_rendered":{"charts":1,"images":30,"macros":1,"external_links":0,"defined_names":49,"comments":0,"pivot_tables":0},"unopened":[],"bounds":{"document_bytes":16777216,"sheet_cells":100000,"rows_first":2000,"rows_last":500,"rows_between":2000,"halvings":0,"cell_chars":16384,"cell_head_chars":4096},"cells_cut":0,"cells_raw":0,"read":"whole","date_system":"1900"}

{"sheet":"Biztosítási termékismertetők","index":0,"n_rows":0,"n_cols":0,"rows_kept":0,"cut":false,"hidden":false,"merged":[]}

{"sheet":"Ajánlat1","index":1,"n_rows":178,"n_cols":51,"rows_kept":178,"cut":false,"hidden":false,"merged":[[10,40,10,49],[11,6,11,15],[11,41,11,49],[62,33,62,42],[63,33,63,42],[64,28,64,32],[65,28,65,32],[53,33,53,42],[64,3,64,27],[65,3,65,27],[30,10,30,42],[66,3,66,27],[63,3,63,27],[65,33,65,42],[131,16,132,19],[81,31,81,35],[32,10,32,14],[62,25,62,27],[168,3,168,7],[168,8,168,10],[168,11,168,13],[145,6,145,8],[133,2,133,13],[149,6,149,8],[150,6,150,8],[156,6,156,8],[153,6,153,8],[154,6,154,8],[141,2,141,4],[151,6,151,8],[155,7,155,8],[137,11,137,13],[141,11,141,13],[146,6,146,8],[148,6,148,8],[158,22,158,24],[158,2,158,4],[137,25,137,27],[141,25,141,27],[19,2,19,5],[19,8,19,19],[19,23,19,37],[19,40,19,44],[60,28,60,32],[60,33,60,42],[147,6,147,8],[137,7,137,8],[137,2,137,6],[137,15,137,17],[83,31,83,35],[85,31,85,35],[116,4,116,10],[137,29,137,32],[87,31,87,35],[89,31,89,35],[133,14,133,15],[133,16,133,19],[57,33,57,42],[61,33,61,42],[141,29,141,32],[60,3,60,27],[61,3,61,27],[59,28,59,32],[58,33,58,42],[59,33,59,42],[59,3,59,27],[54,3,54,27],[54,28,54,32],[55,3,55,27],[56,33,56,42],[86,36,90,49],[131,14,132,15],[116,12,116,15],[117,19,117,31],[117,36,117,48],[54,33,54,42],[55,28,55,32],[56,28,56,32],[57,28,57,32],[58,28,58,32],[56,3,56,27],[57,3,57,27],[58,3,58,27],[6,1,6,7],[66,28,66,32],[66,33,66,42],[14,11,14,49],[16,6,16,18],[61,28,61,32],[62,28,62,32],[63,28,63,32],[55,33,55,42],[41,23,41,27],[39,23,39,27],[9,16,9,29],[10,16,10,21],[22,23,22,37],[22,2,22,5],[22,8,22,19],[9,5,9,9],[9,36,9,49],[10,6,10,8],[16,22,16,32],[16,36,16,49],[22,40,22,44],[64,33,64,42],[47,22,47,27]]}
[]
[]
[]
[]
[null,null,"Kötvényszám:"]
[null,null,null,null,null,null,null,null,null,null,null,null,null,null,null,null,null,null,null,null,null,null,null,null,null,null,null,null,null,null,null,null,null,null,null,null,null,null,null,null,null,null,null,null,null,null,null,null,null,null,"UNION-Kis- és középvállalkozások felelősségbiztosítása"]
[null,null,null,null,null,null,null,null,null,null,null,null,null,null,null,null,null,null,null,null,null,null,null,null,null,null,null,null,null,null,null,null,null,null,null,null,null,null,null,null,null,null,null,null,null,null,null,null,null,null,"Biztosítási Ajánlat"]
[]
[]
[null,null,"Módozat",null,null,7810,null,null,null,null,null,"Üzletkötő neve:",null,null,null,null,null,null,null,null,null,null,null,null,null,null,null,null,null,null,null,"Üzletkötő kódja:"]
[null,null,"Átdolgozás:",null,null,null,"nem",null,null,null,null,null,null,null,null,"Előzmény kötv.száma:",null,null,null,null,null,null,null,"Adóigazgatási szám: 1049 1984-2-44",null,null,null,null,null,null,null,null,null,null,null,null,null,null,null,"Ajánlat azonosító:"]
[null,null,"Készítette:",null,null,null,null,null,null,null,null,null,null,null,null,null,null,{"$f":"CONCATENATE(\"    Tel: \",IFERROR(VLOOKUP(G12,D172:K185,7,FALSE),\"\"),\"     E-mail: \",IFERROR(VLOOKUP(G12,D172:K185,4,FALSE),\"\"))","v":"    Tel:      E-mail: "},null,null,null,null,null,null,null,null,null,null,null,null,null,null,null,null,null,null,null,null,"Hiv.szám:"]
[]
[]
[null,null,"Szerződő / Biztosított neve:"]
[]
[null,null,"Adószáma:",null,null,null,null,null,null,null,null,null,null,null,null,null,null,null,null,null,null,"Tel:",null,null,null,null,null,null,null,null,null,null,null,null,null,"E-mail:"]
[]
[null,null,"Székhelye:"]
[null,null,null,null,null,null,"ir.sz.",null,null,null,null,null,null,null,null,null,null,null,null,null,"helység",null,null,null,null,null,null,null,null,null,null,null,null,null,null,null,null,null,"közter.",null,null,null,null,null,null,"hsz.em.ajtó"]
[]
[null,null,"Levelezési Címe:"]
[null,null,null,null,null,null,"ir.sz.",null,null,null,null,null,null,null,null,null,null,null,null,null,"helység",null,null,null,null,null,null,null,null,null,null,null,null,null,null,null,null,null,"közter.",null,null,null,null,null,null,"hsz.em.ajtó"]
[]
[null,null,"Biztosított tevékenység:",null,null,null,null,null,null,null,""]
[]
[null,null,"Területi hatály:"]
[]
[null,null,"Biztosítás tartama:",null,null,null,null,null,null,null,"határozatlan, melyen belül a biztosítási időszak 1 év"]
[]
[null,null,"Biztosítási évforduló:",null,null,null,null,null,null,null,"minden évben a kockázatviselés kezdetének napja, ha ez a nap február 29-e, akkor minden év március 01. napja"]
[]
[null,null,"Kockázatviselés kezdete:"]
[]
[]
[null,null,"Díjfizetés gyakorisága:"]
[]
[null,null,"Díjfizetés módja:",null,null,null,null,null,null,null,"a biztosító által kiállított számviteli bizonylat alapján, átutalással"]
[]
[null,null,"Dolgozói létszám:"]
[]
[null,null,"Díjszámítási alap (éves nettó árbevétel millió Forintban):"]
[]
[null,null,"Kombinált limit:"]
[]
[null,null,"Önrész:"]
[]
[null,null,"Díjtétel:",null,null,null,null,null,null,null,null,null,null,null,null,null,null,null,null,null,null,null,{"$f":"IFERROR(AF88/(X42*1000000)*100,\"\")","v":""}]
[]
[]
[]
[]
[null,null,"Kis- és középvállalkozások felelősségbiztosítása"]
[null,null,"Biztosított kockázatok:",null,null,null,null,null,null,null,null,null,null,null,null,null,null,null,null,null,null,null,null,null,null,null,null,null,null,null,null,null,null,"Éves díj"]
[null,null,null,"Általános felelősségbiztosítás",null,null,null,null,null,null,null,null,null,null,null,null,null,null,null,null,null,null,null,null,null,null,null,null,null,null,null,null,null,{"$f":"AD138","v":""}]
[null,null,null,"Szolgáltatói felelősségbiztosítás",null,null,null,null,null,null,null,null,null,null,null,null,null,null,null,null,null,null,null,null,null,null,null,null,null,null,null,null,null,{"$f":"IF(AC56=\"kérem\",G146,\"\")","v":""}]
[null,null,null,"Szolgáltatói felelősség kiterjesztve a szolgáltatás tárgyára (egyedi záradék szerint)",null,null,null,null,null,null,null,null,null,null,null,null,null,null,null,null,null,null,null,null,null,null,null,null,null,null,null,null,null,{"$f":"IF(AC57=\"kérem\",G147,\"\")","v":""}]
[null,null,null,"Szolgáltatói felelősség kiterjesztve rakodási tevékenységre (egyedi záradék szerint)",null,null,null,null,null,null,null,null,null,null,null,null,null,null,null,null,null,null,null,null,null,null,null,null,null,null,null,null,null,""]
[null,null,null,"Termékfelelősség-biztosítás",null,null,null,null,null,null,null,null,null,null,null,null,null,null,null,null,null,null,null,null,null,null,null,null,null,null,null,null,null,""]
[null,null,null,"Kiterjesztett termékfelelősség-biztosítás",null,null,null,null,null,null,null,null,null,null,null,null,null,null,null,null,null,null,null,null,null,null,null,null,null,null,null,null,null,""]
[null,null,null,"Bérlői felelősségbiztosítás",null,null,null,null,null,null,null,null,null,null,null,null,null,null,null,null,null,null,null,null,null,null,null,null,null,null,null,null,null,""]
[null,null,null,"Bérbeadói felelősségbiztosítás",null,null,null,null,null,null,null,null,null,null,null,null,null,null,null,null,null,null,null,null,null,null,null,null,null,null,null,null,null,""]
[null,null,null,"Munkáltatói felelősségbiztosítás",null,null,null,null,null,null,null,null,null,null,null,null,null,null,null,null,null,null,null,null,"Dolgozói létszám:",null,null,null,null,null,null,null,null,{"$f":"IF(AND(AC63=\"kérem\",Z63>0),AD142,\"\")","v":""}]
[null,null,null,"Környezetszennyezési felelősségbiztosítás",null,null,null,null,null,null,null,null,null,null,null,null,null,null,null,null,null,null,null,null,null,null,null,null,null,null,null,null,null,""]
[null,null,null,"Alvállalkozói fedezet (egyedi záradék szerint)",null,null,null,null,null,null,null,null,null,null,null,null,null,null,null,null,null,null,null,null,null,null,null,null,null,null,null,null,null,""]
[null,null,null,"Építőipari tevékenység fedezete (egyedi záradék szerint)",null,null,null,null,null,null,null,null,null,null,null,null,null,null,null,null,null,null,null,null,null,null,null,null,"kérem",null,null,null,null,"A díj már tartalmazza"]
[null,null,null,"Területi hatály kiterjesztése Európa (egyedi záradék szerint)",null,null,null,null,null,null,null,null,null,null,null,null,null,null,null,null,null,null,null,null,null,null,null,null,"kérem",null,null,null,null,{"$f":"IF(orszag=\"Európa\",G157,\"\")","v":""}]
[]
[]
[]
[]
[]
[]
[]
[]
[]
[]
[]
[]
[null,null,null,null,null,null,null,null,null,null,null,null,null,null,"Biztosítási díjösszesítő "]
[]
[null,null,null,null,null,null,null,null,null,null,null,null,null,null,null,null,"Kis- és középvállalkozások felelősségbiztosítása",null,null,null,null,null,null,null,null,null,null,null,null,null,null,{"$f":"IFERROR(C159,0)","v":0}]
[]
[null,null,null,null,null,null,null,null,null,null,null,null,null,null,null,null,"Éves díj összesen:",null,null,null,null,null,null,null,null,null,null,null,null,null,null,{"$f":"IFERROR(C159,0)","v":0}]
[]
[null,null,null,null,null,null,null,null,null,null,null,null,null,null,null,null,"Díjfizetési gyakoriság miatti engedmény:",null,null,null,null,null,null,null,null,null,null,null,null,null,null,{"$f":"IF(F124=\"éves\",0.05,IF(F124=\"féléves\",0.025,0))","v":0.05}]
[null,null,null,null,null,null,null,null,null,null,null,null,null,null,null,null,null,null,null,null,null,null,null,null,null,null,null,null,null,null,null,null,null,null,null,null,{"$f":"IF(X42>1000,\"1 milliárd forint forgalom felett az ajánlat nem tarifális kategóriába tartozik, ajánlatkérésével kérjük forduljon bizalommal UNION-os kapcsolattartójához.\",\"\")","v":""}]
[null,null,null,null,null,null,null,null,null,null,null,null,null,null,null,null,"Engedménnyel csökkentett éves díj:",null,null,null,null,null,null,null,null,null,null,null,null,null,null,{"$f":"(AF84*(1-(AF86)))","v":0}]
[]
[null,null,null,null,null,null,null,null,null,null,null,null,null,null,null,null,"Gyakoriságnak megfelelő díj:",null,null,null,null,null,null,null,null,null,null,null,null,null,null,{"$f":"IF(F124=\"féléves\",AF88*0.5,IF(F124=\"negyedéves\",AF88*0.25,AF88))","v":0}]
[]
[]
[null,null,null,null,null,null,null,null,null,null,null,null,null,"A biztosított három alábbi mutatója közül legalább kettő meghaladja-e a következő értékeket:"]
[null,null,null,null,null,null,null,null,null,null,null,null,null,"               Mérleg főösszege az 1,5 mrd. Ft-ot"]
[null,null,null,null,null,null,null,null,null,null,null,null,null,"               Nettó üzleti forgalma a 3 mrd. Ft-ot"]
[null,null,null,null,null,null,null,null,null,null,null,null,null,"               Átlagos alkalmazotti létszám az 1.000 főt"]
[]
[null,null,null,null,null,null,null,null,null,null,null,null,null,"Ezúton nyilatkozom, hogy Társaságunk :"]
[]
[]
[]
[]
[null,null,null,null,null,null,null,null,null,null,null,null,null,"minősül."]
[]
[]
[]
[]
[]
[]
[]
[]
[]
[]
[]
[]
[]
[null,null,"Kelt:",null,{"$f":"szerz.lakcimhelyseg","v":0},null,null,null,null,null,null,",",{"$f":"TODAY()","v":"2021-07-01"}]
[null,null,null,null,null,null,null,null,null,null,null,null,null,null,null,null,null,null,null,"Biztosításközvetítő aláírása",null,null,null,null,null,null,null,null,null,null,null,null,null,null,null,null,"Szerződő cégszerű aláírása"]
[]
[]
[null,null,"igen"]
[null,null,"nem"]
[]
[null,null,"éves",null,null,"éves",null,null,null,null,"",null,null,null,null,null,{"$f":"VLOOKUP(K124,Tarifa!B30:D35,3,FALSE)","v":{"$error":"#N/A"}}]
[null,null,"féléves"]
[null,null,"negyedéves"]
[]
[null,null,"kérem",null,null,null,null,null,null,null,"Magyarország",null,null,null,"",null,null,null,null,null,null,null,"szolg.fel + alv.fel"]
[null,null,"nem kérem",null,null,null,null,null,null,null,"Európa",null,null,null,null,null,null,null,null,null,null,null,0,0]
[]
[]
[null,null,null,null,null,null,null,null,null,null,null,null,null,null,"kockázati osztály",null,"munkáltatói felelősség díj /fő"]
[null,null,"Tevékenységi lista"]
[null,null,{"$f":"tev.lista","v":""},null,null,null,null,null,null,null,null,null,null,null,{"$f":"IFERROR(VLOOKUP(Ajánlat1!C134,'Tevékenységi lista'!A2:C298,2,FALSE),\"\")","v":""},null,{"$f":"VLOOKUP(Ajánlat1!C134,'Tevékenységi lista'!A2:C298,3,FALSE)","v":{"$error":"#N/A"}}]
[]
[null,null,null,null,null,null,null,null,null,null,null,null,null,null,null,null,null,null,null,null,null,null,null,null,null,null,null,null,null,null,null,null,null,null,null,null,null,null,null,null,"Kötvény?"]
[null,null,"Általános felelősség biztosítás",null,null,null,null,null,null,null,null,"kock. ezrelék",null,null,null,"Forg. Korr",null,null,null,"Limitkorr",null,null,"Önrész",null,null,"Min. Díj",null,null,null,"Díj",null,null,null,null,null,null,null,null,null,null,false]
[null,null,{"$f":"IF(X42>1000,0,X42)","v":0},null,null,null,null,"mioFt",null,null,null,{"$f":"VLOOKUP(Ajánlat1!O134,Tarifa!B4:C8,2,FALSE)","v":{"$error":"#N/A"}},null,null,null,{"$f":"-0.262*LN(Ajánlat1!C138)+2.2125","v":{"$error":"#NUM!"}},null,null,null,{"$f":"VLOOKUP(K124,Tarifa!B30:C35,2,FALSE)","v":{"$error":"#N/A"}},null,null,{"$f":"VLOOKUP(T124,Tarifa!B40:C44,2,FALSE)","v":{"$error":"#N/A"}},null,null,{"$f":"VLOOKUP(Ajánlat1!O134,Tarifa!$B$50:$C$54,2,FALSE)*VLOOKUP(K124,Tarifa!B30:D35,3,FALSE)","v":{"$error":"#N/A"}},null,null,null,{"$f":"IFERROR(IF(C138*L138*1000*P138*T138*W138>Z138,C138*L138*1000*P138*T138*W138,Z138),\"\")","v":""}]
[]
[]
[null,null,"Munkáltatói felelősségbiztosítás",null,null,null,null,null,null,null,null,"kock. Alapdíj",null,null,null,"Létszám korr",null,null,null,"Limitkorr",null,null,"Önrész",null,null,"Min. Díj",null,null,null,"Díj"]
[null,null,{"$f":"Z63","v":0},null,null,"fő",null,null,null,null,null,{"$f":"Ajánlat1!Q134","v":{"$error":"#N/A"}},null,null,null,{"$f":"VLOOKUP(Ajánlat1!C142,Tarifa!E12:F20,2)","v":1},null,null,null,{"$f":"T138","v":{"$error":"#N/A"}},null,null,{"$f":"W138","v":{"$error":"#N/A"}},null,null,{"$f":"VLOOKUP(Ajánlat1!O134,Tarifa!$B$50:$C$54,2,FALSE)","v":{"$error":"#N/A"}},null,null,null,{"$f":"IF(C138>0,IF(C142=0,\"\",IF(P142=0,0,IF(C142*L142*P142*T142*W142>Z142,C142*L142*P142*T142*W142,Z142))),\"\")","v":""}]
[]
[]
[null,null,null,null,null,"Kiegészítők"]
[null,null,null,null,null,{"$f":"IF(Ajánlat1!AC56=$C$128,Tarifa!C70,0)","v":0},{"$f":"IFERROR(Ajánlat1!$AD$138*Ajánlat1!F146,\"\")","v":""}]
[null,null,null,null,null,{"$f":"IF(Ajánlat1!AC57=$C$128,Tarifa!C71,0)","v":0},{"$f":"IFERROR(Ajánlat1!$AD$138*Ajánlat1!F147,\"\")","v":""}]
[null,null,null,null,null,{"$f":"IF(Ajánlat1!AC58=$C$128,Tarifa!C72,0)","v":0},{"$f":"IFERROR(Ajánlat1!$AD$138*Ajánlat1!F148,\"\")","v":""}]
[null,null,null,null,null,{"$f":"IF(Ajánlat1!AC59=$C$128,Tarifa!C73,0)","v":0},{"$f":"IFERROR(Ajánlat1!$AD$138*Ajánlat1!F149,\"\")","v":""}]
[null,null,null,null,null,{"$f":"IF(Ajánlat1!AC60=$C$128,Tarifa!C74,0)","v":0},{"$f":"IFERROR(Ajánlat1!$AD$138*Ajánlat1!F150,\"\")","v":""}]
[null,null,null,null,null,{"$f":"IF(Ajánlat1!AC61=$C$128,Tarifa!C75,0)","v":0},{"$f":"IFERROR(Ajánlat1!$AD$138*Ajánlat1!F151,\"\")","v":""}]
[null,null,null,null,null,{"$f":"IF(Ajánlat1!AC62=$C$128,Tarifa!C76,0)","v":0},{"$f":"IFERROR(Ajánlat1!$AD$138*Ajánlat1!F152,\"\")","v":""}]
[null,null,null,null,null,{"$f":"IF(Ajánlat1!AC63=$C$128,Tarifa!C77,0)","v":0}]
[null,null,null,null,null,{"$f":"IF(Ajánlat1!AC64=$C$128,Tarifa!C78,0)","v":0},{"$f":"IFERROR(Ajánlat1!$AD$138*Ajánlat1!F154,\"\")","v":""}]
[null,null,null,null,null,{"$f":"IF(Ajánlat1!AC65=$C$128,Tarifa!C79,0)","v":0},{"$f":"IFERROR(($AD$138+G146+G147+G148)*F155,\"\")","v":""}]
[null,null,null,null,null,{"$f":"IF(Ajánlat1!AC66=$C$128,Tarifa!C80,0)","v":1}]
[null,null,null,null,null,{"$f":"IF(orszag=\"Európa\",Tarifa!C81,0)","v":0},{"$f":"IFERROR(Ajánlat1!$AD$138*Ajánlat1!F157,\"\")","v":""}]
[null,null,"Kieg Díj",null,null,null,null,null,null,null,null,null,null,null,null,null,null,null,null,null,null,null,"Éves Díj"]
[null,null,{"$f":"AD138+G146+G147+G148+G149+G150+G151+G152+G154+G155+G157+IF(F153=1,AD142,0)","v":{"$error":"#VALUE!"}},null,null,null,null,null,null,null,null,null,null,null,null,null,null,null,null,null,null,null,{"$f":"Ajánlat1!C159","v":{"$error":"#VALUE!"}}]
[]
[]
[]
[]
[]
[]
[]
[]
[null,null,null,"Lejárati Dátum",null,null,null,null,"Verzió",null,null,"lejárati jelszó"]
[null,null,null,"2021-12-31",null,null,null,null,"v1.96",null,null,"felelosseg"]
[]
[]
[null,null,null,"Ambrus Péter",null,null,"ambrus.peter@unionbiztosito.hu",null,null,"666-7656"]
[null,null,null,"Árokszállási Zoltán",null,null,"ajanlatkeres@unionbiztosito.hu",null,null,"486-4366"]
[null,null,null,"Csanádi Zoltán",null,null,"csanadi.zoltan@unionbiztosito.hu",null,null,"486-4235"]
[null,null,null,"Dobi László",null,null,"dobi.laszlogabor@unionbiztosito.hu",null,null,"486-4346"]
[null,null,null,"Hajdók Viktória",null,null,"hajdok.viktoria@unionbiztosito.hu",null,null,"486-4213"]
[null,null,null,"Klinger József",null,null,"klinger.jozsef@unionbiztosito.hu",null,null,"486-4232"]
[null,null,null,"Utry Oszkár",null,null,"ajanlatkeres@unionbiztosito.hu",null,null,"666-7652"]

{"sheet":"Ajánlat2","index":2,"n_rows":92,"n_cols":12,"rows_kept":92,"cut":false,"hidden":false,"merged":[[89,1,89,2],[34,1,34,9],[46,1,46,9],[59,1,59,9],[50,1,50,9],[37,1,37,9],[85,2,85,9],[54,1,54,9],[57,1,57,9],[87,2,87,9],[37,11,37,17],[68,1,68,9],[81,2,81,9],[82,2,82,9],[77,1,77,9],[79,2,79,9],[80,2,80,9],[65,3,65,8],[91,3,91,8],[90,3,90,8],[20,3,20,5],[23,3,23,5],[25,3,25,5],[73,1,73,9],[70,1,70,9],[33,1,33,9],[41,1,41,9],[42,1,42,9],[39,1,39,9],[35,1,35,9],[62,1,62,9],[48,1,48,9],[52,1,52,9],[53,1,53,9]]}
[null,"Kis és középvállallatok felelősségbiztosítása",null,null,null,null,null,null,null,null,null,"SZÍNKÓDOK, MAGYARÁZATOK"]
[null,"Biztosított kockázatok:","Általános felelősségbiztosítás"]
[null,null,"valamint:"]
[null,"Szolgáltatói felelősségbiztosítás",null,null,null,null,null,null,null,null,null,"innentől választható / legördülő menü"]
[null,"Szolgáltatói felelősség kiterjesztve a szolgáltatás tárgyára (egyedi záradék szerint)",null,null,null,null,null,null,null,null,null,"csak akkor választható, ha a szolg fel korábban kiválasztásra került"]
[null,"Szolgáltatói felelősség kiterjesztve rakodási tevékenységre (egyedi záradék szerint)",null,null,null,null,null,null,null,null,null,"csak akkor választható, ha a szolg fel korábban kiválasztásra került"]
[null,"Termékfelelősség-biztosítás"]
[null,"Kiterjesztett termékfelelősség-biztosítás",null,null,null,null,null,null,null,null,null,"csak akkor választható, ha a term fel korábban kiválasztásra került"]
[null,"Bérlői felelősségbiztosítás"]
[null,"Bérbeadói felelősségbiztosítás"]
[null,"Munkáltatói felelősségbiztosítás"]
[null,"Környezetszennyezési felelősségbiztosítás"]
[null,"Alvállalkozói fedezet (egyedi záradék szerint)"]
[null,"Építőipari tevékenység fedezete (egyedi záradék szerint)",null,null,null,null,null,null,null,null,null,"ha 5-ös kock. osztály, ez feljön, ÉS az önrész kötelezően min. 10%, de min 100 000 Ft/kár"]
[null,"Területi hatály kiterjesztése Európa (egyedi záradék szerint)",null,null,null,null,null,null,null,null,null,"ha Európa"]
[]
[null,"Dolgozói létszám:",null,14,"fő",null,null,null,null,null,null,"opcionálisan (munk fel esetén) kitöltendő mező"]
[]
[null,"Díjszámítási alap (éves bruttó forgalom):",null,2465,"MFt",null,null,null,null,null,null,"kötelezően kitöltendő mező"]
[]
[null,"Kombinált limit:",null,"5 MFt/kár, 10 MFt/év",null,null,null,null,null,null,null,"választható limitek legördülő menüben"]
[]
[]
[null,"Önrész:",null,"10 %, de min. 25 000 Ft",null,null,null,null,null,null,null,"választható önrészek legördülő menüben"]
[]
[null,"Díjtétel:",null,{"$f":"D28/(D19*1000000)*100","v":{"$error":"#VALUE!"}},null,null,null,null,null,null,null,"háttértábla (tarifáló) alapján"]
[]
[null,"Éves díj:",null,{"$f":"Ajánlat1!C159","v":{"$error":"#VALUE!"}},null,null,null,null,null,null,null,"háttértábla (tariáfló) alapján"]
[]
[null,"Biztosítási feltételek"]
[]
[null,"Felelősségbiztosítások Szerződési Feltételei (U70060)"]
[null,"Általános felelősségbiztosítási feltételek (U71028)"]
[null,"Szolgáltatói felelősségbiztosítás Különös Biztosítási Feltételek (U71029)",null,null,null,null,null,null,null,null,null,"ha építőipari tevékenység fedezetét választja, akkor ez jön föl az A38 helyett"]
[null,"Általános felelősségbiztosítás feltételei, a 3./h.) pontban írt kizáró rendelkezés első fordulatának feloldása mellett azzal, hogy az épületek, építmények repedéseivel összefüggésben bekövetkezett károkra, valamint az épületben, építményben vibráció, vagy – a föld-, illetve egyéb támaszt is ideértve – teherhordó elem eltávolítása, meggyengítése, vagy megépítésének elmaradása miatt bekövetkező károkra vonatkozó kizárás változatlanul hatályban marad.",null,null,null,null,null,null,null,null,null,"innentől akkor jönnek föl, ha fent kiválasztásra kerültek"]
[null,"Szolgáltatói felelősségbiztosítás különös feltételei, a 3./i.) pontban írt kizáró rendelkezés első fordulatának feloldása mellett azzal, hogy az épületek, építmények repedéseivel összefüggésben bekövetkezett károkra, valamint az épületben, építményben vibráció, vagy – a föld-, illetve egyéb támaszt is ideértve – teherhordó elem eltávolítása, meggyengítése, vagy megépítésének elmaradása miatt bekövetkező károkra vonatkozó kizárás változatlanul hatályban marad.",null,null,null,null,null,null,null,null,null,"ha építőipari tevékenység fedezetét választja, akkor ez jön föl az A41 helyett"]
[]
[null,"Szolgáltatás tárgyában okozott károk egyedi záradéka\n1. A szolgáltatói felelősségbiztosítási fedezet - a Szolgáltatói felelősségbiztosítás különös feltételei 3.f.) pontjában, valamint e körben (a letéti felelősséget ide nem értve) a 3.e.) pontjában írt kizáró rendelkezések feloldása, de egyéb rendelkezései változatlan alkalmazása mellett - kiterjed azokban a dolgokban keletkezett károkra is, amelyek a szolgáltatás tárgyát képezik, illetve amelyekre a biztosított szolgáltatása irányul. \n2. Nem terjed ki a biztosítási fedezet \na) az olyan vagyontárgyak káraira, melyek a szolgáltatás megkezdésekor már sérültek, hibásak, elhasználódottak voltak, vagy egyéb okból cserére szorultak, \nb) az esztétikai károkra, \nc) a szolgáltatás korszerűtlenségével összefüggő kártérítési igényekre.\nA jelen egyedi záradékban nem szabályozott kérdések tekintetében a Felelősségbiztosítások Szerződési Feltételei, a Szolgáltatói felelősségbiztosítás különös biztosítási feltételei, valamint a mindenkor hatályos magyar jogszabályok vonatkozó rendelkezései irányadóak.",null,null,null,null,null,null,null,null,null,"a fedezet választása esetén \"feljön\""]
[]
[null,"Rakodási szolgáltatást nyújtók felelősségbiztosításának egyedi záradéka\nA jelen Egyedi Záradék alkalmazásában biztosítási esemény az idegen gépjárműre, illetve gépjárműről történő le- és felrakodás során az idegen gépjárműben okozott dologi kár, abban az esetben is, ha a rakodás daruval, illetve targoncával történt. \nA fedezet kiterjed a telephelyen daruval, illetve targoncával harmadik személyeknek okozott egyéb dologi károkra is, ide nem értve a rakodott áruban okozott kárt. \nA jelen Egyedi Záradékban nem szabályozott kérdések tekintetében a Szolgáltatói felelősségbiztosítás különös feltételeinek rendelkezései irányadóak.\n",null,null,null,null,null,null,null,null,null,"a fedezet választása esetén \"feljön\""]
[]
[null,"Termékfelelősség-biztosítás Különös Biztosítási Feltételek (U70061)",null,null,null,null,null,null,null,null,null,"a fedezet választása esetén \"feljön\""]
[null,"Kiterjesztett termékfelelősség-biztosítás Kiegészítő Biztosítási Feltételek (U70062)",null,null,null,null,null,null,null,null,null,"a fedezet választása esetén \"feljön\""]
[null,"Bérlői felelősségbiztosítás különös biztosítási feltételek (U71034)",null,null,null,null,null,null,null,null,null,"a fedezet választása esetén \"feljön\""]
[null,"Bérbeadói felelősségbiztosítás különös biztosítási feltételek (U71033)",null,null,null,null,null,null,null,null,null,"a fedezet választása esetén \"feljön\""]
[null,"Munkáltatói felelősségbiztosítás különös biztosítási feltételek (U70063/1)",null,null,null,null,null,null,null,null,null,"a fedezet választása esetén \"feljön\""]
[null,"Környezetszennyezési felelősségbiztosítás különös biztosítási feltételek (U71032)",null,null,null,null,null,null,null,null,null,"a fedezet választása esetén \"feljön\""]
[]
[null,"Az általános felelősségbiztosítási fedezet kiterjesztése alvállalkozókra\nAz általános felelősségbiztosítási fedezet a szerződésben írt limit erejéig, a vonatkozó feltételek változatlan alkalmazása mellett kiterjed a biztosított alvállalkozóira is, amennyiben a kárt a biztosított alvállalkozójaként eljárva, ebbéli minőségükben okozták.\nA jelen felelősségbiztosítási fedezet annyiban áll fönn, amennyiben a kár más biztosítási fedezet (elsődleges fedezet) alapján nem térül meg. A jelen felelősségbiztosítás elsődleges fedezet fennállta esetén a kárra csak annyiban nyújt fedezetet, amennyiben az elsődleges fedezet a biztosítási esemény bekövetkezte előtt bármely okból megszűnt, vagy a biztosítási feltételek eltérő rendelkezése miatt az elsődleges fedezet alapján szolgáltatás nyújtására nem kerül sor, vagy a limit alacsonyabb volta miatt az elsődleges fedezet alapján nyújtott szolgáltatás részleges.\nA biztosító által nyújtott alvállalkozói fedezet nem szélesebb, mint a vonatkozó feltételek alapján a biztosított számára nyújtott fedezet. \nNem terjed ki a fedezet ezen alvállalkozók további alvállalkozóira, valamint a biztosítottak egymásnak okozott káraira. \n",null,null,null,null,null,null,null,null,null,"alvállalkozói fedezet esetén \"feljön\""]
[]
[null,"A szolgáltatói felelősségbiztosítási fedezet kiterjesztése alvállalkozókra\nA szolgáltatói felelősségbiztosítási fedezet a szerződésben írt limit erejéig, a vonatkozó feltételek változatlan alkalmazása mellett kiterjed a biztosított alvállalkozóira is, amennyiben a kárt a biztosított alvállalkozójaként eljárva, ebbéli minőségükben okozták.\nA jelen felelősségbiztosítási fedezet annyiban áll fönn, amennyiben a kár más biztosítási fedezet (elsődleges fedezet) alapján nem térül meg. A jelen felelősségbiztosítás elsődleges fedezet fennállta esetén a kárra csak annyiban nyújt fedezetet, amennyiben az elsődleges fedezet a biztosítási esemény bekövetkezte előtt bármely okból megszűnt, vagy a biztosítási feltételek eltérő rendelkezése miatt az elsődleges fedezet alapján szolgáltatás nyújtására nem kerül sor, vagy a limit alacsonyabb volta miatt az elsődleges fedezet alapján nyújtott szolgáltatás részleges.\nA biztosító által nyújtott alvállalkozói fedezet nem szélesebb, mint a vonatkozó feltételek alapján a biztosított számára nyújtott fedezet. \nNem terjed ki a fedezet ezen alvállalkozók további alvállalkozóira, valamint a biztosítottak egymásnak okozott káraira. \n",null,null,null,null,null,null,null,null,null,"csak akkor jön fel, ha a szolg fel és az alvállalkozói fedezet korábban kiválasztásra került"]
[]
[null,"Építőipari tevékenység fedezetének egyedi záradéka"]
[null,"A felelősségbiztosítási fedezet annyiban áll fönn, amennyiben a kár más biztosítási fedezet (elsődleges fedezet) alapján nem térül meg. A jelen felelősségbiztosítás elsődleges fedezet fennállta esetén a kárra csak annyiban nyújt fedezetet, amennyiben az elsődleges fedezet a biztosítási esemény bekövetkezte előtt bármely okból megszűnt, vagy a biztosítási feltételek eltérő rendelkezése miatt az elsődleges fedezet alapján szolgáltatás nyújtására nem kerül sor, vagy a limit alacsonyabb volta miatt az elsődleges fedezet alapján nyújtott szolgáltatás részleges."]
[null,"A biztosítási fedezet nem terjed ki az alábbi tevékenységekre:"]
[null,"1.     bontási munka,"]
[null,"2.     gépi földmunka,"]
[null,"3.     tetőcsere, tetőjavítás, a héjazat megbontásával járó munka, tetőtér-beépítés,"]
[null,"4.     ún. foghíjbeépítés,"]
[null,"5.     mélyépítési tevékenység, illetve a vonalas létesítményeken végzett munkák,\n6.    az egyszerű bejelentéshez kötött építési tevékenységhez kapcsolódó fővállalkozói kivitelezői \n       tevékenység,\n7.    napelem, napkollektor szerelése.",null,null,null,null,null,null,null,null,null,"5-ös kockázati osztály esetén kötelező (feljön)"]
[]
[null,"A biztosítási fedezet területi hatályának kiterjesztése Európa területére",null,null,null,null,null,null,null,null,null,"Ha Európa"]
[null,"A biztosítás területi hatálya kiterjed az Európa területén okozott, illetve bekövetkezett károkra is."]
[]
[]
[null,null,null,"Szerződő cégszerű aláírása"]
[]
[]
[null,"EGYÉB"]
[]
[null,"A biztosítási szerződésre a fentiekben hivatkozott biztosítási feltételek és az ajánlatban foglalt egyedi záradékok együttesen vonatkoznak.\nA Biztosító nem nyújt fedezetet, nem teljesít kárkifizetést, valamint nem nyújt szolgáltatást, amennyiben ezen fedezet nyújtásával, illetve kár kifizetésével a Biztosító sértené  az Egyesült Nemzetek Szervezetének határozata szerinti bármely szankcióit, rendelkezéseit, vagy rendeleteit,  valamint Magyarország, az Európai Unió, illetve az Egyesült Államok kereskedelmi, pénzügyi embargóit vagy gazdasági szankcióit, törvényeit vagy rendeleteit, (feltéve, hogy ezek nem sértik az biztosítóra alkalmazandó szabályozásokat vagy nemzeti jogszabályokat).\n\nNem terjed ki a biztosítás azokra a károkra, amelyek bármilyen (bakteriális, vírusos, stb.) kórokozói eredetű járványos megbetegedéssel, betegséggel, vagy fertőzéssel összefüggésben következnek be, és amelyek a kórokozó bármely fajtájától, mutációjától, illetve variánsától származnak."]
[]
[null,"Díjfizetési engedmény:"]
[null,"Amennyiben a szerződő/biztosított a biztosítási díjat az alábbi díjfizetési gyakorisággal egyenlíti ki, akkor a biztosító a számára a fentiekben megállapított biztosítási díjakból az alábbi díjfizetési engedményeket nyújtja:"]
[null," - éves díjfizetés esetén: 5,0%"]
[null," - féléves díjfizetés esetén: 2,5%."]
[]
[null,"Ajánlatot teszek a túloldalon részletezett biztosításra, amelynek alapján az Union Vienna Insurance Group Biztosító Zrt. azt a kötelezettséget vállalja, hogy díjfizetés ellenében készpénzben megtéríti a különös feltételekben felsorolt biztosítási események során bekövetkező azon károkat, amelyekre a biztosítási szerződés kiterjed. Kijelentem, hogy az ajánlattétel előtt biztosítási igényem felmérése nyomán a vonatkozó termékismertetőket átvettem, áttanulmányoztam és megértettem, a jogszabályban előírt tájékoztatást megkaptam, a biztosítási feltételeket átvettem, áttanulmányoztam és megértettem.\nKijelentem, hogy az Adatkezelési tájékoztató a biztosítási ajánlat aláírását megelőzően részemre átadásra került, és tudomással bírok arról, hogy ezen dokumentum a biztosító honlapján (www.union.hu) bármikor megtekinthető."]
[]
[null,"Tudomásul veszem, hogy:","- jelen ajánlat a biztosító kockázatelbírálásának alapja, továbbá, hogy a biztosítónak az ajánlat beérkezésétől számított 15 nap áll rendelkezésére a kockázat elbírálására,"]
[null,null,"- a biztosító a kockázatelbírálás eredményeként az ajánlatot jogosult elutasítani, az elutasítást nem köteles megindokolni."]
[]
[]
[]
[]
[null,"Kijelentem, hogy:","- a Felelősségbiztosítások Szerződési Feltételeiben, az Általános Felelősségi Feltételekben és a Különös Felelősségbiztosítási Feltételekben foglaltakat az ajánlat aláírása előtt megismertem,"]
[null,null,"- a közölt adatok a valóságnak megfelelnek,"]
[null,null,"- jelen ajánlatomban minden biztosítási szándékommal kapcsolatos igényemet rögzítettek, más szóbeli megállapodás nem történt."]
[]
[null,{"$f":"\"Kelt: \" & keltez & \", \" & TEXT(keltdat, \"ÉÉÉÉ.hh.nn\")","v":"Kelt: 0, 2021.07.01"}]
[null,null,null,"Szerződő cégszerű aláírása"]
[null,null,null,"UNION Vienna Insurance Group Biztosító Zrt."]

{"sheet":"Tarifa","index":3,"n_rows":2086,"n_cols":11,"rows_kept":2086,"cut":false,"hidden":true,"merged":[[47,2,47,3]]}
[null,null,null,null,null,null,null,null,"Összeadás","4/a + 6 + 4/b"]
["1/a","Általános felelősségbiztosítás díjtételek (ezrelék):",null,"1/b","Munkáltatói felelősségbiztosítás alapdíj /fő kockázati osztályonként:","Ft"]
[null,"kockázati osztály","ezrelék",null,"kockázati osztály",null,null,null,null,"Díjfizetési gyakoriság kedvezménye:"]
[null,1,0.24,null,1,600,null,null,null,"féléves","2,5%"]
[null,2,0.3,null,2,1200,null,null,null,"éves","5%"]
[null,3,0.33,null,3,1800]
[null,4,0.45,null,4,2400]
[null,5,0.84,null,5,4200]
[]
[]
["2/a","Forgalom megadása / forgalomkorrekció (függvény)",null,"2/b","Létszámkorrekció (fő):"]
[null,"=-0,262*LN(x)+2,2125",null,null,0,1]
[null,null,null,null,11,0.98]
[null,null,null,null,26,0.95]
[null,null,null,null,51,0.9]
[null,null,null,null,76,0.85]
[null,null,null,null,101,0.8]
[null,null,null,null,151,0.77]
[null,null,null,null,201,0.73]
[null,null,null,null,251,0]
[]
[]
[]
[]
[]
[]
[]
["3/a és 3/b","Limit kiválasztása / limitkorrekció:"]
[null,"mioFt/kár/év","Limitkorrekció:"]
[null,"5 MFt/kár, 10 MFt/év",0.8,1]
[null,"10 MFt/kár, 20 MFt/év",1,1.25]
[null,"20 MFt/kár, 40 MFt/év",1.4,1.75]
[null,"25 MFt/kár, 50 MFt/év",1.55,1.94]
[null,"30 MFt/kár, 60 MFt/év",1.7,2.13]
[null,"50 MFt/kár, 100 MFt/év",2.0499999999999998,2.56]
[]
[]
["4/a és 4/b","Önrész kiválasztása / önrészkorrekció:"]
[null,null,"Önrészkorrekció:"]
[null,"10 %, de min. 25 000 Ft",1]
[null,"10 %, de min. 50 000 Ft",0.95]
[null,"10 %, de min. 100 000 Ft",0.85]
[null,"10 %, de min. 250 000 Ft",0.65]
[null,"10 %, de min. 500 000 Ft",0.5]
[]
[]
[]
[5,"Minimáldíj figyelembe vétele (általános és munkáltatói felelősségbiztosítás):","4/a és 4/b összevetése a minimáldíjjal"]
[null,"kockázati osztály"]
[null,1,12000]
[null,2,16000.000000000002]
[null,3,17500.000000000004]
[null,4,24000.000000000004]
[null,5,67500.000000000015]
[]
[]
[]
[6,"Fedezeti \"szorzók\" (pl.: 0,5 szorzó = +50% díj)","alap a 2/a \"szám\" vagy a 3 (ált. fel. min. díj)"]
[null,"bérlői felelősség",0.3]
[null,"bérbeadói felelősség",0.3]
[null,"szolgáltatói felelősség",0.8]
[null,"szolgáltatói felelősség kiterjesztve a szolgáltatás tárgyára",0.4]
[null,"szolgáltatói felelősség kiterjesztve rakodási tevékenységre",0.4]
[null,"termékfelelősség",0.8]
[null,"kiterjesztett termékfelelősség",1]
[null,"környezetszennyezési felelősség",0.5]
[null,"területi hatály kiterjesztése Európa",0.5]
[null,"alvállalkozói fedezet",0.2]
[]
[null,"Szolgáltatói felelősségbiztosítás",0.8]
[null,"Szolgáltatói felelősség kiterjesztve a szolgáltatás tárgyára (egyedi záradék szerint)",0.4]
[null,"Szolgáltatói felelősség kiterjesztve rakodási tevékenységre (egyedi záradék szerint)",0.4]
[null,"Termékfelelősség-biztosítás",0.8]
[null,"Kiterjesztett termékfelelősség-biztosítás",1]
[null,"Bérlői felelősségbiztosítás",0.3]
[null,"Bérbeadói felelősségbiztosítás",0.3]
[null,"Munkáltatói felelősségbiztosítás",1]
[null,"Környezetszennyezési felelősségbiztosítás",0.5]
[null,"Alvállalkozói fedezet (egyedi záradék szerint)",0.2]
[null,"Építőipari tevékenység fedezete (egyedi záradék szerint)",1]
[null,"Területi hatály kiterjesztése Európa (egyedi záradék szerint)",0.5]
[]
[null,null,null,null,null,null,null,"dt.","Min.díj"]
[null,null,null,null,null,"Kock. Oszt.",2,{"$f":"VLOOKUP(G84,B4:C8,2,FALSE)","v":0.3},{"$f":"VLOOKUP(G84,B50:C54,2,FALSE)","v":16000.000000000002}]
[]
[]
[null,null,null,null,null,{"$f":"-0.262*LN(G87)+2.2125","v":2.2124999999999999},{"$f":"+G88-1","v":1},2,{"$f":"$H$84*F87*1000*G87","v":663.75}]
[null,null,null,null,null,2.0308954386932943,2,2,1218.5372632159765]
[null,null,null,null,null,1.9246635803689551,3,2,1732.1972223320595]
[null,null,null,null,null,1.8492908773865886,4,2,2219.1490528639065]
[null,null,null,null,null,1.7908272669422656,5,2,2686.2409004133979]
[null,null,null,null,null,1.7430590190622495,6,2,3137.5062343120489]
[null,null,null,null,null,1.7026715409475077,7,2,3575.6102359897659]
[null,null,null,null,null,1.6676863160798829,8,2,4002.4471585917186]
[null,null,null,null,null,1.6368271607379103,9,2,4419.4333339923578]
[null,null,null,null,null,1.6092227056355599,10,2,4827.6681169066787]
[null,null,null,null,null,1.5842514385268269,11,1.8,5228.0297471385284]
[null,null,null,null,null,1.5614544577555438,12,1.8,5621.2360479199579]
[null,null,null,null,null,1.5404832683450773,13,1.8,6007.8847465458002]
[null,null,null,null,null,1.5210669796408021,14,1.8,6388.4813144913687]
[null,null,null,null,null,1.5029908473112208,15,1.8,6763.4588129004933]
[null,null,null,null,null,1.4860817547731773,16,1.8,7133.192422911251]
[null,null,null,null,null,1.4701981038572711,17,1.8,7498.0103296720827]
[null,null,null,null,null,1.4552225994312047,18,1.8,7858.2020369285055]
[null,null,null,null,null,1.4410569874583925,19,1.8,8214.0248285128364]
[null,null,null,null,null,1.4276181443288543,20,1.8,8565.7088659731253]
[null,null,null,null,null,1.4148351213164632,21,1.8,8913.4612642937191]
[null,null,null,null,null,1.402646877220121,22,1.8,9257.469389652797]
[null,null,null,null,null,1.3910005154265628,23,1.8,9597.9035564432834]
[null,null,null,null,null,1.3798498964488379,24,1.8,9934.9192544316338]
[null,null,null,null,null,1.3691545338845312,25,1.8,10268.659004133984]
[null,null,null,null,null,1.3588787070383717,26,1.45,10599.253914899298]
[null,null,null,null,null,1.3489907411068658,27,1.45,10926.825002965612]
[null,null,null,null,null,1.3394624183340964,28,1.45,11251.484314006409]
[null,null,null,null,null,1.3302684925435435,29,1.45,11573.335885128829]
[null,null,null,null,null,1.3213862860045151,30,1.45,11892.476574040636]
[null,null,null,null,null,1.3127953524248914,31,1.45,12208.996777551491]
[null,null,null,null,null,1.3044771934664716,32,1.45,12522.981057278126]
[null,null,null,null,null,1.2964150188957819,33,1.45,12834.508687068239]
[null,null,null,null,null,1.2885935425505655,34,1.45,13143.654134015767]
[null,null,null,null,null,1.2809988078897736,35,1.45,13450.487482842624]
[null,null,null,null,null,1.273618038124499,36,1.45,13755.074811744589]
[null,null,null,null,null,1.2664395068872132,37,1.45,14057.478526448065]
[null,null,null,null,null,1.2594524261516868,38,1.45,14357.757658129231]
[null,null,null,null,null,1.2526468487140325,39,1.45,14655.968129954179]
[null,null,null,null,null,1.2460135830221486,40,1.45,14952.162996265783]
[null,null,null,null,null,1.2395441185234712,41,1.45,15246.392657838696]
[null,null,null,null,null,1.2332305600097575,42,1.45,15538.705056122944]
[null,null,null,null,null,1.2270655696882864,43,1.45,15829.145848978895]
[null,null,null,null,null,1.2210423159134156,44,1.45,16117.758570057087]
[null,null,null,null,null,1.2151544276801762,45,1.45,16404.584773682378]
[null,null,null,null,null,1.2093959541198569,46,1.45,16689.664166854021]
[null,null,null,null,null,1.2037613283519646,47,1.45,16973.034729762701]
[null,null,null,null,null,1.1982453351421325,48,1.45,17254.732826046704]
[null,null,null,null,null,1.1928430818950158,49,1.45,17534.793303856732]
[null,null,null,null,null,1.1875499725778256,50,1.45,17813.249588667382]
[null,null,null,null,null,1.1823616842262266,51,1.1000000000000001,18090.133768661268]
[null,null,null,null,null,1.1772741457316658,52,1.1000000000000001,18365.476673413988]
[null,null,null,null,null,1.1722835186493439,53,1.1000000000000001,18639.307946524568]
[null,null,null,null,null,1.1673861798001599,54,1.1000000000000001,18911.65611276259]
[null,null,null,null,null,1.1625787054690924,55,1.1000000000000001,19182.54864024002]
[null,null,null,null,null,1.1578578570273907,56,1.1000000000000001,19452.011998060163]
[null,null,null,null,null,1.1532205678273477,57,1.1000000000000001,19720.071709847649]
[null,null,null,null,null,1.1486639312368381,58,1.1000000000000001,19986.752403520979]
[null,null,null,null,null,1.1441851896967012,59,1.1000000000000001,20252.077857631615]
[null,null,null,null,null,1.1397817246978095,60,1.1000000000000001,20516.071044560569]
[null,null,null,null,null,1.1354510475865922,61,1.1000000000000001,20778.754170834636]
[null,null,null,null,null,1.1311907911181858,62,1.1000000000000001,21040.148714798252]
[null,null,null,null,null,1.1269987016854184,63,1.1000000000000001,21300.275461854406]
[null,null,null,null,null,1.122872632159766,64,1.1000000000000001,21559.154537467508]
[null,null,null,null,null,{"$f":"-0.262*LN(G151)+2.2125","v":1.118810535287343},65,1.1000000000000001,{"$f":"$H$84*F151*1000*G151","v":21816.805438103183}]
[null,null,null,null,null,1.1148104575890765,66,1.1000000000000001,22073.247060263715]
[null,null,null,null,null,1.1108705337195668,67,1.1000000000000001,22328.497727763293]
[null,null,null,null,null,1.1069889812438598,68,1.1000000000000001,22582.575217374739]
[null,null,null,null,null,1.1031640957955178,69,1.1000000000000001,22835.496782967217]
[null,null,null,null,null,1.0993942465830677,70,1.1000000000000001,23087.279178244422]
[null,null,null,null,null,1.0956778722151752,71,1.1000000000000001,23337.938678183233]
[null,null,null,null,null,1.0920134768177934,72,1.1000000000000001,23587.491099264338]
[null,null,null,null,null,1.0883996264191214,73,1.1000000000000001,23835.951818578757]
[null,null,null,null,null,1.0848349455805073,74,1.1000000000000001,24083.335791887261]
[null,null,null,null,null,1.0813181142534867,75,1.1000000000000001,24329.65757070345]
[null,null,null,null,null,1.0778478648449812,76,1.1000000000000001,24574.931318465569]
[null,null,null,null,null,1.0744229794743345,77,1.1000000000000001,24819.170825857127]
[null,null,null,null,null,1.0710422874073269,78,1.1000000000000001,25062.389525331448]
[null,null,null,null,null,1.0677046626536402,79,1.1000000000000001,25304.600504891274]
[null,null,null,null,null,1.0644090217154429,80,1.1000000000000001,25545.816521170629]
[null,null,null,null,null,1.0611543214758208,81,1.1000000000000001,25786.050011862444]
[null,null,null,null,null,1.0579395572167656,82,1.1000000000000001,26025.313107532431]
[null,null,null,null,null,1.0547637607572911,83,1.1000000000000001,26263.617642856549]
[null,null,null,null,null,1.0516259987030518,84,1.1000000000000001,26500.975167316905]
[null,null,null,null,null,1.048525370799537,85,1.1000000000000001,26737.396955388194]
[null,null,null,null,null,1.045461008381581,86,1.1000000000000001,26972.894016244787]
[null,null,null,null,null,1.042432072912499,87,1.1000000000000001,27207.477103016223]
[null,null,null,null,null,1.0394377546067097,88,1.1000000000000001,27441.156721617135]
[null,null,null,null,null,1.0364772711301793,89,1.1000000000000001,27673.94313917579]
[null,null,null,null,null,1.0335498663734703,90,1.1000000000000001,27905.846392083698]
[null,null,null,null,null,1.0306548092925851,91,1.1000000000000001,28136.876293687576]
[null,null,null,null,null,1.0277913928131512,92,1.1000000000000001,28367.042441642974]
[null,null,null,null,null,1.0249589327938466,93,1.1000000000000001,28596.354224948322]
[null,null,null,null,null,1.0221567670452589,94,1.1000000000000001,28824.820830676301]
[null,null,null,null,null,1.0193842544006582,95,1.1000000000000001,29052.451250418755]
[null,null,null,null,null,1.0166407738354268,96,1.1000000000000001,29279.254286460287]
[null,null,null,null,null,1.0139257236321135,97,1.1000000000000001,29505.238557694502]
[null,null,null,null,null,1.0112385205883099,98,1.1000000000000001,29730.41250529631]
[null,null,null,null,null,1.0085785992647374,99,1.1000000000000001,29954.784398162694]
[null,null,null,null,null,1.0059454112711199,100,1.1000000000000001,30178.3623381336]
[null,null,null,null,null,1.0033384245875898,101,0.8,30401.154265003974]
[null,null,null,null,null,1.0007571229195209,102,0.8,30623.167961337342]
[null,null,null,null,null,0.99820100508383525,103,0.8,30844.411057090507]
[null,null,null,null,null,0.99566958442496034,104,0.8,31064.891034058757]
[null,null,null,null,null,0.99316238825872882,105,0.8,31284.615230149957]
[null,null,null,null,null,0.99067895734263822,106,0.8,31503.590843495895]
[null,null,null,null,null,0.98821884537098059,107,0.8,31721.824936408473]
[null,null,null,null,null,0.98578161849345425,108,0.8,31939.324439187916]
[null,null,null,null,null,0.9833668548559642,109,0.8,32156.096153790029]
[null,null,null,null,null,0.98097414416238671,110,0.8,32372.146757358758]
[null,null,null,null,null,0.9786030872561684,111,0.8,32587.482805630403]
[null,null,null,null,null,0.97625329572068509,112,0.8,32802.110736215021]
[null,null,null,null,null,0.97392439149736654,113,0.8,33016.036871760727]
[null,null,null,null,null,0.97161600652064206,114,0.8,33229.267423005957]
[null,null,null,null,null,0.96932778236882822,115,0.8,33441.808491724572]
[null,null,null,null,null,0.96705936993013242,116,0.8,33653.666073568602]
[null,null,null,null,null,0.96481042908298775,117,0.8,33864.846060812873]
[null,null,null,null,null,0.96258062838999559,118,0.8,34075.354245005845]
[null,null,null,null,null,0.96036964480477915,119,0.8,34285.196319530616]
[null,null,null,null,null,0.95817716339110381,120,0.8,34494.377882079738]
[null,null,null,null,null,0.95600287705365372,121,0.8,34702.904437047626]
[null,null,null,null,null,0.95384648627988655,122,0.8,34910.78139784385]
[null,null,null,null,null,0.95170769889242668,123,0.8,35118.014089130542]
[null,null,null,null,null,0.94958622981148011,124,0.8,35324.607748987059]
[null,null,null,null,null,0.94748180082679689,125,0.8,35530.567531004883]
[null,null,null,null,null,0.94539414037871272,126,0.8,35735.898506315338]
[null,null,null,null,null,0.94332298334784892,127,0.8,35940.605665553041]
[null,null,null,null,null,0.9412680708530603,128,0.8,36144.693920757512]
[null,null,null,null,null,{"$f":"-0.262*LN(G215)+2.2125","v":0.93922915005724184},129,0.8,{"$f":"$H$84*F215*1000*G215","v":36348.168107215257}]
[null,null,null,null,null,0.93720597398063732,130,0.8,36551.032985244856]
[null,null,null,null,null,0.93519830132129833,131,0.8,36753.293241927022]
[null,null,null,null,null,0.93320589628237083,132,0.8,36954.95349278189]
[null,null,null,null,null,0.93122852840590031,133,0.8,37156.018283395417]
[null,null,null,null,null,0.92926597241286113,134,0.8,37356.49209099701]
[null,null,null,null,null,0.92731800804913123,135,0.8,37556.379325989816]
[null,null,null,null,null,0.92538441993715415,136,0.8,37755.684333435893]
[null,null,null,null,null,0.92346499743303112,137,0.8,37954.411394497576]
[null,null,null,null,null,0.92155953448881212,138,0.8,38152.564727836812]
[null,null,null,null,null,0.91966782951975867,139,0.8,38350.14849097393]
[null,null,null,null,null,0.91778968527636229,140,0.8,38547.166781607215]
[null,null,null,null,null,0.91592490872091981,141,0.8,38743.623638894904]
[null,null,null,null,null,0.91407331090846955,142,0.8,38939.523044700807]
[null,null,null,null,null,0.91223470687190433,143,0.8,39134.868924804687]
[null,null,null,null,null,0.91040891551108771,144,0.8,39329.665150078981]
[null,null,null,null,null,0.9085957594858094,145,0.8,39523.915537632711]
[null,null,null,null,null,0.9067950651124157,146,0.8,39717.623851923803]
[null,null,null,null,null,0.90500666226397097,147,0.8,39910.793805841116]
[null,null,null,null,null,0.90323038427380187,148,0.8,40103.429061756804]
[null,null,null,null,null,0.90146606784228944,149,0.8,40295.533232550333]
[null,null,null,null,null,0.89971355294678101,150,0.8,40487.109882605138]
[null,null,null,null,null,0.8979726827544896,151,0.8,40678.162528778383]
[null,null,null,null,null,0.89624330353827553,152,0.8,40868.694641345362]
[null,null,null,null,null,0.89452526459518178,153,0.8,41058.709644918847]
[null,null,null,null,null,0.89281841816762886,154,0.8,41248.210919344456]
[null,null,null,null,null,0.89112261936715731,155,0.8,41437.201800572817]
[null,null,null,null,null,0.88943772610062122,156,0.8,41625.685581509075]
[null,null,null,null,null,0.88776359899874313,157,0.8,41813.665512840802]
[null,null,null,null,null,0.88610010134693451,158,0.8,42001.144803844691]
[null,null,null,null,null,0.8844470990182991,159,0.8,42188.126623172866]
[null,null,null,null,null,0.88280446040873728,160,0.8,42374.614099619386]
[null,null,null,null,null,0.88117205637407059,161,0.8,42560.6103228676]
[null,null,null,null,null,0.87954976016911535,162,0.8,42746.118344219001]
[null,null,null,null,null,0.87793744738862811,163,0.8,42931.141177303914]
[null,null,null,null,null,0.8763349959100597,164,0.8,43115.681798774931]
[null,null,null,null,null,0.87474228583804781,165,0.8,43299.743148983362]
[null,null,null,null,null,0.8731591994505854,166,0.8,43483.328132639144]
[null,null,null,null,null,0.87158562114681004,167,0.8,43666.439619455188]
[null,null,null,null,null,0.87002143739634596,168,0.8,43849.080444775827]
[null,null,null,null,null,0.8684665366901545,169,0.8,44031.253410190839]
[null,null,null,null,null,0.86692080949283112,170,0.8,44212.961284134384]
[null,null,null,null,null,0.86538414819630294,171,0.8,44394.206802470348]
[null,null,null,null,null,0.8638564470748753,172,0.8,44574.992669063562]
[null,null,null,null,null,0.86233760224158162,173,0.8,44755.321556338095]
[null,null,null,null,null,0.86082751160579329,174,0.8,44935.196105822404]
[null,null,null,null,null,0.85932607483203904,175,0.8,45114.618928682052]
[null,null,null,null,null,0.85783319330000429,176,0.8,45293.592606240221]
[null,null,null,null,null,0.85634877006565668,177,0.8,45472.119690486375]
[null,null,null,null,null,0.85487270982347363,178,0.8,45650.202704573487]
[null,null,null,null,null,0.85340491886972214,179,0.8,45827.844143304086]
[null,null,null,null,null,0.85194530506676469,180,0.8,46005.046473605296]
[null,null,null,null,null,0.85049377780835345,181,0.8,46181.81213499359]
[null,null,null,null,null,0.84905024798587947,182,0.8,46358.143540029021]
[null,null,null,null,null,0.84761462795554743,183,0.8,46534.043074759553]
[null,null,null,null,null,0.84618683150644558,184,0.8,46709.513099155796]
[null,null,null,null,null,0.84476677382947885,185,0.8,46884.555947536071]
[null,null,null,null,null,0.84335437148714099,186,0.8,47059.173928982462]
[null,null,null,null,null,0.84194954238409814,187,0.8,47233.369327747911]
[null,null,null,null,null,0.84055220573855305,188,0.8,47407.144403654391]
[null,null,null,null,null,0.8391622820543736,189,0.8,47580.501392482976]
[null,null,null,null,null,0.8377796930939525,190,0.8,47753.442506355284]
[null,null,null,null,null,0.83640436185178291,191,0.8,47925.969934107154]
[null,null,null,null,null,0.83503621252872118,192,0.8,48098.085841654341]
[null,null,null,null,null,{"$f":"-0.262*LN(G279)+2.2125","v":0.83367517050691986},193,0.8,{"$f":"$H$84*F279*1000*G279","v":48269.792372350661}]
[null,null,null,null,null,0.83232116232540787,194,0.8,48441.091647338741]
[null,null,null,null,null,0.8309741156562982,195,0.8,48611.985765893442]
[null,null,null,null,null,0.82963395928160444,196,0.8,48782.476805758342]
[null,null,null,null,null,0.82830062307064689,197,0.8,48952.56682347523]
[null,null,null,null,null,0.8269740379580317,198,0.8,49122.257854707081]
[null,null,null,null,null,0.82565413592218295,199,0.8,49291.551914554315]
[null,null,null,null,null,0.82434084996441426,200,0.8,49460.450997864857]
[null,null,null,null,null,0.82303411408852201,201,0.8,49628.957079537875]
[null,null,null,null,null,0.82173386328088416,202,0.8,49797.072114821574]
[null,null,null,null,null,0.82044003349105155,203,0.8,49964.798039605033]
[null,null,null,null,null,0.81915256161281524,204,0.8,50132.136770704288]
[null,null,null,null,null,0.8178713854657369,205,0.8,50299.090206142821]
[null,null,null,null,null,0.81659644377712959,206,0.8,50465.660225426604]
[null,null,null,null,null,0.81532767616447321,207,0.8,50631.848689813778]
[null,null,null,null,null,0.81406502311825446,208,0.8,50797.657442579082]
[null,null,null,null,null,0.8128084259852193,209,0.8,50963.088309273247]
[null,null,null,null,null,0.81155782695202316,210,0.8,51128.14309797746]
[null,null,null,null,null,0.81031316902927042,211,0.8,51292.823599552816]
[null,null,null,null,null,0.80907439603593256,212,0.8,51457.131587885313]
[null,null,null,null,null,0.80784145258413043,213,0.8,51621.068820125933]
[null,null,null,null,null,0.80661428406427493,214,0.8,51784.637036926448]
[null,null,null,null,null,0.80539283663055228,215,0.8,51947.837962670623]
[null,null,null,null,null,0.80417705718674859,216,0.8,52110.673305701304]
[null,null,null,null,null,0.80296689337239946,217,0.8,52273.144758543203]
[null,null,null,null,null,0.80176229354925854,218,0.8,52435.253998121509]
[null,null,null,null,null,0.80056320678807658,219,0.8,52597.002685976629]
[null,null,null,null,null,0.79936958285568105,220,0.8,52758.392468474944]
[null,null,null,null,null,0.79818137220234875,221,0.8,52919.424977015718]
[null,null,null,null,null,0.79699852594946274,222,0.8,53080.101828234219]
[null,null,null,null,null,0.7958209958774487,223,0.8,53240.424624201318]
[null,null,null,null,null,0.79464873441397943,224,0.8,53400.394952619419]
[null,null,null,null,null,0.79348169462244167,225,0.8,53560.014387014809]
[null,null,null,null,null,0.79231983019066088,226,0.8,53719.284486926808]
[null,null,null,null,null,0.79116309541987229,227,0.8,53878.206798093306]
[null,null,null,null,null,0.7900114452139364,228,0.8,54036.782852633245]
[null,null,null,null,null,0.78886483506878902,229,0.8,54195.014169225797]
[null,null,null,null,null,0.78772322106212256,230,0.8,54352.902253286455]
[null,null,null,null,null,0.78658655984328996,231,0.8,54510.448597139992]
[null,null,null,null,null,0.78545480862342676,232,0.8,54667.654680190499]
[null,null,null,null,null,0.78432792516578642,233,0.8,54824.52196908847]
[null,null,null,null,null,0.78320586777628209,234,0.8,54981.051917895005]
[null,null,null,null,null,0.78208859529423025,235,0.8,55137.245968243231]
[null,null,null,null,null,0.78097606708328993,236,0.8,55293.105549496926]
[null,null,null,null,null,0.77986824302259539,237,0.8,55448.632078906528]
[null,null,null,null,null,0.7787650834980735,238,0.8,55603.826961762439]
[null,null,null,null,null,0.77766654939394386,239,0.8,55758.691591545772]
[null,null,null,null,null,0.77657260208439816,240,0.8,55913.227350076661]
[null,null,null,null,null,0.77548320342544841,241,0.8,56067.435607659914]
[null,null,null,null,null,0.77439831574694784,242,0.8,56221.317723228407]
[null,null,null,null,null,0.77331790184477622,243,0.8,56374.875044484179]
[null,null,null,null,null,0.77224192497318089,244,0.8,56528.10890803684]
[null,null,null,null,null,0.77117034883728119,245,0.8,56681.020639540169]
[null,null,null,null,null,0.7701031375857208,246,0.8,56833.611553826195]
[null,null,null,null,null,0.76904025580346969,247,0.8,56985.882955037094]
[null,null,null,null,null,0.76798166850477445,248,0.8,57137.836136755213]
[null,null,null,null,null,0.7669273411262465,249,0.8,57289.472382130611]
[null,null,null,null,null,0.76587723952009146,250,0.8,57440.792964006861]
[null,null,null,null,null,0.76483132994747249,251,0.66,57591.799145044679]
[null,null,null,null,null,0.76378957907200684,252,0.66,57742.49217784372]
[null,null,null,null,null,0.76275195395338957,253,0.66,57892.873305062269]
[null,null,null,null,null,0.76171842204114326,254,0.66,58042.943759535112]
[null,null,null,null,null,0.76068895116849222,255,0.66,58192.704764389659]
[null,null,null,null,null,0.75966350954635464,256,0.66,58342.157533160032]
[null,null,null,null,null,{"$f":"-0.262*LN(G343)+2.2125","v":0.75864206575745219},257,0.66,{"$f":"$H$84*F343*1000*G343","v":58491.303269899559}]
[null,null,null,null,null,0.75762458875053618,258,0.66,58640.143169291499]
[null,null,null,null,null,0.756611047834721,259,0.66,58788.678416757823]
[null,null,null,null,null,0.75560141267393166,260,0.66,58936.910188566668]
[null,null,null,null,null,0.75459565328145417,261,0.66,59084.839651937858]
[null,null,null,null,null,0.75359374001459245,262,0.66,59232.467965146963]
[null,null,null,null,null,0.75259564356942543,263,0.66,59379.796277627662]
[null,null,null,null,null,0.75160133497566517,264,0.66,59526.825730072676]
[null,null,null,null,null,0.75061078559160976,265,0.66,59673.557454532973]
[null,null,null,null,null,0.74962396709919465,266,0.66,59819.992574515731]
[null,null,null,null,null,0.74864085149913451,267,0.66,59966.13220508067]
[null,null,null,null,null,0.74766141110615547,268,0.66,60111.977452934902]
[null,null,null,null,null,0.74668561854431803,269,0.66,60257.529416526464]
[null,null,null,null,null,0.74571344674242557,270,0.66,60402.789186136462]
[null,null,null,null,null,0.74474486892951819,271,0.66,60547.757843969834]
[null,null,null,null,null,0.74377985863044849,272,0.66,60692.436464244602]
[null,null,null,null,null,0.74281838966154035,273,0.66,60836.826113280156]
[null,null,null,null,null,0.74186043612632546,274,0.66,60980.927849583954]
[null,null,null,null,null,0.74090597241135803,275,0.66,61124.742723937037]
[null,null,null,null,null,0.73995497318210668,276,0.66,61268.271779478426]
[null,null,null,null,null,0.73900741337891707,277,0.66,61411.516051788007]
[null,null,null,null,null,0.73806326821305301,278,0.66,61554.476568968617]
[null,null,null,null,null,0.73712251316280208,279,0.66,61697.154351726531]
[null,null,null,null,null,0.73618512396965663,280,0.66,61839.550413451158]
[null,null,null,null,null,0.73525107663455858,281,0.66,61981.665760293283]
[null,null,null,null,null,0.73432034741421393,282,0.66,62123.501391242498]
[null,null,null,null,null,0.73339291281747165,283,0.66,62265.058298203345]
[null,null,null,null,null,0.73246874960176389,284,0.66,62406.337466070283]
[null,null,null,null,null,0.73154783476961338,285,0.66,62547.339872801938]
[null,null,null,null,null,0.73063014556519845,286,0.66,62688.06648949402]
[null,null,null,null,null,0.72971565947097905,287,0.66,62828.518280451302]
[null,null,null,null,null,0.72880435420438205,288,0.66,62968.696203258609]
[null,null,null,null,null,0.72789620771454255,289,0.66,63108.601208850836]
[null,null,null,null,null,0.72699119817910374,290,0.66,63248.234241582024]
[null,null,null,null,null,0.72608930400106875,291,0.66,63387.596239293292]
[null,null,null,null,null,0.72519050380571004,292,0.66,63526.688133380201]
[null,null,null,null,null,0.72429477643752804,293,0.66,63665.510848858714]
[null,null,null,null,null,0.72340210095726531,294,0.66,63804.065304430798]
[null,null,null,null,null,0.7225124566389669,295,0.66,63942.352412548571]
[null,null,null,null,null,0.72162582296709621,296,0.66,64080.373079478144]
[null,null,null,null,null,0.72074217963369258,297,0.66,64218.128205362009]
[null,null,null,null,null,0.71986150653558378,298,0.66,64355.618684281188]
[null,null,null,null,null,0.71898378377163996,299,0.66,64492.845404316104]
[null,null,null,null,null,0.71810899164007513,300,0.66,64629.809247606761]
[null,null,null,null,null,0.71723711063579443,301,0.66,64766.511090412234]
[null,null,null,null,null,0.71636812144778395,302,0.66,64902.951803169228]
[null,null,null,null,null,0.71550200495654526,303,0.66,65039.132250549963]
[null,null,null,null,null,0.71463874223156965,304,0.66,65175.053291519158]
[null,null,null,null,null,0.71377831452885787,305,0.66,65310.715779390499]
[null,null,null,null,null,0.71292070328847612,306,0.66,65446.120561882111]
[null,null,null,null,null,0.71206589013215438,307,0.66,65581.268481171413]
[null,null,null,null,null,0.71121385686092342,308,0.66,65716.160373949315]
[null,null,null,null,null,0.71036458545279046,309,0.66,65850.797071473673]
[null,null,null,null,null,0.70951805806045143,310,0.66,65985.179399621979]
[null,null,null,null,null,0.70867425700904052,311,0.66,66119.30817894348]
[null,null,null,null,null,0.70783316479391534,312,0.66,66253.184224710465]
[null,null,null,null,null,0.70699476407847972,313,0.66,66386.80834696925]
[null,null,null,null,null,0.70615903769203747,314,0.66,66520.181350589934]
[null,null,null,null,null,0.70532596862768404,315,0.66,66653.304035316149]
[null,null,null,null,null,0.70449554004022885,316,0.66,66786.177195813696]
[null,null,null,null,null,0.70366773524415249,317,0.66,66918.8016217189]
[null,null,null,null,null,0.70284253771159344,318,0.66,67051.178097686017]
[null,null,null,null,null,0.70201993107037053,319,0.66,67183.307403434461]
[null,null,null,null,null,0.70119989910203162,320,0.66,67315.190313795028]
[null,null,null,null,null,{"$f":"-0.262*LN(G407)+2.2125","v":0.70038242573993581},321,0.66,{"$f":"$H$84*F407*1000*G407","v":67446.827598755815}]
[null,null,null,null,null,0.69956749506736471,322,0.66,67578.220023507427]
[null,null,null,null,null,0.69875509131566393,323,0.66,67709.368348487827]
[null,null,null,null,null,0.69794519886240969,324,0.66,67840.273329426214]
[null,null,null,null,null,0.69713780222960864,325,0.66,67970.935717386848]
[null,null,null,null,null,0.69633288608192245,326,0.66,68101.356258812011]
[null,null,null,null,null,0.69553043522491942,327,0.66,68231.535695564584]
[null,null,null,null,null,0.69473043460335404,328,0.66,68361.474764970029]
[null,null,null,null,null,0.6939328692994724,329,0.66,68491.174199857924]
[null,null,null,null,null,0.69313772453134215,330,0.66,68620.634728602861]
[null,null,null,null,null,0.69234498565120939,331,0.66,68749.857075165099]
[null,null,null,null,null,0.69155463814387996,332,0.66,68878.841959130441]
[null,null,null,null,null,0.69076666762512362,333,0.66,69007.590095749852]
[null,null,null,null,null,0.68998105984010416,334,0.66,69136.102195978441]
[null,null,null,null,null,0.68919780066183245,335,0.66,69264.378966514152]
[null,null,null,null,null,0.68841687608964031,336,0.66,69392.421109835734]
[null,null,null,null,null,0.68763827224768104,337,0.66,69520.229324240543]
[null,null,null,null,null,0.68686197538344884,338,0.66,69647.804303881712]
[null,null,null,null,null,0.68608797186632198,339,0.66,69775.14673880495]
[null,null,null,null,null,0.68531624818612547,340,0.66,69902.257314984803]
[null,null,null,null,null,0.68454679095171844,341,0.66,70029.136714360793]
[null,null,null,null,null,0.6837795868895975,342,0.66,70155.785614872701]
[null,null,null,null,null,0.68301462284252379,343,0.66,70282.204690495695]
[null,null,null,null,null,0.68225188576816964,344,0.66,70408.394611275115]
[null,null,null,null,null,0.68149136273778343,345,0.66,70534.356043360574]
[null,null,null,null,null,0.68073304093487597,346,0.66,70660.089649040136]
[null,null,null,null,null,0.67997690765392282,347,0.66,70785.596086773352]
[null,null,null,null,null,0.67922295029908764,348,0.66,70910.876011224755]
[null,null,null,null,null,0.67847115638296396,349,0.66,71035.930073296317]
[null,null,null,null,null,0.67772151352533361,350,0.66,71160.758920160035]
[null,null,null,null,null,0.67697400945194319,351,0.66,71285.36319528961]
[null,null,null,null,null,0.67622863199329841,352,0.66,71409.743538492301]
[null,null,null,null,null,0.67548536908347612,353,0.66,71533.900585940122]
[null,null,null,null,null,0.67474420875895103,354,0.66,71657.834970200609]
[null,null,null,null,null,0.67400513915744087,355,0.66,71781.547320267448]
[null,null,null,null,null,0.67326814851676797,356,0.66,71905.038261590817]
[null,null,null,null,null,0.67253322517373459,357,0.66,72028.308416106971]
[null,null,null,null,null,0.67180035756301626,358,0.66,72151.358402267942]
[null,null,null,null,null,0.67106953421607085,359,0.66,72274.188835070832]
[null,null,null,null,null,0.67034074376005903,360,0.66,72396.800326086377]
[null,null,null,null,null,0.66961397491678509,361,0.66,72519.193483487819]
[null,null,null,null,null,0.66888921650164779,362,0.66,72641.36891207895]
[null,null,null,null,null,0.66816645742260894,363,0.66,72763.327213322118]
[null,null,null,null,null,0.66744568667917381,364,0.66,72885.068985365782]
[null,null,null,null,null,0.66672689336138702,365,0.66,73006.594823071879]
[null,null,null,null,null,0.66601006664884199,366,0.66,73127.905318042845]
[null,null,null,null,null,0.66529519580970242,367,0.66,73249.001058648239]
[null,null,null,null,null,0.66458227019973992,368,0.66,73369.882630051288]
[null,null,null,null,null,0.66387127926138167,369,0.66,73490.550614234948]
[null,null,null,null,null,0.66316221252277319,370,0.66,73611.005590027824]
[null,null,null,null,null,0.66245505959685191,371,0.66,73731.248133129615]
[null,null,null,null,null,0.66174981018043555,372,0.66,73851.278816136604]
[null,null,null,null,null,0.66104645405332008,373,0.66,73971.098208566516]
[null,null,null,null,null,0.66034498107739248,374,0.66,74090.706876883443]
[null,null,null,null,null,0.65964538119575233,375,0.66,74210.105384522132]
[null,null,null,null,null,0.65894764443184739,376,0.66,74329.294291912389]
[null,null,null,null,null,0.65825176088862092,377,0.66,74448.274156503016]
[null,null,null,null,null,0.65755772074766772,378,0.66,74567.045532785502]
[null,null,null,null,null,0.65686551426840412,379,0.66,74685.608972317539]
[null,null,null,null,null,0.65617513178724685,380,0.66,74803.965023746132]
[null,null,null,null,null,0.65548656371680414,381,0.66,74922.114232830703]
[null,null,null,null,null,0.65479980054507703,382,0.66,75040.057142465826]
[null,null,null,null,null,0.65411483283467065,383,0.66,75157.794292703664]
[null,null,null,null,null,0.6534316512220153,384,0.66,75275.326220776158]
[null,null,null,null,null,{"$f":"-0.262*LN(G471)+2.2125","v":0.65275024641660018},385,0.66,{"$f":"$H$84*F471*1000*G471","v":75392.653461117312}]
[null,null,null,null,null,0.6520706092002142,386,0.66,75509.776545384811]
[null,null,null,null,null,0.65139273042619705,387,0.66,75626.696002481476]
[null,null,null,null,null,0.65071660101870221,388,0.66,75743.412358576927]
[null,null,null,null,null,0.6500422119719671,389,0.66,75859.926137128554]
[null,null,null,null,null,0.64936955434959254,390,0.66,75976.237858902328]
[null,null,null,null,null,0.64869861928383399,391,0.66,76092.348041993726]
[null,null,null,null,null,0.64802939797489878,392,0.66,76208.257201848086]
[null,null,null,null,null,0.64736188169025333,393,0.66,76323.965851280867]
[null,null,null,null,null,0.64669606176394123,394,0.66,76439.474500497861]
[null,null,null,null,null,0.64603192959590583,395,0.66,76554.783657114836]
[null,null,null,null,null,0.64536947665132582,396,0.66,76669.893826177504]
[null,null,null,null,null,0.64470869445995582,397,0.66,76784.80551018074]
[null,null,null,null,null,0.64404957461547707,398,0.66,76899.519209087957]
[null,null,null,null,null,0.64339210877485553,399,0.66,77014.035420350207]
[null,null,null,null,null,0.6427362886577086,400,0.66,77128.354638925026]
[null,null,null,null,null,0.64208210604567872,401,0.66,77242.477357295153]
[null,null,null,null,null,0.64142955278181635,402,0.66,77356.404065487062]
[null,null,null,null,null,0.64077862076996905,403,0.66,77470.135251089261]
[null,null,null,null,null,0.6401293019741785,404,0.66,77583.671399270432]
[null,null,null,null,null,0.63948158841808667,405,0.66,77697.012992797521]
[null,null,null,null,null,0.63883547218434589,406,0.66,77810.16051205332]
[null,null,null,null,null,0.63819094541403998,407,0.66,77923.114435054275]
[null,null,null,null,null,0.63754800030610959,408,0.66,78035.875237467815]
[null,null,null,null,null,0.63690662911678575,409,0.66,78148.443392629604]
[null,null,null,null,null,0.63626682415903124,410,0.66,78260.819371560836]
[null,null,null,null,null,0.63562857780198656,411,0.66,78373.003642984942]
[null,null,null,null,null,0.63499188247042393,412,0.66,78484.996673344402]
[null,null,null,null,null,0.63435673064420905,413,0.66,78596.798926817501]
[null,null,null,null,null,0.63372311485776756,414,0.66,78708.410865334736]
[null,null,null,null,null,0.63309102769955694,415,0.66,78819.832948594834]
[null,null,null,null,null,0.6324604618115488,416,0.66,78931.065634081286]
[null,null,null,null,null,0.63183140988871389,417,0.66,79042.109377078115]
[null,null,null,null,null,0.63120386467851364,418,0.66,79152.964630685601]
[null,null,null,null,null,0.63057781898039988,419,0.66,79263.631845836251]
[null,null,null,null,null,0.62995326564531751,420,0.66,79374.111471309996]
[null,null,null,null,null,0.62933019757521591,421,0.66,79484.403953749759]
[null,null,null,null,null,0.62870860772256476,422,0.66,79594.509737676693]
[null,null,null,null,null,0.62808848908987502,423,0.66,79704.429265505139]
[null,null,null,null,null,0.62746983472922691,424,0.66,79814.162977557658]
[null,null,null,null,null,0.62685263774180244,425,0.66,79923.711312079802]
[null,null,null,null,null,0.62623689127742477,426,0.66,80033.074705254883]
[null,null,null,null,null,0.62562258853410024,427,0.66,80142.253591218236]
[null,null,null,null,null,0.62500972275756905,428,0.66,80251.248402071869]
[null,null,null,null,null,0.62439828724085933,429,0.66,80360.059567898599]
[null,null,null,null,null,0.62378827532384662,430,0.66,80468.687516776219]
[null,null,null,null,null,0.62317968039281801,431,0.66,80577.13267479137]
[null,null,null,null,null,0.62257249588004293,432,0.66,80685.395466053553]
[null,null,null,null,null,0.62196671526334746,433,0.66,80793.476312708823]
[null,null,null,null,null,0.6213623320656938,434,0.66,80901.375634953321]
[null,null,null,null,null,0.62075933985476461,435,0.66,81009.093851046782]
[null,null,null,null,null,0.62015773224255288,436,0.66,81116.631377325917]
[null,null,null,null,null,0.61955750288495537,437,0.66,81223.988628217645]
[null,null,null,null,null,0.61895864548137092,438,0.66,81331.166016252129]
[null,null,null,null,null,0.61836115377430501,439,0.66,81438.163952075978]
[null,null,null,null,null,0.61776502154897561,440,0.66,81544.982844464786]
[null,null,null,null,null,0.61717024263292619,441,0.66,81651.623100336132]
[null,null,null,null,null,0.61657681089564309,442,0.66,81758.085124762263]
[null,null,null,null,null,0.6159847202481743,443,0.66,81864.369320982369]
[null,null,null,null,null,0.61539396464275686,444,0.66,81970.476090415221]
[null,null,null,null,null,0.61480453807244495,445,0.66,82076.4058326714]
[null,null,null,null,null,0.61421643457074304,446,0.66,82182.158945565418]
[null,null,null,null,null,0.61362964821124466,447,0.66,82287.735825127907]
[null,null,null,null,null,0.61304417310727377,448,0.66,82393.136865617591]
[null,null,null,null,null,{"$f":"-0.262*LN(G535)+2.2125","v":0.61246000341152906},449,0.66,{"$f":"$H$84*F535*1000*G535","v":82498.36245953296}]
[null,null,null,null,null,0.61187713331573601,450,0.66,82603.412997624357]
[null,null,null,null,null,0.61129555705029803,451,0.66,82708.288868905322]
[null,null,null,null,null,0.61071526888395522,452,0.66,82812.990460664325]
[null,null,null,null,null,0.61013626312344482,453,0.66,82917.518158476159]
[null,null,null,null,null,0.60955853411316663,454,0.66,83021.872346213291]
[null,null,null,null,null,0.60898207623485079,455,0.66,83126.053406057137]
[null,null,null,null,null,0.60840688390723052,456,0.66,83230.06171850914]
[null,null,null,null,null,0.60783295158571815,457,0.66,83333.897662401956]
[null,null,null,null,null,0.60726027376208336,458,0.66,83437.561614910242]
[null,null,null,null,null,0.606688844964137,459,0.66,83541.053951561655]
[null,null,null,null,null,0.6061186597554169,460,0.66,83644.375046247529]
[null,null,null,null,null,0.6055497127348779,461,0.66,83747.525271233608]
[null,null,null,null,null,0.6049819985365843,462,0.66,83850.504997170574]
[null,null,null,null,null,0.60441551182940656,463,0.66,83953.314593104573]
[null,null,null,null,null,0.60385024731672088,464,0.66,84055.954426487544]
[null,null,null,null,null,0.60328619973611253,465,0.66,84158.424863187698]
[null,null,null,null,null,0.60272336385908076,466,0.66,84260.726267499485]
[null,null,null,null,null,0.60216173449074861,467,0.66,84362.859002153884]
[null,null,null,null,null,0.60160130646957621,468,0.66,84464.823428328498]
[null,null,null,null,null,0.6010420746670746,469,0.66,84566.619905657397]
[null,null,null,null,null,0.60048403398752459,470,0.66,84668.248792240964]
[null,null,null,null,null,0.59992717936769835,471,0.66,84769.710444655764]
[null,null,null,null,null,0.59937150577658449,472,0.66,84871.005217964368]
[null,null,null,null,null,0.59881700821511341,473,0.66,84972.133465724604]
[null,null,null,null,null,0.59826368171588973,474,0.66,85073.095539999529]
[null,null,null,null,null,0.59771152134292382,475,0.66,85173.891791366637]
[null,null,null,null,null,0.59716052219136762,476,0.66,85274.522568927277]
[null,null,null,null,null,0.59661067938725432,477,0.66,85374.988220316096]
[null,null,null,null,null,0.5960619880872382,478,0.66,85475.289091709958]
[null,null,null,null,null,0.59551444347834015,479,0.66,85575.425527837462]
[null,null,null,null,null,0.5949680407776925,480,0.66,85675.39787198772]
[null,null,null,null,null,0.59442277523229037,481,0.66,85775.206466019488]
[null,null,null,null,null,0.59387864211874253,482,0.66,85874.851650370168]
[null,null,null,null,null,0.59333563674302581,483,0.66,85974.333764064446]
[null,null,null,null,null,0.59279375444024218,484,0.66,86073.653144723168]
[null,null,null,null,null,0.59225299057437919,485,0.66,86172.810128572164]
[null,null,null,null,null,0.59171334053807056,486,0.66,86271.805050450683]
[null,null,null,null,null,0.59117479975236131,487,0.66,86370.638243819994]
[null,null,null,null,null,0.59063736366647523,488,0.66,86469.310040771976]
[null,null,null,null,null,0.59010102775758333,489,0.66,86567.820772037463]
[null,null,null,null,null,0.58956578753057576,490,0.66,86666.170766994619]
[null,null,null,null,null,0.58903163851783558,491,0.66,86764.360353677184]
[null,null,null,null,null,0.58849857627901514,492,0.66,86862.389858782641]
[null,null,null,null,null,0.58796659640081517,493,0.66,86960.259607680564]
[null,null,null,null,null,0.58743569449676403,494,0.66,87057.969924420438]
[null,null,null,null,null,0.58690586620700302,495,0.66,87155.521131739952]
[null,null,null,null,null,0.58637710719806879,496,0.66,87252.913551072648]
[null,null,null,null,null,0.58584941316268302,497,0.66,87350.147502556036]
[null,null,null,null,null,0.58532277981954084,498,0.66,87447.223305039399]
[null,null,null,null,null,0.58479720291310189,499,0.66,87544.141276091337]
[null,null,null,null,null,0.5842726782133858,500,0.66,87640.901732007856]
[null,null,null,null,null,0.58374920151576526,501,0.49,87737.504987819513]
[null,null,null,null,null,0.58322676864076684,502,0.49,87833.951357299477]
[null,null,null,null,null,0.58270537543386824,503,0.49,87930.241152970702]
[null,null,null,null,null,0.58218501776530118,504,0.49,88026.37468611353]
[null,null,null,null,null,0.58166569152985548,505,0.49,88122.352266773101]
[null,null,null,null,null,0.58114739264668391,506,0.49,88218.174203766612]
[null,null,null,null,null,0.58063011705910972,507,0.49,88313.840804690568]
[null,null,null,null,null,0.5801138607344376,508,0.49,88409.352375928283]
[null,null,null,null,null,0.57959861966376303,509,0.49,88504.709222656616]
[null,null,null,null,null,0.57908438986178656,510,0.49,88599.911648853333]
[null,null,null,null,null,0.57857116736662939,511,0.49,88694.959957304294]
[null,null,null,null,null,0.57805894823964876,512,0.49,88789.854449610051]
[null,null,null,null,null,{"$f":"-0.262*LN(G599)+2.2125","v":0.57754772856525816},513,0.49,{"$f":"$H$84*F599*1000*G599","v":88884.595426193235}]
[null,null,null,null,null,0.57703750445074653,514,0.49,88979.183186305119]
[null,null,null,null,null,0.57652827202610091,515,0.49,89073.618028032593]
[null,null,null,null,null,0.57602002744383052,516,0.49,89167.90024830497]
[null,null,null,null,null,0.57551276687879138,517,0.49,89262.030142900534]
[null,null,null,null,null,0.57500648652801534,518,0.49,89356.008006453587]
[null,null,null,null,null,0.57450118261053706,519,0.49,89449.834132460601]
[null,null,null,null,null,0.573996851367226,520,0.49,89543.508813287262]
[null,null,null,null,null,0.57349348906061781,521,0.49,89637.032340174555]
[null,null,null,null,null,0.57299109197474829,522,0.49,89730.405003245585]
[null,null,null,null,null,0.57248965641498994,523,0.49,89823.627091511924]
[null,null,null,null,null,0.57198917870788679,524,0.49,89916.698892879795]
[null,null,null,null,null,0.57148965520099448,525,0.49,90009.620694156634]
[null,null,null,null,null,0.57099108226271977,526,0.49,90102.392781057177]
[null,null,null,null,null,0.57049345628216286,527,0.49,90195.015438209943]
[null,null,null,null,null,0.56999677366895929,528,0.49,90287.488949163162]
[null,null,null,null,null,0.56950103085312542,529,0.49,90379.813596391003]
[null,null,null,null,null,0.56900622428490388,530,0.49,90471.989661299725]
[null,null,null,null,null,0.5685123504346119,531,0.49,90564.01742423368]
[null,null,null,null,null,0.568019405792489,532,0.49,90655.897164481241]
[null,null,null,null,null,0.56752738686854864,533,0.49,90747.629160280921]
[null,null,null,null,null,0.56703629019242885,534,0.49,90839.213688827091]
[null,null,null,null,null,0.56654611231324625,535,0.49,90930.651026276013]
[null,null,null,null,null,0.56605684979944981,536,0.49,91021.941447751509]
[null,null,null,null,null,0.56556849923867714,537,0.49,91113.085227350879]
[null,null,null,null,null,0.56508105723761237,538,0.49,91204.082638150634]
[null,null,null,null,null,0.56459452042184255,539,0.49,91294.933952211926]
[null,null,null,null,null,0.56410888543571991,540,0.49,91385.639440586616]
[null,null,null,null,null,0.56362414894222179,541,0.49,91476.199373322583]
[null,null,null,null,null,0.56314030762281253,542,0.49,91566.614019469314]
[null,null,null,null,null,0.56265735817730889,543,0.49,91656.88364708361]
[null,null,null,null,null,0.56217529732374305,544,0.49,91747.008523234865]
[null,null,null,null,null,0.56169412179822986,545,0.49,91836.988914010581]
[null,null,null,null,null,0.56121382835483469,546,0.49,91926.825084521915]
[null,null,null,null,null,0.56073441376544086,547,0.49,92016.517298908831]
[null,null,null,null,null,0.56025587481961958,548,0.49,92106.065820345451]
[null,null,null,null,null,0.55977820832450287,549,0.49,92195.470911045617]
[null,null,null,null,null,0.55930141110465259,550,0.49,92284.732832267677]
[null,null,null,null,null,0.5588254800019361,551,0.49,92373.85184432003]
[null,null,null,null,null,0.55835041187540102,552,0.49,92462.82820656641]
[null,null,null,null,null,0.55787620360114798,553,0.49,92551.662177430451]
[null,null,null,null,null,0.55740285207221141,554,0.49,92640.354014401528]
[null,null,null,null,null,0.55693035419843406,555,0.49,92728.903974039276]
[null,null,null,null,null,0.55645870690634736,556,0.49,92817.312311978734]
[null,null,null,null,null,0.55598790713905144,557,0.49,92905.579282935476]
[null,null,null,null,null,0.55551795185609643,558,0.49,92993.705140710546]
[null,null,null,null,null,0.5550488380333638,559,0.49,93081.690138195103]
[null,null,null,null,null,0.55458056266295075,560,0.49,93169.534527375727]
[null,null,null,null,null,0.55411312275305358,561,0.49,93257.238559338904]
[null,null,null,null,null,0.55364651532785292,562,0.49,93344.802484276006]
[null,null,null,null,null,0.55318073742740093,563,0.49,93432.226551488013]
[null,null,null,null,null,0.55271578610750827,564,0.49,93519.511009390393]
[null,null,null,null,null,0.5522516584396322,565,0.49,93606.656105517657]
[null,null,null,null,null,0.55178835151076577,566,0.49,93693.662086528027]
[null,null,null,null,null,0.55132586242332882,567,0.49,93780.529198208227]
[null,null,null,null,null,0.55086418829505801,568,0.49,93867.257685477874]
[null,null,null,null,null,0.5504033262589012,569,0.49,93953.847792394416]
[null,null,null,null,null,0.54994327346290772,570,0.49,94040.299762157229]
[null,null,null,null,null,0.54948402707012511,571,0.49,94126.613837112425]
[null,null,null,null,null,0.54902558425849279,572,0.49,94212.790258757377]
[null,null,null,null,null,0.5485679422207379,573,0.49,94298.829267744848]
[null,null,null,null,null,0.54811109816427339,574,0.49,94384.731103887869]
[null,null,null,null,null,0.54765504931109388,575,0.49,94470.496006163696]
[null,null,null,null,null,0.54719979289767617,576,0.49,94556.124212718452]
[null,null,null,null,null,{"$f":"-0.262*LN(G663)+2.2125","v":0.54674532617487759},577,0.49,{"$f":"$H$84*F663*1000*G663","v":94641.615960871306}]
[null,null,null,null,null,0.54629164640783689,578,0.49,94726.971487118906]
[null,null,null,null,null,0.54583875087587508,579,0.49,94812.191027139503]
[null,null,null,null,null,0.54538663687239808,580,0.49,94897.274815797267]
[null,null,null,null,null,0.54493530170479931,581,0.49,94982.223087146529]
[null,null,null,null,null,0.54448474269436309,582,0.49,95067.036074435789]
[null,null,null,null,null,0.5440349571761709,583,0.49,95151.714010112293]
[null,null,null,null,null,0.54358594249900438,584,0.49,95236.257125825548]
[null,null,null,null,null,0.54313769602525341,585,0.49,95320.66565243197]
[null,null,null,null,null,0.54269021513082261,586,0.49,95404.939819998617]
[null,null,null,null,null,0.5422434972050385,587,0.49,95489.079857807272]
[null,null,null,null,null,0.54179753965055966,588,0.49,95573.085994358727]
[null,null,null,null,null,0.54135233988328424,589,0.49,95656.958457376328]
[null,null,null,null,null,0.54090789533226147,590,0.49,95740.697473810287]
[null,null,null,null,null,0.54046420343960211,591,0.49,95824.303269841446]
[null,null,null,null,null,0.54002126166039033,592,0.49,95907.776070885302]
[null,null,null,null,null,0.53957906746259576,593,0.49,95991.116101595791]
[null,null,null,null,null,0.5391376183269867,594,0.49,96074.323585869031]
[null,null,null,null,null,0.53869691174704482,595,0.49,96157.398746847495]
[null,null,null,null,null,0.53825694522887813,596,0.49,96240.341806923403]
[null,null,null,null,null,0.53781771629113795,597,0.49,96323.152987742797]
[null,null,null,null,null,0.53737922246493453,598,0.49,96405.832510209249]
[null,null,null,null,null,0.5369414612937522,599,0.49,96488.380594487273]
[null,null,null,null,null,0.53650443033336948,600,0.49,96570.797460006506]
[null,null,null,null,null,0.53606812715177554,601,0.49,96653.083325465122]
[null,null,null,null,null,0.53563254932908877,602,0.49,96735.238408833437]
[null,null,null,null,null,0.53519769445747722,603,0.49,96817.262927357617]
[null,null,null,null,null,0.53476356014107829,604,0.49,96899.15709756338]
[null,null,null,null,null,0.53433014399591938,605,0.49,96980.921135259356]
[null,null,null,null,null,0.5338974436498396,606,0.49,97062.555255540836]
[null,null,null,null,null,0.5334654567424113,607,0.49,97144.059672793097]
[null,null,null,null,null,0.53303418092486399,608,0.49,97225.434600695182]
[null,null,null,null,null,0.53260361386000676,609,0.49,97306.680252223232]
[null,null,null,null,null,0.53217375322215221,610,0.49,97387.796839653849]
[null,null,null,null,null,0.53174459669704177,611,0.49,97468.784574567762]
[null,null,null,null,null,0.53131614198177046,612,0.49,97549.643667853044]
[null,null,null,null,null,0.53088838678471251,613,0.49,97630.374329708633]
[null,null,null,null,null,0.5304613288254485,614,0.49,97710.976769647605]
[null,null,null,null,null,0.53003496583469234,615,0.49,97791.451196500726]
[null,null,null,null,null,0.52960929555421776,616,0.49,97871.797818419436]
[null,null,null,null,null,0.52918431573678815,617,0.49,97952.016842879486]
[null,null,null,null,null,0.52876002414608503,618,0.49,98032.108476684152]
[null,null,null,null,null,0.52833641855663571,619,0.49,98112.072925967266]
[null,null,null,null,null,0.52791349675374577,620,0.49,98191.910396196719]
[null,null,null,null,null,0.52749125653342843,621,0.49,98271.621092177724]
[null,null,null,null,null,0.52706969570233486,622,0.49,98351.205218055664]
[null,null,null,null,null,0.5266488120776871,623,0.49,98430.66297731972]
[null,null,null,null,null,0.52622860348720968,624,0.49,98509.994572805648]
[null,null,null,null,null,0.52580906776906278,625,0.49,98589.200206699257]
[null,null,null,null,null,0.52539020277177406,626,0.49,98668.28008053916]
[null,null,null,null,null,0.52497200635417451,627,0.49,98747.234395220221]
[null,null,null,null,null,0.52455447638533181,628,0.49,98826.063350996512]
[null,null,null,null,null,0.52413761074448439,629,0.49,98904.767147484221]
[null,null,null,null,null,0.52372140732097838,630,0.49,98983.345983664913]
[null,null,null,null,null,0.52330586401420209,631,0.49,99061.800057888438]
[null,null,null,null,null,0.52289097873352319,632,0.49,99140.129567875993]
[null,null,null,null,null,0.52247674939822586,633,0.49,99218.334710723095]
[null,null,null,null,null,0.52206317393744661,634,0.49,99296.415682902327]
[null,null,null,null,null,0.52165025029011458,635,0.49,99374.372680266824]
[null,null,null,null,null,0.52123797640488778,636,0.49,99452.205898052576]
[null,null,null,null,null,0.52082635024009316,637,0.49,99529.915530881786]
[null,null,null,null,null,0.52041536976366487,638,0.49,99607.501772765449]
[null,null,null,null,null,0.52000503295308587,639,0.49,99684.964817106564]
[null,null,null,null,null,0.51959533779532596,640,0.49,99762.304856702598]
[null,null,null,null,null,{"$f":"-0.262*LN(G727)+2.2125","v":0.51918628228678432},641,0.49,{"$f":"$H$84*F727*1000*G727","v":99839.522083748627}]
[null,null,null,null,null,0.51877786443322993,642,0.49,99916.61668984007]
[null,null,null,null,null,0.51837008224974368,643,0.49,99993.588865975544]
[null,null,null,null,null,0.51796293376065905,644,0.49,100070.43880255932]
[null,null,null,null,null,0.5175564169995075,645,0.49,100147.16668940469]
[null,null,null,null,null,0.51715053000895805,646,0.49,100223.77271573608]
[null,null,null,null,null,0.51674527084076383,647,0.49,100300.25707019227]
[null,null,null,null,null,0.51634063755570403,648,0.49,100376.61994082887]
[null,null,null,null,null,0.51593662822352826,649,0.49,100452.86151512095]
[null,null,null,null,null,0.51553324092290298,650,0.49,100528.98197996608]
[null,null,null,null,null,0.5151304737413549,651,0.49,100604.98152168661]
[null,null,null,null,null,0.51472832477521679,652,0.49,100680.8603260324]
[null,null,null,null,null,0.51432679212957488,653,0.49,100756.61857818371]
[null,null,null,null,null,0.51392587391821376,654,0.49,100832.25646275353]
[null,null,null,null,null,0.51352556826356399,655,0.49,100907.77416379031]
[null,null,null,null,null,0.5131258732966486,656,0.49,100983.17186478045]
[null,null,null,null,null,0.51272678715703202,657,0.49,101058.44974865099]
[null,null,null,null,null,0.51232830799276674,658,0.49,101133.60799777215]
[null,null,null,null,null,0.51193043396034299,659,0.49,101208.64679395982]
[null,null,null,null,null,0.51153316322463649,660,0.49,101283.56631847803]
[null,null,null,null,null,0.51113649395885807,661,0.49,101358.36675204156]
[null,null,null,null,null,0.51074042434450373,662,0.49,101433.04827481843]
[null,null,null,null,null,0.51034495257130397,663,0.49,101507.61106643235]
[null,null,null,null,null,0.5099500768371743,664,0.49,101582.0553059651]
[null,null,null,null,null,0.50955579534816597,665,0.49,101656.38117195912]
[null,null,null,null,null,0.50916210631841774,666,0.49,101730.58884241985]
[null,null,null,null,null,0.5087690079701066,667,0.49,101804.67849481833]
[null,null,null,null,null,0.50837649853339872,668,0.49,101878.65030609311]
[null,null,null,null,null,0.50798457624640392,669,0.49,101952.50445265326]
[null,null,null,null,null,0.50759323935512679,670,0.49,102026.24111038048]
[null,null,null,null,null,0.50720248611341923,671,0.49,102099.86045463129]
[null,null,null,null,null,0.50681231478293465,672,0.49,102173.36266023963]
[null,null,null,null,null,0.50642272363308116,673,0.49,102246.74790151908]
[null,null,null,null,null,0.50603371094097538,674,0.49,102320.01635226521]
[null,null,null,null,null,0.50564527499139689,675,0.49,102393.16818575788]
[null,null,null,null,null,0.50525741407674318,676,0.49,102466.20357476351]
[null,null,null,null,null,0.50487012649698371,677,0.49,102539.12269153738]
[null,null,null,null,null,0.50448341055961632,678,0.49,102611.92570782597]
[null,null,null,null,null,0.50409726457962134,679,0.49,102684.61279486885]
[null,null,null,null,null,0.50371168687942003,680,0.49,102757.18412340169]
[null,null,null,null,null,0.50332667578882773,681,0.49,102829.6398636575]
[null,null,null,null,null,0.50294222964501278,682,0.49,102901.98018536961]
[null,null,null,null,null,0.50255834679245281,683,0.49,102974.20525777359]
[null,null,null,null,null,0.50217502558289162,684,0.49,103046.31524960935]
[null,null,null,null,null,0.50179226437529678,685,0.49,103118.31032912347]
[null,null,null,null,null,0.50141006153581791,686,0.49,103190.19066407133]
[null,null,null,null,null,0.50102841543774446,687,0.49,103261.95642171914]
[null,null,null,null,null,0.50064732446146376,688,0.49,103333.60776884612]
[null,null,null,null,null,0.50026678699442129,689,0.49,103405.14487174689]
[null,null,null,null,null,0.499886801431078,690,0.49,103476.56789623316]
[null,null,null,null,null,0.49950736617287017,691,0.49,103547.87700763598]
[null,null,null,null,null,0.49912847962817053,692,0.49,103619.07237080819]
[null,null,null,null,null,0.49875014021224517,693,0.49,103690.15415012577]
[null,null,null,null,null,0.49837234634721694,694,0.49,103761.12250949057]
[null,null,null,null,null,0.49799509646202433,695,0.49,103831.97761233208]
[null,null,null,null,null,0.49761838899238175,696,0.49,103902.71962160931]
[null,null,null,null,null,0.49724222238074245,697,0.49,103973.34869981323]
[null,null,null,null,null,0.4968665950762583,698,0.49,104043.86500896848]
[null,null,null,null,null,0.49649150553474164,699,0.49,104114.26871063531]
[null,null,null,null,null,0.49611695221862795,700,0.49,104184.55996591186]
[null,null,null,null,null,0.49574293359693722,701,0.49,104254.73893543589]
[null,null,null,null,null,0.49536944814523731,702,0.49,104324.80577938697]
[null,null,null,null,null,0.49499649434560555,703,0.49,104394.76065748821]
[null,null,null,null,null,0.49462407068659275,704,0.49,104464.60372900839]
[null,null,null,null,null,{"$f":"-0.262*LN(G791)+2.2125","v":0.49425217566318547},705,0.49,{"$f":"$H$84*F791*1000*G791","v":104534.3351527637}]
[null,null,null,null,null,0.49388080777677046,706,0.49,104603.95508711998]
[null,null,null,null,null,0.49350996553509763,707,0.49,104673.46368999421]
[null,null,null,null,null,0.49313964745224537,708,0.49,104742.8611188569]
[null,null,null,null,null,0.49276985204858237,709,0.49,104812.14753073348]
[null,null,null,null,null,0.49240057785073521,710,0.49,104881.3230822066]
[null,null,null,null,null,0.49203182339155083,711,0.49,104950.38792941778]
[null,null,null,null,null,0.49166358721006209,712,0.49,105019.34222806926]
[null,null,null,null,null,0.49129586785145429,713,0.49,105088.18613342606]
[null,null,null,null,null,0.49092866386702871,714,0.49,105156.91980031754]
[null,null,null,null,null,0.49056197381416999,715,0.49,105225.54338313946]
[null,null,null,null,null,0.4901957962563106,716,0.49,105294.0570358555]
[null,null,null,null,null,0.4898301297628993,717,0.49,105362.46091199963]
[null,null,null,null,null,0.48946497290936519,718,0.49,105430.75516467726]
[null,null,null,null,null,0.4891003242770855,719,0.49,105498.93994656733]
[null,null,null,null,null,0.48873618245335337,720,0.49,105567.01540992432]
[null,null,null,null,null,0.48837254603134306,721,0.49,105634.98170657952]
[null,null,null,null,null,0.48800941361007943,722,0.49,105702.83898794321]
[null,null,null,null,null,0.4876467837944034,723,0.49,105770.5874050061]
[null,null,null,null,null,0.48728465519494235,724,0.49,105838.22710834147]
[null,null,null,null,null,0.48692302642807506,725,0.49,105905.75824810633]
[null,null,null,null,null,0.48656189611590328,726,0.49,105973.18097404372]
[null,null,null,null,null,0.48620126288621779,727,0.49,106040.49543548409]
[null,null,null,null,null,0.48584112537246815,728,0.49,106107.70178134704]
[null,null,null,null,null,0.48548148221373144,729,0.49,106174.80016014307]
[null,null,null,null,null,0.48512233205468136,730,0.49,106241.79071997522]
[null,null,null,null,null,0.48476367354555805,731,0.49,106308.67360854088]
[null,null,null,null,null,0.48440550534213633,732,0.49,106375.44897313314]
[null,null,null,null,null,0.4840478261056973,733,0.49,106442.11696064284]
[null,null,null,null,null,0.48369063450299676,734,0.49,106508.67771755988]
[null,null,null,null,null,0.48333392920623663,735,0.49,106575.13138997517]
[null,null,null,null,null,0.48297770889303426,736,0.49,106641.47812358195]
[null,null,null,null,null,0.4826219722463938,737,0.49,106707.71806367766]
[null,null,null,null,null,0.48226671795467602,738,0.49,106773.85135516527]
[null,null,null,null,null,0.48191194471157095,739,0.49,106839.87814255527]
[null,null,null,null,null,0.48155765121606753,740,0.49,106905.79856996698]
[null,null,null,null,null,0.48120383617242513,741,0.49,106971.6127811301]
[null,null,null,null,null,0.48085049829014626,742,0.49,107037.32091938655]
[null,null,null,null,null,0.48049763628394704,743,0.49,107102.9231276918]
[null,null,null,null,null,0.48014524887372989,744,0.49,107168.4195486165]
[null,null,null,null,null,0.4797933347845551,745,0.49,107233.81032434806]
[null,null,null,null,null,0.47944189274661464,746,0.49,107299.09559669234]
[null,null,null,null,null,0.47909092149520172,747,0.49,107364.27550707469]
[null,null,null,null,null,0.4787404197706866,748,0.49,107429.35019654207]
[null,null,null,null,null,0.4783903863184884,749,0.49,107494.31980576436]
[null,null,null,null,null,0.47804081988904645,750,0.49,107559.18447503545]
[null,null,null,null,null,0.47769171923779652,751,0.4,107623.94434427556]
[null,null,null,null,null,0.47734308312514173,752,0.4,107688.59955303198]
[null,null,null,null,null,0.47699491031642771,753,0.4,107753.15024048103]
[null,null,null,null,null,0.47664719958191526,754,0.4,107817.59654542922]
[null,null,null,null,null,0.47629994969675526,755,0.4,107881.93860631506]
[null,null,null,null,null,0.47595315944096206,756,0.4,107946.1765612102]
[null,null,null,null,null,0.47560682759938833,757,0.4,108010.31054782108]
[null,null,null,null,null,0.47526095296169846,758,0.4,108074.34070349025]
[null,null,null,null,null,0.47491553432234479,759,0.4,108138.2671651979]
[null,null,null,null,null,0.47457057048054119,760,0.4,108202.09006956338]
[null,null,null,null,null,0.47422606024023817,761,0.4,108265.80955284639]
[null,null,null,null,null,0.47388200241009848,762,0.4,108329.4257509485]
[null,null,null,null,null,0.47353839580347223,763,0.4,108392.9387994148]
[null,null,null,null,null,0.47319523923837137,764,0.4,108456.34883343473]
[null,null,null,null,null,0.47285253153744744,765,0.4,108519.65598784418]
[null,null,null,null,null,0.47251027152796499,766,0.4,108582.86039712635]
[null,null,null,null,null,0.47216845804177887,767,0.4,108645.96219541333]
[null,null,null,null,null,0.47182708991530964,768,0.4,108708.96151648732]
[null,null,null,null,null,{"$f":"-0.262*LN(G855)+2.2125","v":0.47148616598952109},769,0.4,{"$f":"$H$84*F855*1000*G855","v":108771.85849378251}]
[null,null,null,null,null,0.47114568510989474,770,0.4,108834.65326038568]
[null,null,null,null,null,0.47080564612640763,771,0.4,108897.34594903809]
[null,null,null,null,null,0.47046604789350832,772,0.4,108959.9366921365]
[null,null,null,null,null,0.47012688927009516,773,0.4,109022.42562173506]
[null,null,null,null,null,0.46978816911949117,774,0.4,109084.81286954586]
[null,null,null,null,null,0.46944988630942275,775,0.4,109147.0985669408]
[null,null,null,null,null,0.46911203971199655,776,0.4,109209.2828449528]
[null,null,null,null,null,0.46877462820367621,777,0.4,109271.3658342769]
[null,null,null,null,null,0.46843765066526122,778,0.4,109333.34766527195]
[null,null,null,null,null,0.46810110598186383,779,0.4,109395.22846796155]
[null,null,null,null,null,0.46776499304288688,780,0.4,109457.00837203553]
[null,null,null,null,null,0.467429310742002,781,0.4,109518.68750685106]
[null,null,null,null,null,0.46709405797712833,782,0.4,109580.26600143431]
[null,null,null,null,null,0.46675923365040961,783,0.4,109641.74398448122]
[null,null,null,null,null,0.46642483666819312,784,0.4,109703.121584359]
[null,null,null,null,null,0.46609086594100879,785,0.4,109764.39892910757]
[null,null,null,null,null,0.46575732038354767,786,0.4,109825.57614644054]
[null,null,null,null,null,0.46542419891464015,787,0.4,109886.65336374653]
[null,null,null,null,null,0.46509150045723557,788,0.4,109947.63070809048]
[null,null,null,null,null,0.46475922393838087,789,0.4,110008.50830621476]
[null,null,null,null,null,0.46442736828920017,790,0.4,110069.28628454046]
[null,null,null,null,null,0.46409593244487435,791,0.4,110129.96476916867]
[null,null,null,null,null,0.46376491534462017,792,0.4,110190.54388588174]
[null,null,null,null,null,0.46343431593166984,793,0.4,110251.02376014423]
[null,null,null,null,null,0.46310413315325016,794,0.4,110311.40451710417]
[null,null,null,null,null,0.46277436596056476,795,0.4,110371.6862815947]
[null,null,null,null,null,0.46244501330877141,796,0.4,110431.86917813461]
[null,null,null,null,null,0.46211607415696343,797,0.4,110491.95333092996]
[null,null,null,null,null,0.46178754746814987,798,0.4,110551.93886387507]
[null,null,null,null,null,0.4614594322092358,799,0.4,110611.82590055383]
[null,null,null,null,null,0.46113172735100294,800,0.4,110671.61456424071]
[null,null,null,null,null,0.4608044318680895,801,0.4,110731.30497790189]
[null,null,null,null,null,0.46047754473897307,802,0.4,110790.89726419693]
[null,null,null,null,null,0.46015106494594837,803,0.4,110850.39154547897]
[null,null,null,null,null,0.45982499147511069,804,0.4,110909.78794379669]
[null,null,null,null,null,0.45949932331633625,805,0.4,110969.08658089521]
[null,null,null,null,null,0.4591740594632634,806,0.4,111028.28757821709]
[null,null,null,null,null,0.45884919891327325,807,0.4,111087.39105690345]
[null,null,null,null,null,0.45852474066747306,808,0.4,111146.39713779547]
[null,null,null,null,null,0.45820068373067513,809,0.4,111205.30594143484]
[null,null,null,null,null,0.45787702711138101,810,0.4,111264.11758806558]
[null,null,null,null,null,0.45755376982176155,811,0.4,111322.83219763458]
[null,null,null,null,null,0.45723091087764023,812,0.4,111381.44988979316]
[null,null,null,null,null,0.45690844929847363,813,0.4,111439.97078389772]
[null,null,null,null,null,0.45658638410733432,814,0.4,111498.39499901104]
[null,null,null,null,null,0.45626471433089377,815,0.4,111556.72265390352]
[null,null,null,null,null,0.45594343899940393,816,0.4,111614.95386705408]
[null,null,null,null,null,0.45562255714667899,817,0.4,111673.08875665101]
[null,null,null,null,null,0.45530206781008031,818,0.4,111731.1274405937]
[null,null,null,null,null,0.45498197003049556,819,0.4,111789.07003649275]
[null,null,null,null,null,0.45466226285232558,820,0.4,111846.9166616721]
[null,null,null,null,null,0.45434294532346375,821,0.4,111904.66743316912]
[null,null,null,null,null,0.45402401649528068,822,0.4,111962.32246773622]
[null,null,null,null,null,0.45370547542260753,823,0.4,112019.88188184178]
[null,null,null,null,null,0.45338732116371827,824,0.4,112077.34579167113]
[null,null,null,null,null,0.45306955278031347,825,0.4,112134.7143131276]
[null,null,null,null,null,0.45275216933750362,826,0.4,112191.98756183339]
[null,null,null,null,null,0.45243516990379273,827,0.4,112249.16565313096]
[null,null,null,null,null,0.4521185535510619,828,0.4,112306.24870208376]
[null,null,null,null,null,0.45180231935455262,829,0.4,112363.23682347721]
[null,null,null,null,null,0.45148646639285128,830,0.4,112420.13013181997]
[null,null,null,null,null,0.45117099374787228,831,0.4,112476.92874134456]
[null,null,null,null,null,0.45085590050484314,832,0.4,112533.63276600884]
[null,null,null,null,null,{"$f":"-0.262*LN(G919)+2.2125","v":0.45054118575228697},833,0.4,{"$f":"$H$84*F919*1000*G919","v":112590.24231949649}]
[null,null,null,null,null,0.45022684858200823,834,0.4,112646.75751521844]
[null,null,null,null,null,0.44991288808907592,835,0.4,112703.1784663135]
[null,null,null,null,null,0.44959930337180798,836,0.4,112759.50528564943]
[null,null,null,null,null,0.4492860935317573,837,0.4,112815.73808582424]
[null,null,null,null,null,0.44897325767369423,838,0.4,112871.87697916674]
[null,null,null,null,null,0.44866079490559185,839,0.4,112927.92207773746]
[null,null,null,null,null,0.44834870433861163,840,0.4,112983.87349333012]
[null,null,null,null,null,0.44803698508708734,841,0.4,113039.73133747216]
[null,null,null,null,null,0.44772563626851025,842,0.4,113095.49572142569]
[null,null,null,null,null,0.44741465700351379,843,0.4,113151.16675618864]
[null,null,null,null,null,0.44710404641585888,844,0.4,113206.74455249545]
[null,null,null,null,null,0.44679380363242016,845,0.4,113262.2292208185]
[null,null,null,null,null,0.44648392778316937,846,0.4,113317.62087136839]
[null,null,null,null,null,0.44617441800116153,847,0.4,113372.91961409512]
[null,null,null,null,null,0.44586527342252125,848,0.4,113428.1255586894]
[null,null,null,null,null,0.44555649318642665,849,0.4,113483.23881458286]
[null,null,null,null,null,0.44524807643509678,850,0.4,113538.25949094968]
[null,null,null,null,null,0.44494002231377583,851,0.4,113593.18769670695]
[null,null,null,null,null,0.44463232997071911,852,0.4,113648.02354051579]
[null,null,null,null,null,0.44432499855717977,853,0.4,113702.76713078229]
[null,null,null,null,null,0.44401802722739436,854,0.4,113757.41857565843]
[null,null,null,null,null,0.44371141513856882,855,0.4,113811.97798304289]
[null,null,null,null,null,0.44340516145086339,856,0.4,113866.44546058172]
[null,null,null,null,null,0.44309926532738153,857,0.4,113920.82111566978]
[null,null,null,null,null,0.44279372593415367,858,0.4,113975.10505545116]
[null,null,null,null,null,0.44248854244012503,859,0.4,114029.29738682021]
[null,null,null,null,null,0.44218371401714096,860,0.4,114083.39821642236]
[null,null,null,null,null,0.44187923983993449,861,0.4,114137.40765065509]
[null,null,null,null,null,0.44157511908611236,862,0.4,114191.32579566864]
[null,null,null,null,null,0.44127135093614167,863,0.4,114245.15275736708]
[null,null,null,null,null,0.44096793457333727,864,0.4,114298.88864140899]
[null,null,null,null,null,0.44066486918384751,865,0.4,114352.53355320841]
[null,null,null,null,null,0.4403621539566418,866,0.4,114406.08759793553]
[null,null,null,null,null,0.44005978808349799,867,0.4,114459.55088051781]
[null,null,null,null,null,0.43975777075898792,868,0.4,114512.92350564044]
[null,null,null,null,null,0.43945610118046718,869,0.4,114566.20557774779]
[null,null,null,null,null,0.43915477854805895,870,0.4,114619.39720104339]
[null,null,null,null,null,0.43885380206464397,871,0.4,114672.49847949145]
[null,null,null,null,null,0.43855317093584723,872,0.4,114725.50951681762]
[null,null,null,null,null,0.43825288437002419,873,0.4,114778.43041650933]
[null,null,null,null,null,0.43795294157824949,874,0.4,114831.26128181702]
[null,null,null,null,null,0.43765334177430493,875,0.4,114884.00221575504]
[null,null,null,null,null,0.43735408417466526,876,0.4,114936.65332110203]
[null,null,null,null,null,0.43705516799848798,877,0.4,114989.21470040218]
[null,null,null,null,null,0.43675659246759913,878,0.4,115041.68645596561]
[null,null,null,null,null,0.43645835680648348,879,0.4,115094.06868986967]
[null,null,null,null,null,0.43616046024226995,880,0.4,115146.36150395926]
[null,null,null,null,null,0.43586290200472066,881,0.4,115198.56499984766]
[null,null,null,null,null,0.43556568132622053,882,0.4,115250.67927891795]
[null,null,null,null,null,0.43526879744176239,883,0.4,115302.70444232285]
[null,null,null,null,null,0.43497224958893721,884,0.4,115354.64059098614]
[null,null,null,null,null,0.43467603700792234,885,0.4,115406.48782560337]
[null,null,null,null,null,0.43438015894146864,886,0.4,115458.24624664236]
[null,null,null,null,null,0.43408461463489001,887,0.4,115509.91595434422]
[null,null,null,null,null,0.4337894033360512,888,0.4,115561.49704872404]
[null,null,null,null,null,0.43349452429535673,889,0.4,115612.98962957163]
[null,null,null,null,null,0.43319997676573929,890,0.4,115664.39379645238]
[null,null,null,null,null,0.4329057600026478,891,0.4,115715.70964870774]
[null,null,null,null,null,0.43261187326403738,892,0.4,115766.9372854564]
[null,null,null,null,null,0.43231831581035718,893,0.4,115818.0768055947]
[null,null,null,null,null,0.43202508690453922,894,0.4,115869.12830779741]
[null,null,null,null,null,0.4317321858119878,895,0.4,115920.09189051871]
[null,null,null,null,null,0.43143961180056811,896,0.4,115970.96765199272]
[null,null,null,null,null,{"$f":"-0.262*LN(G983)+2.2125","v":0.4311473641405954},897,0.4,{"$f":"$H$84*F983*1000*G983","v":116021.75569023423}]
[null,null,null,null,null,0.43085544210482341,898,0.4,116072.45610303943]
[null,null,null,null,null,0.43056384496843547,899,0.4,116123.06898798702]
[null,null,null,null,null,0.43027257200903035,900,0.4,116173.59444243819]
[null,null,null,null,null,0.42998162250661531,901,0.4,116224.0325635381]
[null,null,null,null,null,0.42969099574359237,902,0.4,116274.38344821609]
[null,null,null,null,null,0.42940069100474965,903,0.4,116324.64719318667]
[null,null,null,null,null,0.42911070757724978,904,0.4,116374.82389495014]
[null,null,null,null,null,0.42882104475061933,905,0.4,116424.91364979313]
[null,null,null,null,null,0.42853170181673916,906,0.4,116474.91655378969]
[null,null,null,null,null,0.42824267806983407,907,0.4,116524.83270280184]
[null,null,null,null,null,0.42795397280646097,908,0.4,116574.66219247997]
[null,null,null,null,null,0.42766558532550047,909,0.4,116624.40511826397]
[null,null,null,null,null,0.42737751492814513,910,0.4,116674.06157538362]
[null,null,null,null,null,0.42708976091789075,911,0.4,116723.63165885954]
[null,null,null,null,null,0.42680232260052509,912,0.4,116773.11546350367]
[null,null,null,null,null,0.4265151992841183,913,0.4,116822.51308392]
[null,null,null,null,null,0.42622839027901271,914,0.4,116871.82461450528]
[null,null,null,null,null,0.42594189489781331,915,0.4,116921.05014944976]
[null,null,null,null,null,0.42565571245537792,916,0.4,116970.18978273786]
[null,null,null,null,null,0.42536984226880614,917,0.4,117019.24360814856]
[null,null,null,null,null,0.42508428365743134,918,0.4,117068.21171925661]
[null,null,null,null,null,0.42479903594280977,919,0.4,117117.09420943263]
[null,null,null,null,null,0.42451409844871124,920,0.4,117165.8911718443]
[null,null,null,null,null,0.42422947050110937,921,0.4,117214.6026994565]
[null,null,null,null,null,0.42394515142817224,922,0.4,117263.22888503244]
[null,null,null,null,null,0.42366114056025261,923,0.4,117311.76982113394]
[null,null,null,null,null,0.42337743722987864,924,0.4,117360.22560012237]
[null,null,null,null,null,0.42309404077174451,925,0.4,117408.59631415909]
[null,null,null,null,null,0.4228109505227009,926,0.4,117456.8820552063]
[null,null,null,null,null,0.4225281658217459,927,0.4,117505.08291502752]
[null,null,null,null,null,0.42224568601001522,928,0.4,117553.19898518822]
[null,null,null,null,null,0.42196351043077418,929,0.4,117601.23035705675]
[null,null,null,null,null,0.42168163842940687,930,0.4,117649.17712180453]
[null,null,null,null,null,0.42140006935340835,931,0.4,117697.03937040694]
[null,null,null,null,null,0.4211188025523751,932,0.4,117744.81719364408]
[null,null,null,null,null,0.42083783737799574,933,0.4,117792.51068210101]
[null,null,null,null,null,0.42055717318404295,934,0.4,117840.11992616883]
[null,null,null,null,null,0.4202768093263638,935,0.4,117887.64501604503]
[null,null,null,null,null,0.41999674516287078,936,0.4,117935.0860417341]
[null,null,null,null,null,0.4197169800535332,937,0.4,117982.44309304819]
[null,null,null,null,null,0.41943751336036894,938,0.4,118029.71625960781]
[null,null,null,null,null,0.41915834444743494,939,0.4,118076.90563084243]
[null,null,null,null,null,0.41887947268081871,940,0.4,118124.01129599087]
[null,null,null,null,null,0.41860089742863038,941,0.4,118171.03334410235]
[null,null,null,null,null,0.41832261806099269,942,0.4,118217.97186403655]
[null,null,null,null,null,0.41804463395003388,943,0.4,118264.82694446458]
[null,null,null,null,null,0.41776694446987883,944,0.4,118311.5986738697]
[null,null,null,null,null,0.41748954899663926,945,0.4,118358.28714054723]
[null,null,null,null,null,0.41721244690840775,946,0.4,118404.89243260611]
[null,null,null,null,null,0.41693563758524732,947,0.4,118451.41463796876]
[null,null,null,null,null,0.41665912040918429,948,0.4,118497.853844372]
[null,null,null,null,null,0.41638289476419876,949,0.4,118544.21013936738]
[null,null,null,null,null,0.41610696003621817,950,0.4,118590.48361032218]
[null,null,null,null,null,0.41583131561310749,951,0.4,118636.67434441956]
[null,null,null,null,null,0.41555596088466218,952,0.4,118682.78242865951]
[null,null,null,null,null,0.41528089524259904,953,0.4,118728.80794985907]
[null,null,null,null,null,0.41500611808054866,954,0.4,118774.75099465302]
[null,null,null,null,null,0.41473162879404857,955,0.4,118820.61164949491]
[null,null,null,null,null,0.41445742678053277,956,0.4,118866.39000065679]
[null,null,null,null,null,0.41418351143932575,957,0.4,118912.08613423041]
[null,null,null,null,null,0.41390988217163449,958,0.4,118957.70013612775]
[null,null,null,null,null,0.41363653838053893,959,0.4,119003.23209208105]
[null,null,null,null,null,0.41336347947098684,960,0.4,119048.68208764421]
[null,null,null,null,null,{"$f":"-0.262*LN(G1047)+2.2125","v":0.41309070484978316},961,0.4,{"$f":"$H$84*F1047*1000*G1047","v":119094.05020819248}]
[null,null,null,null,null,0.41281821392558471,962,0.4,119139.33653892374]
[null,null,null,null,null,0.41254600610889081,963,0.4,119184.54116485854]
[null,null,null,null,null,0.41227408081203687,964,0.4,119229.66417084106]
[null,null,null,null,null,0.41200243744918552,965,0.4,119274.70564153921]
[null,null,null,null,null,0.41173107543632015,966,0.4,119319.66566144557]
[null,null,null,null,null,0.41145999419123669,967,0.4,119364.54431487777]
[null,null,null,null,null,0.41118919313353675,968,0.4,119409.34168597906]
[null,null,null,null,null,0.41091867168461893,969,0.4,119454.05785871872]
[null,null,null,null,null,0.41064842926767353,970,0.4,119498.69291689299]
[null,null,null,null,null,0.41037846530767252,971,0.4,119543.24694412501]
[null,null,null,null,null,0.41010877923136491,972,0.4,119587.720023866]
[null,null,null,null,null,0.40983937046726648,973,0.4,119632.11223939508]
[null,null,null,null,null,0.40957023844565565,974,0.4,119676.42367382058]
[null,null,null,null,null,0.40930138259856386,975,0.4,119720.65441007992]
[null,null,null,null,null,0.4090328023597698,976,0.4,119764.8045309406]
[null,null,null,null,null,0.4087644971647908,977,0.4,119808.87411900019]
[null,null,null,null,null,0.40849646645087767,978,0.4,119852.8632566875]
[null,null,null,null,null,0.40822870965700608,979,0.4,119896.77202626268]
[null,null,null,null,null,0.4079612262238701,980,0.4,119940.6005098178]
[null,null,null,null,null,0.40769401559387464,981,0.4,119984.34878927731]
[null,null,null,null,null,0.40742707721112992,982,0.4,120028.01694639887]
[null,null,null,null,null,0.40716041052144214,983,0.4,120071.60506277329]
[null,null,null,null,null,0.40689401497230948,984,0.4,120115.11321982575]
[null,null,null,null,null,0.40662789001291255,985,0.4,120158.54149881566]
[null,null,null,null,null,0.40636203509410951,986,0.4,120201.88998083759]
[null,null,null,null,null,0.40609644966842762,987,0.4,120245.15874682141]
[null,null,null,null,null,0.40583113319005837,988,0.4,120288.34787753331]
[null,null,null,null,null,0.40556608511484926,989,0.4,120331.45745357577]
[null,null,null,null,null,0.40530130490029737,990,0.4,120374.48755538832]
[null,null,null,null,null,0.40503679200554288,991,0.4,120417.4382632479]
[null,null,null,null,null,0.40477254589136336,992,0.4,120460.30965726972]
[null,null,null,null,null,0.40450856602016461,993,0.4,120503.10181740703]
[null,null,null,null,null,0.40424485185597736,994,0.4,120545.81482345244]
[null,null,null,null,null,0.40398140286444861,995,0.4,120588.4487550379]
[null,null,null,null,null,0.40371821851283518,996,0.4,120631.00369163515]
[null,null,null,null,null,0.40345529826999815,997,0.4,120673.47971255644]
[null,null,null,null,null,0.40319264160639623,998,0.4,120715.87689695501]
[null,null,null,null,null,0.40293024799407862,999,0.4,120758.19532382536]
[null,null,null,null,null,0.40266811690667992,1000,0.4,120800.43507200397]
[null,null,null,null,null,0.40240624781941214,1001,0.34,120842.59622016946]
[null,null,null,null,null,0.4021446402090596,1002,0.34,120884.67884684331]
[null,null,null,null,null,0.40188329355397268,1003,0.34,120926.68303039038]
[null,null,null,null,null,0.40162220733406118,1004,0.34,120968.60884901922]
[null,null,null,null,null,0.40136138103078767,1005,0.34,121010.45638078247]
[null,null,null,null,null,0.40110081412716236,1006,0.34,121052.22570357758]
[null,null,null,null,null,0.40084050610773647,1007,0.34,121093.91689514718]
[null,null,null,null,null,0.40058045645859552,1008,0.34,121135.53003307928]
[null,null,null,null,null,0.4003206646673545,1009,0.34,121177.06519480821]
[null,null,null,null,null,0.40006113022315004,1010,0.34,121218.52245761445]
[null,null,null,null,null,0.39980185261663626,1011,0.34,121259.90189862576]
[null,null,null,null,null,0.39954283133997803,1012,0.34,121301.20359481733]
[null,null,null,null,null,0.39928406588684484,1013,0.34,121342.42762301213]
[null,null,null,null,null,0.39902555575240406,1014,0.34,121383.57405988131]
[null,null,null,null,null,0.39876730043331721,1015,0.34,121424.64298194509]
[null,null,null,null,null,0.39850929942773194,1016,0.34,121465.63446557269]
[null,null,null,null,null,0.3982515522352772,1017,0.34,121506.54858698306]
[null,null,null,null,null,0.39799405835705715,1018,0.34,121547.38542224525]
[null,null,null,null,null,0.39773681729564592,1019,0.34,121588.14504727896]
[null,null,null,null,null,0.39747982855508091,1020,0.34,121628.82753785476]
[null,null,null,null,null,0.39722309164085745,1021,0.34,121669.43296959464]
[null,null,null,null,null,0.39696660605992351,1022,0.34,121709.96141797255]
[null,null,null,null,null,0.39671037132067388,1023,0.34,121750.41295831482]
[null,null,null,null,null,0.3964543869329431,1024,0.34,121790.7876658001]
[null,null,null,null,null,{"$f":"-0.262*LN(G1111)+2.2125","v":0.39619865240800256},1025,0.34,{"$f":"$H$84*F1111*1000*G1111","v":121831.08561546079}]
[null,null,null,null,null,0.3959431672585525,1026,0.34,121871.30688218244]
[null,null,null,null,null,0.3956879309987178,1027,0.34,121911.45154070495]
[null,null,null,null,null,0.39543294314404109,1028,0.34,121951.51966562227]
[null,null,null,null,null,0.39517820321147878,1029,0.34,121991.51133138349]
[null,null,null,null,null,0.39492371071939525,1030,0.34,122031.42661229311]
[null,null,null,null,null,0.39466946518755619,1031,0.34,122071.26558251111]
[null,null,null,null,null,0.39441546613712464,1032,0.34,122111.02831605379]
[null,null,null,null,null,0.39416171309065451,1033,0.34,122150.71488679382]
[null,null,null,null,null,0.39390820557208572,1034,0.34,122190.32536846098]
[null,null,null,null,null,0.39365494310673887,1035,0.34,122229.85983464241]
[null,null,null,null,null,0.39340192522130968,1036,0.34,122269.31835878303]
[null,null,null,null,null,0.39314915144386364,1037,0.34,122308.70101418596]
[null,null,null,null,null,0.39289662130383141,1038,0.34,122348.0078740131]
[null,null,null,null,null,0.3926443343320023,1039,0.34,122387.23901128511]
[null,null,null,null,null,0.39239229006052012,1040,0.34,122426.39449888226]
[null,null,null,null,null,0.39214048802287782,1041,0.34,122465.47440954472]
[null,null,null,null,null,0.39188892775391193,1042,0.34,122504.47881587286]
[null,null,null,null,null,0.39163760878979748,1043,0.34,122543.40779032763]
[null,null,null,null,null,0.39138653066804285,1044,0.34,122582.26140523102]
[null,null,null,null,null,0.39113569292748496,1045,0.34,122621.03973276653]
[null,null,null,null,null,0.39088509510828429,1046,0.34,122659.74284497961]
[null,null,null,null,null,0.39063473675191918,1047,0.34,122698.37081377782]
[null,null,null,null,null,0.39038461740118113,1048,0.34,122736.92371093135]
[null,null,null,null,null,0.39013473660016995,1049,0.34,122775.40160807347]
[null,null,null,null,null,0.38988509389428883,1050,0.34,122813.80457670099]
[null,null,null,null,null,0.38963568883023858,1051,0.34,122852.13268817423]
[null,null,null,null,null,0.38938652095601411,1052,0.34,122890.38601371806]
[null,null,null,null,null,0.38913758982089819,1053,0.34,122928.56462442174]
[null,null,null,null,null,0.3888888949754572,1054,0.34,122966.66859123956]
[null,null,null,null,null,0.38864043597153608,1055,0.34,123004.69798499116]
[null,null,null,null,null,0.38839221236225363,1056,0.34,123042.65287636194]
[null,null,null,null,null,0.38814422370199764,1057,0.34,123080.53333590344]
[null,null,null,null,null,0.38789646954641976,1058,0.34,123118.33943403362]
[null,null,null,null,null,0.38764894945243134,1059,0.34,123156.07124103744]
[null,null,null,null,null,0.38740166297819822,1060,0.34,123193.72882706703]
[null,null,null,null,null,0.38715460968313642,1061,0.34,123231.31226214232]
[null,null,null,null,null,0.38690778912790624,1062,0.34,123268.82161615092]
[null,null,null,null,null,0.38666120087440947,1063,0.34,123306.25695884918]
[null,null,null,null,null,0.38641484448578334,1064,0.34,123343.61835986203]
[null,null,null,null,null,0.38616871952639631,1065,0.34,123380.90588868363]
[null,null,null,null,null,0.38592282556184299,1066,0.34,123418.11961467739]
[null,null,null,null,null,0.38567716215894032,1067,0.34,123455.2596070768]
[null,null,null,null,null,0.38543172888572297,1068,0.34,123492.32593498564]
[null,null,null,null,null,0.38518652531143793,1069,0.34,123529.31866737813]
[null,null,null,null,null,0.38494155100654059,1070,0.34,123566.23787309951]
[null,null,null,null,null,0.38469680554268959,1071,0.34,123603.08362086616]
[null,null,null,null,null,0.38445228849274393,1072,0.34,123639.85597926645]
[null,null,null,null,null,0.38420799943075679,1073,0.34,123676.55501676061]
[null,null,null,null,null,0.38396393793197148,1074,0.34,123713.18080168121]
[null,null,null,null,null,0.38372010357281794,1075,0.34,123749.73340223377]
[null,null,null,null,null,0.38347649593090671,1076,0.34,123786.21288649668]
[null,null,null,null,null,0.38323311458502607,1077,0.34,123822.61932242192]
[null,null,null,null,null,0.38298995911513711,1078,0.34,123858.95277783534]
[null,null,null,null,null,0.38274702910236869,1079,0.34,123895.21332043673]
[null,null,null,null,null,0.38250432412901425,1080,0.34,123931.40101780061]
[null,null,null,null,null,0.38226184377852723,1081,0.34,123967.51593737637]
[null,null,null,null,null,0.38201958763551613,1082,0.34,124003.55814648853]
[null,null,null,null,null,0.38177755528574031,1083,0.34,124039.52771233702]
[null,null,null,null,null,0.38153574631610687,1084,0.34,124075.42470199795]
[null,null,null,null,null,0.38129416031466512,1085,0.34,124111.24918242349]
[null,null,null,null,null,0.38105279687060323,1086,0.34,124147.00122044253]
[null,null,null,null,null,0.3808116555742429,1087,0.34,124182.68088276061]
[null,null,null,null,null,0.38057073601703717,1088,0.34,124218.28823596094]
[null,null,null,null,null,{"$f":"-0.262*LN(G1175)+2.2125","v":0.38033003779156416},1089,0.34,{"$f":"$H$84*F1175*1000*G1175","v":124253.82334650401}]
[null,null,null,null,null,0.3800895604915242,1090,0.34,124289.28628072843]
[null,null,null,null,null,0.37984930371173542,1091,0.34,124324.677104851]
[null,null,null,null,null,0.37960926704812903,1092,0.34,124359.99588496707]
[null,null,null,null,null,0.3793694500977467,1093,0.34,124395.24268705113]
[null,null,null,null,null,0.37912985245873498,1094,0.34,124430.41757695682]
[null,null,null,null,null,0.37889047373034224,1095,0.34,124465.52062041742]
[null,null,null,null,null,0.37865131351291392,1096,0.34,124500.55188304609]
[null,null,null,null,null,0.37841237140788953,1097,0.34,124535.51143033642]
[null,null,null,null,null,0.37817364701779721,1098,0.34,124570.3993276624]
[null,null,null,null,null,0.37793513994625116,1099,0.34,124605.215640279]
[null,null,null,null,null,0.37769684979794693,1100,0.34,124639.96043332249]
[null,null,null,null,null,0.37745877617865764,1101,0.34,124674.63377181061]
[null,null,null,null,null,0.37722091869523067,1102,0.34,124709.23572064325]
[null,null,null,null,null,0.37698327695558209,1103,0.34,124743.7663446021]
[null,null,null,null,null,0.37674585056869536,1104,0.34,124778.22570835189]
[null,null,null,null,null,0.37650863914461441,1105,0.34,124812.61387643967]
[null,null,null,null,null,0.37627164229444232,1106,0.34,124846.93091329596]
[null,null,null,null,null,0.37603485963033689,1107,0.34,124881.17688323488]
[null,null,null,null,null,0.37579829076550575,1108,0.34,124915.3518504541]
[null,null,null,null,null,0.37556193531420368,1109,0.34,124949.45587903557]
[null,null,null,null,null,0.3753257928917284,1110,0.34,124983.48903294555]
[null,null,null,null,null,0.37508986311441661,1111,0.34,125017.45137603505]
[null,null,null,null,null,0.37485414559964148,1112,0.34,125051.34297204039]
[null,null,null,null,null,0.37461863996580713,1113,0.34,125085.163884583]
[null,null,null,null,null,0.37438334583234556,1114,0.34,125118.91417716989]
[null,null,null,null,null,0.37414826281971436,1115,0.34,125152.59391319445]
[null,null,null,null,null,0.37391339054939077,1116,0.34,125186.20315593603]
[null,null,null,null,null,0.3736787286438692,1117,0.34,125219.74196856057]
[null,null,null,null,null,0.37344427672665814,1118,0.34,125253.21041412113]
[null,null,null,null,null,0.37321003442227552,1119,0.34,125286.60855555789]
[null,null,null,null,null,0.37297600135624509,1120,0.34,125319.93645569833]
[null,null,null,null,null,0.37274217715509383,1121,0.34,125353.19417725805]
[null,null,null,null,null,0.3725085614463477,1122,0.34,125386.38178284065]
[null,null,null,null,null,0.37227515385852783,1123,0.34,125419.49933493802]
[null,null,null,null,null,0.37204195402114726,1124,0.34,125452.54689593085]
[null,null,null,null,null,0.37180896156470733,1125,0.34,125485.5245280887]
[null,null,null,null,null,0.37157617612069527,1126,0.34,125518.43229357085]
[null,null,null,null,null,0.3713435973215784,1127,0.34,125551.27025442566]
[null,null,null,null,null,0.37111122480080261,1128,0.34,125584.03847259159]
[null,null,null,null,null,0.37087905819278855,1129,0.34,125616.73700989748]
[null,null,null,null,null,0.37064709713292676,1130,0.34,125649.36592806218]
[null,null,null,null,null,0.37041534125757614,1131,0.34,125681.92528869558]
[null,null,null,null,null,0.37018379020406011,1132,0.34,125714.41515329882]
[null,null,null,null,null,0.36995244361066204,1133,0.34,125746.83558326402]
[null,null,null,null,null,0.36972130111662316,1134,0.34,125779.18663987519]
[null,null,null,null,null,0.36949036236213795,1135,0.34,125811.46838430797]
[null,null,null,null,null,0.36925962698835235,1136,0.34,125843.68087763047]
[null,null,null,null,null,0.36902909463735933,1137,0.34,125875.82418080326]
[null,null,null,null,null,0.36879876495219555,1138,0.34,125907.89835467955]
[null,null,null,null,null,0.36856863757683822,1139,0.34,125939.90346000562]
[null,null,null,null,null,0.36833871215620184,1140,0.34,125971.83955742103]
[null,null,null,null,null,0.36810898833613592,1141,0.34,126003.70670745931]
[null,null,null,null,null,0.36787946576341946,1142,0.34,126035.5049705475]
[null,null,null,null,null,0.36765014408575958,1143,0.34,126067.23440700697]
[null,null,null,null,null,0.36742102295178714,1144,0.34,126098.89507705336]
[null,null,null,null,null,0.36719210201105468,1145,0.34,126130.48704079728]
[null,null,null,null,null,0.36696338091403224,1146,0.34,126162.01035824428]
[null,null,null,null,null,0.3667348593121047,1147,0.34,126193.46508929522]
[null,null,null,null,null,0.36650653685756795,1148,0.34,126224.8512937464]
[null,null,null,null,null,0.36627841320362586,1149,0.34,126256.16903128984]
[null,null,null,null,null,0.36605048800438822,1150,0.34,126287.41836151393]
[null,null,null,null,null,0.36582276091486654,1151,0.34,126318.59934390341]
[null,null,null,null,null,0.36559523159097052,1152,0.34,126349.7120378394]
[null,null,null,null,null,{"$f":"-0.262*LN(G1239)+2.2125","v":0.36536789968950645},1153,0.34,{"$f":"$H$84*F1239*1000*G1239","v":126380.75650260027}]
[null,null,null,null,null,0.36514076486817193,1154,0.34,126411.73279736111]
[null,null,null,null,null,0.36491382678555562,1155,0.34,126442.64098119503]
[null,null,null,null,null,0.36468708510113124,1156,0.34,126473.48111307231]
[null,null,null,null,null,0.36446053947525647,1157,0.34,126504.25325186152]
[null,null,null,null,null,0.36423418956916942,1158,0.34,126534.95745632946]
[null,null,null,null,null,0.36400803504498502,1159,0.34,126565.59378514129]
[null,null,null,null,null,0.36378207556569242,1160,0.34,126596.16229686096]
[null,null,null,null,null,0.36355631079515227,1161,0.34,126626.66304995153]
[null,null,null,null,null,0.36333074039809343,1162,0.34,126657.09610277537]
[null,null,null,null,null,0.36310536404010985,1163,0.34,126687.4615135943]
[null,null,null,null,null,0.36288018138765765,1164,0.34,126717.75934057005]
[null,null,null,null,null,0.36265519210805208,1165,0.34,126747.9896417642]
[null,null,null,null,null,0.36243039586946524,1166,0.34,126778.15247513894]
[null,null,null,null,null,0.36220579234092209,1167,0.34,126808.24789855682]
[null,null,null,null,null,0.36198138119229872,1168,0.34,126838.27596978148]
[null,null,null,null,null,0.36175716209431807,1169,0.34,126868.23674647734]
[null,null,null,null,null,0.36153313471854776,1170,0.34,126898.13028621025]
[null,null,null,null,null,0.36130929873739803,1171,0.34,126927.95664644793]
[null,null,null,null,null,0.36108565382411695,1172,0.34,126957.71588455951]
[null,null,null,null,null,0.36086219965278921,1173,0.34,126987.40805781652]
[null,null,null,null,null,0.36063893589833285,1174,0.34,127017.03322339283]
[null,null,null,null,null,0.36041586223649591,1175,0.34,127046.59143836481]
[null,null,null,null,null,0.360192978343854,1176,0.34,127076.08275971169]
[null,null,null,null,null,0.35997028389780739,1177,0.34,127105.50724431578]
[null,null,null,null,null,0.35974777857657858,1178,0.34,127134.86494896286]
[null,null,null,null,null,0.35952546205920854,1179,0.34,127164.15593034207]
[null,null,null,null,null,0.35930333402555581,1180,0.34,127193.38024504675]
[null,null,null,null,null,0.35908139415629092,1181,0.34,127222.53794957387]
[null,null,null,null,null,0.35885964213289623,1182,0.34,127251.62910032501]
[null,null,null,null,null,0.35863807763766253,1183,0.34,127280.65375360643]
[null,null,null,null,null,0.35841670035368467,1184,0.34,127309.61196562879]
[null,null,null,null,null,0.35819550996486127,1185,0.34,127338.50379250817]
[null,null,null,null,null,0.35797450615588988,1186,0.34,127367.32929026561]
[null,null,null,null,null,0.35775368861226675,1187,0.34,127396.0885148282]
[null,null,null,null,null,0.35753305702028104,1188,0.34,127424.78152202815]
[null,null,null,null,null,0.35731261106701506,1189,0.34,127453.40836760426]
[null,null,null,null,null,0.35709235044033938,1190,0.34,127481.96910720115]
[null,null,null,null,null,0.35687227482891126,1191,0.34,127510.46379636999]
[null,null,null,null,null,0.35665238392217247,1192,0.34,127538.89249056888]
[null,null,null,null,null,0.3564326774103459,1193,0.34,127567.25524516279]
[null,null,null,null,null,0.35621315498443229,1194,0.34,127595.55211542365]
[null,null,null,null,null,0.35599381633620975,1195,0.34,127623.78315653119]
[null,null,null,null,null,0.35577466115822864,1196,0.34,127651.94842357244]
[null,null,null,null,null,0.35555568914381097,1197,0.34,127680.0479715425]
[null,null,null,null,null,0.35533689998704654,1198,0.34,127708.08185534453]
[null,null,null,null,null,0.35511829338279122,1199,0.34,127736.05012979]
[null,null,null,null,null,0.35489986902666382,1200,0.34,127763.95284959898]
[null,null,null,null,null,0.3546816266150441,1201,0.34,127791.79006940038]
[null,null,null,null,null,0.35446356584506966,1202,0.34,127819.56184373211]
[null,null,null,null,null,0.35424568641463416,1203,0.34,127847.26822704147]
[null,null,null,null,null,0.35402798802238311,1204,0.34,127874.90927368478]
[null,null,null,null,null,0.35381047036771385,1205,0.34,127902.48503792856]
[null,null,null,null,null,0.35359313315077157,1206,0.34,127929.99557394916]
[null,null,null,null,null,0.35337597607244664,1207,0.34,127957.44093583293]
[null,null,null,null,null,0.35315899883437263,1208,0.34,127984.82117757662]
[null,null,null,null,null,0.35294220113892427,1209,0.34,128012.13635308783]
[null,null,null,null,null,0.35272558268921372,1210,0.34,128039.38651618458]
[null,null,null,null,null,0.35250914318908966,1211,0.34,128066.57172059627]
[null,null,null,null,null,0.35229288234313372,1212,0.34,128093.69201996342]
[null,null,null,null,null,0.35207679985665874,1213,0.34,128120.74746783811]
[null,null,null,null,null,0.35186089543570565,1214,0.34,128147.738117684]
[null,null,null,null,null,0.35164516878704188,1215,0.34,128174.66402287676]
[null,null,null,null,null,0.35142961961815833,1216,0.34,128201.52523670415]
[null,null,null,null,null,{"$f":"-0.262*LN(G1303)+2.2125","v":0.35121424763726772},1217,0.34,{"$f":"$H$84*F1303*1000*G1303","v":128228.32181236644}]
[null,null,null,null,null,0.35099905255330111,1218,0.34,128255.05380297622]
[null,null,null,null,null,0.35078403407590675,1219,0.34,128281.7212615591]
[null,null,null,null,null,0.35056919191544655,1220,0.34,128308.32424105344]
[null,null,null,null,null,0.3503545257829952,1221,0.34,128334.86279431114]
[null,null,null,null,null,0.35014003539033611,1222,0.34,128361.33697409721]
[null,null,null,null,null,0.34992572044996062,1223,0.34,128387.74683309055]
[null,null,null,null,null,0.3497115806750648,1224,0.34,128414.09242388379]
[null,null,null,null,null,0.34949761577954708,1225,0.34,128440.37379898355]
[null,null,null,null,null,0.34928382547800663,1226,0.34,128466.59101081084]
[null,null,null,null,null,0.34907020948574119,1227,0.34,128492.74411170134]
[null,null,null,null,null,0.34885676751874284,1228,0.34,128518.83315390487]
[null,null,null,null,null,0.34864349929369887,1229,0.34,128544.85818958677]
[null,null,null,null,null,0.34843040452798646,1230,0.34,128570.81927082701]
[null,null,null,null,null,0.34821748293967292,1231,0.34,128596.71644962119]
[null,null,null,null,null,0.3480047342475121,1232,0.34,128622.54977788047]
[null,null,null,null,null,0.34779215817094156,1233,0.34,128648.31930743127]
[null,null,null,null,null,0.34757975443008249,1234,0.34,128674.02509001654]
[null,null,null,null,null,0.34736752274573535,1235,0.34,128699.66717729496]
[null,null,null,null,null,0.34715546283937937,1236,0.34,128725.24562084187]
[null,null,null,null,null,0.34694357443316814,1237,0.34,128750.7604721487]
[null,null,null,null,null,0.34673185724992983,1238,0.34,128776.21178262393]
[null,null,null,null,null,0.34652031101316449,1239,0.34,128801.59960359323]
[null,null,null,null,null,0.34630893544704011,1240,0.34,128826.92398629891]
[null,null,null,null,null,0.34609773027639279,1241,0.34,128852.18498190104]
[null,null,null,null,null,0.34588669522672277,1242,0.34,128877.3826414769]
[null,null,null,null,null,0.34567583002419333,1243,0.34,128902.51701602168]
[null,null,null,null,null,0.3454651343956292,1244,0.34,128927.58815644882]
[null,null,null,null,null,0.34525460806851216,1245,0.34,128952.59611358929]
[null,null,null,null,null,0.34504425077098144,1246,0.34,128977.54093819286]
[null,null,null,null,null,0.34483406223183022,1247,0.34,129002.42268092767]
[null,null,null,null,null,0.34462404218050402,1248,0.34,129027.2413923807]
[null,null,null,null,null,0.34441419034709853,1249,0.34,129051.99712305782]
[null,null,null,null,null,0.34420450646235712,1250,0.34,129076.68992338391]
[null,null,null,null,null,0.34399499025766911,1251,0.34,129101.31984370321]
[null,null,null,null,null,0.3437856414650684,1252,0.34,129125.88693427968]
[null,null,null,null,null,0.34357645981722995,1253,0.34,129150.39124529675]
[null,null,null,null,null,0.34336744504746886,1254,0.34,129174.83282685778]
[null,null,null,null,null,0.34315859688973815,1255,0.34,129199.2117289864]
[null,null,null,null,null,0.34294991507862616,1256,0.34,129223.52800162633]
[null,null,null,null,null,0.3427413993493551,1257,0.34,129247.7816946418]
[null,null,null,null,null,0.34253304943777874,1258,0.34,129271.97285781769]
[null,null,null,null,null,0.34232486508038096,1259,0.34,129296.10154085988]
[null,null,null,null,null,0.3421168460142725,1260,0.34,129320.167793395]
[null,null,null,null,null,0.34190899197719071,1261,0.34,129344.17166497123]
[null,null,null,null,null,0.34170130270749643,1262,0.34,129368.11320505815]
[null,null,null,null,null,0.34149377794417113,1263,0.34,129391.99246304644]
[null,null,null,null,null,0.34128641742681753,1264,0.34,129415.8094882492]
[null,null,null,null,null,0.34107922089565523,1265,0.34,129439.56432990114]
[null,null,null,null,null,0.3408721880915202,1266,0.34,129463.25703715938]
[null,null,null,null,null,0.34066531875586148,1267,0.34,129486.88765910294]
[null,null,null,null,null,0.34045861263074095,1268,0.34,129510.45624473387]
[null,null,null,null,null,0.34025206945883024,1269,0.34,129533.96284297667]
[null,null,null,null,null,0.34004568898340892,1270,0.34,129557.40750267881]
[null,null,null,null,null,0.33983947094836275,1271,0.34,129580.7902726107]
[null,null,null,null,null,0.33963341509818212,1272,0.34,129604.11120146629]
[null,null,null,null,null,0.33942752117795916,1273,0.34,129627.37033786259]
[null,null,null,null,null,0.33922178893338728,1274,0.34,129650.56773034063]
[null,null,null,null,null,0.33901621811075788,1275,0.34,129673.70342736489]
[null,null,null,null,null,0.33881080845695921,1276,0.34,129696.77747732398]
[null,null,null,null,null,0.33860555971947459,1277,0.34,129719.78992853071]
[null,null,null,null,null,0.33840047164637999,1278,0.34,129742.74082922206]
[null,null,null,null,null,0.33819554398634288,1279,0.34,129765.63022755977]
[null,null,null,null,null,0.33799077648862008,1280,0.34,129788.4581716301]
[null,null,null,null,null,{"$f":"-0.262*LN(G1367)+2.2125","v":0.33778616890305546},1281,0.34,{"$f":"$H$84*F1367*1000*G1367","v":129811.2247094442}]
[null,null,null,null,null,0.33758172098007866,1282,0.34,129833.92988893825]
[null,null,null,null,null,0.33737743247070306,1283,0.34,129856.5737579736]
[null,null,null,null,null,0.33717330312652427,1284,0.34,129879.15636433715]
[null,null,null,null,null,0.33696933269971785,1285,0.34,129901.67775574123]
[null,null,null,null,null,0.33676552094303802,1286,0.34,129924.13797982407]
[null,null,null,null,null,0.33656186760981455,1287,0.34,129946.5370841494]
[null,null,null,null,null,0.33635837245395339,1288,0.34,129968.87511620759]
[null,null,null,null,null,0.33615503522993273,1289,0.34,129991.152123415]
[null,null,null,null,null,0.33595185569280184,1290,0.34,130013.36815311429]
[null,null,null,null,null,0.33574883359817953,1291,0.34,130035.52325257492]
[null,null,null,null,null,0.3355459687022524,1292,0.34,130057.61746899303]
[null,null,null,null,null,0.33534326076177323,1293,0.34,130079.65084949184]
[null,null,null,null,null,0.33514070953405839,1294,0.34,130101.62344112147]
[null,null,null,null,null,0.33493831477698666,1295,0.34,130123.5352908593]
[null,null,null,null,null,0.33473607624899815,1296,0.34,130145.38644561048]
[null,null,null,null,null,0.33453399370909143,1297,0.34,130167.17695220746]
[null,null,null,null,null,0.3343320669168226,1298,0.34,130188.90685741071]
[null,null,null,null,null,0.33413029563230268,1299,0.34,130210.57620790834]
[null,null,null,null,null,0.33392867961619732,1300,0.34,130232.18505031694]
[null,null,null,null,null,0.33372721862972354,1301,0.34,130253.7334311811]
[null,null,null,null,null,0.33352591243464902,1302,0.34,130275.2213969739]
[null,null,null,null,null,0.33332476079329032,1303,0.34,130296.64899409718]
[null,null,null,null,null,0.33312376346851091,1304,0.34,130318.01626888147]
[null,null,null,null,null,0.33292292022371983,1305,0.34,130339.32326758631]
[null,null,null,null,null,0.33272223082286922,1306,0.34,130360.57003640017]
[null,null,null,null,null,0.3325216950304537,1307,0.34,130381.75662144087]
[null,null,null,null,null,0.3323213126115081,1308,0.34,130402.88306875576]
[null,null,null,null,null,0.33212108333160595,1309,0.34,130423.94942432166]
[null,null,null,null,null,0.33192100695685811,1310,0.34,130444.95573404524]
[null,null,null,null,null,0.33172108325391036,1311,0.34,130465.90204376295]
[null,null,null,null,null,0.33152131198994295,1312,0.34,130486.78839924153]
[null,null,null,null,null,0.33132169293266722,1313,0.34,130507.6148461776]
[null,null,null,null,null,0.33112222585032636,1314,0.34,130528.38143019864]
[null,null,null,null,null,0.33092291051169109,1315,0.34,130549.08819686213]
[null,null,null,null,null,0.33072374668606108,1316,0.34,130569.7351916569]
[null,null,null,null,null,0.33052473414326022,1317,0.34,130590.32246000211]
[null,null,null,null,null,0.33032587265363733,1318,0.34,130610.85004724821]
[null,null,null,null,null,0.33012716198806347,1319,0.34,130631.31799867671]
[null,null,null,null,null,0.32992860191793061,1320,0.34,130651.72635950052]
[null,null,null,null,null,0.32973019221515054,1321,0.34,130672.07517486416]
[null,null,null,null,null,0.32953193265215242,1322,0.34,130692.36448984363]
[null,null,null,null,null,0.32933382300188141,1323,0.34,130712.59434944672]
[null,null,null,null,null,0.32913586303779807,1324,0.34,130732.76479861338]
[null,null,null,null,null,0.32893805253387542,1325,0.34,130752.87588221548]
[null,null,null,null,null,0.32874039126459809,1326,0.34,130772.92764505713]
[null,null,null,null,null,0.3285428790049616,1327,0.34,130792.92013187522]
[null,null,null,null,null,0.32834551553046865,1328,0.34,130812.85338733869]
[null,null,null,null,null,0.32814830061712952,1329,0.34,130832.72745604954]
[null,null,null,null,null,0.32795123404146032,1330,0.34,130852.54238254266]
[null,null,null,null,null,0.32775431558048052,1331,0.34,130872.29821128586]
[null,null,null,null,null,0.32755754501171208,1332,0.34,130891.99498668016]
[null,null,null,null,null,0.32736092211317813,1333,0.34,130911.63275305994]
[null,null,null,null,null,0.32716444666340072,1334,0.34,130931.21155469297]
[null,null,null,null,null,0.32696811844140017,1335,0.34,130950.73143578076]
[null,null,null,null,null,0.32677193722669307,1336,0.34,130970.19244045857]
[null,null,null,null,null,0.32657590279929072,1337,0.34,130989.59461279551]
[null,null,null,null,null,0.32638001493969848,1338,0.34,131008.93799679496]
[null,null,null,null,null,0.32618427342891265,1339,0.34,131028.2226363942]
[null,null,null,null,null,0.32598867804842113,1340,0.34,131047.4485754653]
[null,null,null,null,null,0.3257932285802001,1341,0.34,131066.61585781451]
[null,null,null,null,null,0.32559792480671335,1342,0.34,131085.72452718279]
[null,null,null,null,null,0.3254027665109116,1343,0.34,131104.77462724628]
[null,null,null,null,null,0.32520775347622899,1344,0.34,131123.76620161554]
[null,null,null,null,null,{"$f":"-0.262*LN(G1431)+2.2125","v":0.32501288548658369},1345,0.34,{"$f":"$H$84*F1431*1000*G1431","v":131142.69929383651}]
[null,null,null,null,null,0.3248181623263755,1346,0.34,131161.57394739043]
[null,null,null,null,null,0.3246235837804845,1347,0.34,131180.39020569378]
[null,null,null,null,null,0.32442914963426972,1348,0.34,131199.14811209869]
[null,null,null,null,null,0.3242348596735678,1349,0.34,131217.84770989287]
[null,null,null,null,null,0.32404071368469123,1350,0.34,131236.48904229995]
[null,null,null,null,null,0.32384671145442767,1351,0.34,131255.07215247952]
[null,null,null,null,null,0.32365285277003752,1352,0.34,131273.59708352722]
[null,null,null,null,null,0.32345913741925347,1353,0.34,131292.06387847496]
[null,null,null,null,null,0.32326556519027805,1354,0.34,131310.47258029095]
[null,null,null,null,null,0.32307213587178385,1355,0.34,131328.82323188015]
[null,null,null,null,null,0.32287884925291066,1356,0.34,131347.11587608405]
[null,null,null,null,null,0.32268570512326411,1357,0.34,131365.35055568081]
[null,null,null,null,null,0.32249270327291568,1358,0.34,131383.52731338583]
[null,null,null,null,null,0.32229984349240026,1359,0.34,131401.64619185159]
[null,null,null,null,null,0.32210712557271437,1360,0.34,131419.70723366746]
[null,null,null,null,null,0.32191454930531571,1361,0.34,131437.71048136041]
[null,null,null,null,null,0.32172211448212207,1362,0.34,131455.65597739507]
[null,null,null,null,null,0.32152982089550819,1363,0.34,131473.54376417329]
[null,null,null,null,null,0.3213376683383069,1364,0.34,131491.37388403516]
[null,null,null,null,null,0.32114565660380601,1365,0.34,131509.14637925857]
[null,null,null,null,null,0.32095378548574716,1366,0.34,131526.86129205918]
[null,null,null,null,null,0.3207620547783252,1367,0.34,131544.51866459116]
[null,null,null,null,null,0.32057046427618596,1368,0.34,131562.1185389467]
[null,null,null,null,null,0.32037901377442624,1369,0.34,131579.66095715686]
[null,null,null,null,null,0.32018770306859112,1370,0.34,131597.14596119095]
[null,null,null,null,null,0.31999653195467359,1371,0.34,131614.57359295725]
[null,null,null,null,null,0.31980550022911225,1372,0.34,131631.94389430262]
[null,null,null,null,null,0.31961460768879135,1373,0.34,131649.25690701316]
[null,null,null,null,null,0.31942385413103858,1374,0.34,131666.51267281407]
[null,null,null,null,null,0.31923323935362391,1375,0.34,131683.71123336986]
[null,null,null,null,null,0.3190427631547581,1376,0.34,131700.85263028412]
[null,null,null,null,null,0.31885242533309244,1377,0.34,131717.93690510048]
[null,null,null,null,null,0.31866222568771563,1378,0.34,131734.96409930164]
[null,null,null,null,null,0.3184721640181547,1379,0.34,131751.93425431059]
[null,null,null,null,null,0.31828224012437234,1380,0.34,131768.84741149013]
[null,null,null,null,null,0.31809245380676532,1381,0.34,131785.70361214288]
[null,null,null,null,null,0.31790280486616451,1382,0.34,131802.50289751179]
[null,null,null,null,null,0.31771329310383312,1383,0.34,131819.24530878037]
[null,null,null,null,null,0.31752391832146487,1384,0.34,131835.9308870722]
[null,null,null,null,null,0.31733468032118273,1385,0.34,131852.55967345141]
[null,null,null,null,null,0.31714557890553952,1386,0.34,131869.13170892332]
[null,null,null,null,null,0.31695661387751395,1387,0.34,131885.64703443355]
[null,null,null,null,null,0.31676778504051128,1388,0.34,131902.10569086889]
[null,null,null,null,null,0.31657909219836178,1389,0.34,131918.50771905735]
[null,null,null,null,null,0.31639053515531868,1390,0.34,131934.85315976787]
[null,null,null,null,null,0.31620211371605778,1391,0.34,131951.14205371091]
[null,null,null,null,null,0.3160138276856761,1392,0.34,131967.37444153833]
[null,null,null,null,null,0.31582567686969076,1393,0.34,131983.55036384377]
[null,null,null,null,null,0.31563766107403679,1394,0.34,131999.66986116217]
[null,null,null,null,null,0.31544978010506775,1395,0.34,132015.73297397085]
[null,null,null,null,null,0.31526203376955264,1396,0.34,132031.73974268863]
[null,null,null,null,null,0.31507442187467594,1397,0.34,132047.6902076767]
[null,null,null,null,null,0.31488694422803598,1398,0.34,132063.58440923828]
[null,null,null,null,null,0.31469960063764368,1399,0.34,132079.42238761907]
[null,null,null,null,null,0.31451239091192229,1400,0.34,132095.20418300736]
[null,null,null,null,null,0.31432531485970405,1401,0.34,132110.92983553361]
[null,null,null,null,null,0.31413837229023156,1402,0.34,132126.5993852714]
[null,null,null,null,null,0.31395156301315508,1403,0.34,132142.21287223697]
[null,null,null,null,null,0.31376488683853165,1404,0.34,132157.77033638951]
[null,null,null,null,null,0.31357834357682424,1405,0.34,132173.27181763141]
[null,null,null,null,null,0.31339193303889989,1406,0.34,132188.71735580798]
[null,null,null,null,null,0.31320565503602982,1407,0.34,132204.10699070818]
[null,null,null,null,null,0.3130195093798871,1408,0.34,132219.4407620643]
[null,null,null,null,null,{"$f":"-0.262*LN(G1495)+2.2125","v":0.31283349588254561},1409,0.34,{"$f":"$H$84*F1495*1000*G1495","v":132234.71870955202}]
[null,null,null,null,null,0.31264761435647959,1410,0.34,132249.94087279087]
[null,null,null,null,null,0.31246186461456249,1411,0.34,132265.10729134429]
[null,null,null,null,null,0.3122762464700648,1412,0.34,132280.21800471944]
[null,null,null,null,null,0.31209075973665357,1413,0.34,132295.27305236744]
[null,null,null,null,null,0.31190540422839219,1414,0.34,132310.27247368396]
[null,null,null,null,null,0.31172017975973731,1415,0.34,132325.21630800847]
[null,null,null,null,null,0.31153508614553971,1416,0.34,132340.10459462527]
[null,null,null,null,null,0.31135012320104161,1417,0.34,132354.93737276277]
[null,null,null,null,null,0.31116529074187671,1418,0.34,132369.71468159434]
[null,null,null,null,null,0.31098058858406863,1419,0.34,132384.43656023801]
[null,null,null,null,null,0.31079601654402955,1420,0.34,132399.10304775659]
[null,null,null,null,null,0.31061157443855958,1421,0.34,132413.71418315795]
[null,null,null,null,null,0.31042726208484517,1422,0.34,132428.27000539494]
[null,null,null,null,null,0.31024307930045847,1423,0.34,132442.77055336573]
[null,null,null,null,null,0.31005902590335643,1424,0.34,132457.21586591387]
[null,null,null,null,null,0.30987510171187904,1425,0.34,132471.6059818283]
[null,null,null,null,null,0.30969130654474863,1426,0.34,132485.94093984345]
[null,null,null,null,null,0.30950764022106858,1427,0.34,132500.22077863946]
[null,null,null,null,null,0.30932410256032306,1428,0.34,132514.4455368424]
[null,null,null,null,null,0.3091406933823746,1429,0.34,132528.61525302398]
[null,null,null,null,null,0.30895741250746411,1430,0.34,132542.72996570211]
[null,null,null,null,null,0.30877425975620976,1431,0.34,132556.78971334084]
[null,null,null,null,null,0.30859123494960494,1432,0.34,132570.79453435028]
[null,null,null,null,null,0.30840833790901878,1433,0.34,132584.74446708718]
[null,null,null,null,null,0.30822556845619364,1434,0.34,132598.6395498545]
[null,null,null,null,null,0.30804292641324471,1435,0.34,132612.47982090185]
[null,null,null,null,null,0.30786041160265953,1436,0.34,132626.26531842572]
[null,null,null,null,null,0.30767802384729537,1437,0.34,132639.99608056902]
[null,null,null,null,null,0.30749576297037984,1438,0.34,132653.67214542185]
[null,null,null,null,null,0.30731362879550939,1439,0.34,132667.2935510214]
[null,null,null,null,null,0.30713162114664772,1440,0.34,132680.86033535181]
[null,null,null,null,null,0.30694973984812512,1441,0.34,132694.37253634448]
[null,null,null,null,null,0.3067679847246374,1442,0.34,132707.83019187814]
[null,null,null,null,null,0.30658635560124559,1443,0.34,132721.2333397792]
[null,null,null,null,null,0.30640485230337378,1444,0.34,132734.58201782152]
[null,null,null,null,null,0.30622347465680821,1445,0.34,132747.87626372636]
[null,null,null,null,null,0.30604222248769775,1446,0.34,132761.11611516328]
[null,null,null,null,null,0.30586109562255115,1447,0.34,132774.30160974944]
[null,null,null,null,null,0.30568009388823647,1448,0.34,132787.43278504992]
[null,null,null,null,null,0.30549921711198103,1449,0.34,132800.50967857815]
[null,null,null,null,null,0.3053184651213694,1450,0.34,132813.53232779569]
[null,null,null,null,null,0.30513783774434255,1451,0.34,132826.5007701123]
[null,null,null,null,null,0.30495733480919762,1452,0.34,132839.41504288645]
[null,null,null,null,null,0.30477695614458589,1453,0.34,132852.27518342499]
[null,null,null,null,null,0.30459670157951213,1454,0.34,132865.08122898318]
[null,null,null,null,null,0.30441657094333441,1455,0.34,132877.83321676546]
[null,null,null,null,null,0.30423656406576249,1456,0.34,132890.53118392505]
[null,null,null,null,null,0.3040566807768561,1457,0.34,132903.17516756381]
[null,null,null,null,null,0.30387692090702578,1458,0.34,132915.76520473306]
[null,null,null,null,null,0.30369728428703002,1459,0.34,132928.30133243304]
[null,null,null,null,null,0.3035177707479757,1460,0.34,132940.78358761335]
[null,null,null,null,null,0.30333838012131653,1461,0.34,132953.21200717305]
[null,null,null,null,null,0.30315911223885217,1462,0.34,132965.58662796055]
[null,null,null,null,null,0.30297996693272733,1463,0.34,132977.90748677403]
[null,null,null,null,null,0.30280094403543067,1464,0.34,132990.17462036115]
[null,null,null,null,null,0.30262204337979393,1465,0.34,133002.38806541942]
[null,null,null,null,null,0.30244326479899142,1466,0.34,133014.5478585964]
[null,null,null,null,null,0.30226460812653877,1467,0.34,133026.65403648969]
[null,null,null,null,null,0.3020860731962911,1468,0.34,133038.70663564661]
[null,null,null,null,null,0.30190765984244394,1469,0.34,133050.70569256504]
[null,null,null,null,null,0.30172936789953098,1470,0.34,133062.65124369314]
[null,null,null,null,null,0.30155119720242318,1471,0.34,133074.54332542937]
[null,null,null,null,null,0.3013731475863286,1472,0.34,133086.38197412272]
[null,null,null,null,null,{"$f":"-0.262*LN(G1559)+2.2125","v":0.30119521888679057},1473,0.34,{"$f":"$H$84*F1559*1000*G1559","v":133098.16722607275}]
[null,null,null,null,null,0.30101741093968792,1474,0.34,133109.89911753]
[null,null,null,null,null,0.30083972358123279,1475,0.34,133121.57768469548]
[null,null,null,null,null,0.30066215664797036,1476,0.34,133133.20296372127]
[null,null,null,null,null,0.30048470997677823,1477,0.34,133144.77499071043]
[null,null,null,null,null,0.30030738340486529,1478,0.34,133156.29380171729]
[null,null,null,null,null,0.30013017676977016,1479,0.34,133167.759432747]
[null,null,null,null,null,0.29995308990936165,1480,0.34,133179.17191975657]
[null,null,null,null,null,0.29977612266183651,1481,0.34,133190.53129865395]
[null,null,null,null,null,0.29959927486571947,1482,0.34,133201.83760529888]
[null,null,null,null,null,0.29942254635986165,1483,0.34,133213.09087550244]
[null,null,null,null,null,0.29924593698344037,1484,0.34,133224.29114502764]
[null,null,null,null,null,0.29906944657595824,1485,0.34,133235.43844958939]
[null,null,null,null,null,0.29889307497724116,1486,0.34,133246.5328248541]
[null,null,null,null,null,0.29871682202743921,1487,0.34,133257.57430644063]
[null,null,null,null,null,0.29854068756702423,1488,0.34,133268.5629299196]
[null,null,null,null,null,0.29836467143678935,1489,0.34,133279.49873081379]
[null,null,null,null,null,0.29818877347784944,1490,0.34,133290.38174459871]
[null,null,null,null,null,0.29801299353163846,1491,0.34,133301.21200670188]
[null,null,null,null,null,0.29783733143990898,1492,0.34,133311.98955250325]
[null,null,null,null,null,0.29766178704473201,1493,0.34,133322.71441733546]
[null,null,null,null,null,0.29748636018849606,1494,0.34,133333.38663648392]
[null,null,null,null,null,0.29731105071390584,1495,0.34,133344.00624518676]
[null,null,null,null,null,0.29713585846398116,1496,0.34,133354.57327863472]
[null,null,null,null,null,0.29696078328205711,1497,0.34,133365.08777197186]
[null,null,null,null,null,0.29678582501178274,1498,0.34,133375.54976029517]
[null,null,null,null,null,0.29661098349711934,1499,0.34,133385.95927865454]
[null,null,null,null,null,0.29643625858234079,1500,0.34,133396.31636205336]
[null,null,null,null,null,0.29626165011203276,1501,0.3,133406.62104544835]
[null,null,null,null,null,0.29608715793109086,1502,0.3,133416.87336374953]
[null,null,null,null,null,0.29591278188472048,1503,0.3,133427.07335182047]
[null,null,null,null,null,0.29573852181843607,1504,0.3,133437.22104447836]
[null,null,null,null,null,0.29556437757806009,1505,0.3,133447.31647649413]
[null,null,null,null,null,0.29539034900972205,1506,0.3,133457.35968259242]
[null,null,null,null,null,0.29521643595985791,1507,0.3,133467.35069745174]
[null,null,null,null,null,0.2950426382752096,1508,0.3,133477.2895557048]
[null,null,null,null,null,0.29486895580282324,1509,0.3,133487.17629193809]
[null,null,null,null,null,0.29469538839004961,1510,0.3,133497.01094069247]
[null,null,null,null,null,0.2945219358845419,1511,0.3,133506.79353646285]
[null,null,null,null,null,0.29434859813425662,1512,0.3,133516.5241136988]
[null,null,null,null,null,0.29417537498745072,1513,0.3,133526.20270680389]
[null,null,null,null,null,0.29400226629268267,1514,0.3,133535.82935013645]
[null,null,null,null,null,0.29382927189881092,1515,0.3,133545.40407800957]
[null,null,null,null,null,0.2936563916549928,1516,0.3,133554.92692469072]
[null,null,null,null,null,0.29348362541068451,1517,0.3,133564.39792440252]
[null,null,null,null,null,0.29331097301563913,1518,0.3,133573.81711132207]
[null,null,null,null,null,0.29313843431990727,1519,0.3,133583.18451958176]
[null,null,null,null,null,0.29296600917383531,1520,0.3,133592.50018326892]
[null,null,null,null,null,0.29279369742806516,1521,0.3,133601.76413642612]
[null,null,null,null,null,0.29262149893353229,1522,0.3,133610.97641305081]
[null,null,null,null,null,0.29244941354146747,1523,0.3,133620.13704709648]
[null,null,null,null,null,0.29227744110339282,1524,0.3,133629.24607247117]
[null,null,null,null,null,0.29210558147112353,1525,0.3,133638.30352303901]
[null,null,null,null,null,0.29193383449676635,1526,0.3,133647.30943261963]
[null,null,null,null,null,0.29176220003271802,1527,0.3,133656.26383498815]
[null,null,null,null,null,0.29159067793166571,1528,0.3,133665.16676387558]
[null,null,null,null,null,0.29141926804658547,1529,0.3,133674.01825296876]
[null,null,null,null,null,0.29124797023074178,1530,0.3,133682.81833591047]
[null,null,null,null,null,0.29107678433768669,1531,0.3,133691.56704629949]
[null,null,null,null,null,0.29090571022125933,1532,0.3,133700.26441769078]
[null,null,null,null,null,0.29073474773558439,1533,0.3,133708.91048359525]
[null,null,null,null,null,0.29056389673507299,1534,0.3,133717.50527748058]
[null,null,null,null,null,0.29039315707442004,1535,0.3,133726.04883277044]
[null,null,null,null,null,0.29022252860860398,1536,0.3,133734.5411828447]
[null,null,null,null,null,{"$f":"-0.262*LN(G1623)+2.2125","v":0.2900520111928877},1537,0.3,{"$f":"$H$84*F1623*1000*G1623","v":133742.98236104049}]
[null,null,null,null,null,0.28988160468281565,1538,0.3,133751.37240065113]
[null,null,null,null,null,0.28971130893421337,1539,0.3,133759.71133492631]
[null,null,null,null,null,0.28954112380318908,1540,0.3,133767.99919707334]
[null,null,null,null,null,0.28937104914612966,1541,0.3,133776.23602025575]
[null,null,null,null,null,0.28920108481970197,1542,0.3,133784.42183759413]
[null,null,null,null,null,0.28903123068085179,1543,0.3,133792.55668216629]
[null,null,null,null,null,0.28886148658680266,1544,0.3,133800.64058700699]
[null,null,null,null,null,0.28869185239505635,1545,0.3,133808.67358510863]
[null,null,null,null,null,0.28852232796338972,1546,0.3,133816.65570942016]
[null,null,null,null,null,0.28835291314985656,1547,0.3,133824.58699284843]
[null,null,null,null,null,0.28818360781278551,1548,0.3,133832.46746825759]
[null,null,null,null,null,0.28801441181078036,1549,0.3,133840.29716846961]
[null,null,null,null,null,0.28784532500271709,1550,0.3,133848.07612626345]
[null,null,null,null,null,0.2876763472477466,1551,0.3,133855.80437437649]
[null,null,null,null,null,0.28750747840529067,1552,0.3,133863.48194550333]
[null,null,null,null,null,0.28733871833504376,1553,0.3,133871.1088722969]
[null,null,null,null,null,0.28717006689697055,1554,0.3,133878.68518736766]
[null,null,null,null,null,0.28700152395130618,1555,0.3,133886.21092328432]
[null,null,null,null,null,0.28683308935855556,1556,0.3,133893.68611257372]
[null,null,null,null,null,0.28666476297949228,1557,0.3,133901.11078772083]
[null,null,null,null,null,0.28649654467515817,1558,0.3,133908.48498116893]
[null,null,null,null,null,0.28632843430686239,1559,0.3,133915.80872531954]
[null,null,null,null,null,0.286160431736181,1560,0.3,133923.0820525327]
[null,null,null,null,null,0.28599253682495651,1561,0.3,133930.30499512711]
[null,null,null,null,null,0.28582474943529634,1562,0.3,133937.47758537988]
[null,null,null,null,null,0.28565706942957281,1563,0.3,133944.59985552667]
[null,null,null,null,null,0.28548949667042267,1564,0.3,133951.67183776232]
[null,null,null,null,null,0.28532203102074538,1565,0.3,133958.69356423995]
[null,null,null,null,null,0.28515467234370373,1566,0.3,133965.665067072]
[null,null,null,null,null,0.2849874205027223,1567,0.3,133972.58637832975]
[null,null,null,null,null,0.28482027536148724,1568,0.3,133979.45753004361]
[null,null,null,null,null,0.28465323678394538,1569,0.3,133986.27855420308]
[null,null,null,null,null,0.28448630463430313,1570,0.3,133993.04948275676]
[null,null,null,null,null,0.28431947877702712,1571,0.3,133999.77034761288]
[null,null,null,null,null,0.28415275907684201,1572,0.3,134006.44118063868]
[null,null,null,null,null,0.28398614539873113,1573,0.3,134013.06201366123]
[null,null,null,null,null,0.28381963760793449,1574,0.3,134019.63287846665]
[null,null,null,null,null,0.2836532355699497,1575,0.3,134026.15380680125]
[null,null,null,null,null,0.28348693915052969,1576,0.3,134032.62483037042]
[null,null,null,null,null,0.28332074821568365,1577,0.3,134039.04598083993]
[null,null,null,null,null,0.28315466263167521,1578,0.3,134045.41728983505]
[null,null,null,null,null,0.28298868226502161,1579,0.3,134051.73878894074]
[null,null,null,null,null,0.28282280698249451,1580,0.3,134058.01050970241]
[null,null,null,null,null,0.28265703665111808,1581,0.3,134064.2324836253]
[null,null,null,null,null,0.28249137113816891,1582,0.3,134070.40474217496]
[null,null,null,null,null,0.28232581031117454,1583,0.3,134076.52731677677]
[null,null,null,null,null,0.28216035403791451,1584,0.3,134082.60023881699]
[null,null,null,null,null,0.28199500218641815,1585,0.3,134088.62353964185]
[null,null,null,null,null,0.28182975462496396,1586,0.3,134094.59725055785]
[null,null,null,null,null,0.28166461122208064,1587,0.3,134100.52140283259]
[null,null,null,null,null,0.28149957184654473,1588,0.3,134106.3960276939]
[null,null,null,null,null,0.2813346363673801,1589,0.3,134112.22115633008]
[null,null,null,null,null,0.2811698046538591,1590,0.3,134117.9968198908]
[null,null,null,null,null,0.28100507657549967,1591,0.3,134123.72304948597]
[null,null,null,null,null,0.28084045200206575,1592,0.3,134129.3998761866]
[null,null,null,null,null,0.28067593080356712,1593,0.3,134135.02733102473]
[null,null,null,null,null,0.28051151285025777,1594,0.3,134140.60544499327]
[null,null,null,null,null,0.28034719801263619,1595,0.3,134146.13424904642]
[null,null,null,null,null,0.28018298616144421,1596,0.3,134151.61377409947]
[null,null,null,null,null,0.2800188771676666,1597,0.3,134157.04405102908]
[null,null,null,null,null,0.27985487090253014,1598,0.3,134162.42511067295]
[null,null,null,null,null,0.27969096723750386,1599,0.3,134167.75698383062]
[null,null,null,null,null,0.27952716604429728,1600,0.3,134173.03970126266]
[null,null,null,null,null,{"$f":"-0.262*LN(G1687)+2.2125","v":0.2793634671948606},1601,0.3,{"$f":"$H$84*F1687*1000*G1687","v":134178.27329369154}]
[null,null,null,null,null,0.27919987056138407,1602,0.3,134183.45779180116]
[null,null,null,null,null,0.27903637601629705,1603,0.3,134188.59322623722]
[null,null,null,null,null,0.27887298343226719,1604,0.3,134193.67962760697]
[null,null,null,null,null,0.27870969268220147,1605,0.3,134198.71702648001]
[null,null,null,null,null,0.27854650363924249,1606,0.3,134203.70545338703]
[null,null,null,null,null,0.27838341617677154,1607,0.3,134208.64493882156]
[null,null,null,null,null,0.27822043016840481,1608,0.3,134213.53551323846]
[null,null,null,null,null,0.27805754548799544,1609,0.3,134218.3772070554]
[null,null,null,null,null,0.27789476200963037,1610,0.3,134223.17005065148]
[null,null,null,null,null,0.27773207960763258,1611,0.3,134227.9140743688]
[null,null,null,null,null,0.27756949815655751,1612,0.3,134232.60930851119]
[null,null,null,null,null,0.27740701753119512,1613,0.3,134237.25578334532]
[null,null,null,null,null,0.27724463760656759,1614,0.3,134241.85352910004]
[null,null,null,null,null,0.2770823582579296,1615,0.3,134246.40257596687]
[null,null,null,null,null,0.27692017936076718,1616,0.3,134250.9029540999]
[null,null,null,null,null,0.27675810079079799,1617,0.3,134255.3546936161]
[null,null,null,null,null,0.27659612242396947,1618,0.3,134259.75782459477]
[null,null,null,null,null,0.27643424413645934,1619,0.3,134264.1123770783]
[null,null,null,null,null,0.27627246580467535,1620,0.3,134268.4183810722]
[null,null,null,null,null,0.27611078730525263,1621,0.3,134272.67586654436]
[null,null,null,null,null,0.27594920851505589,1622,0.3,134276.88486342618]
[null,null,null,null,null,0.27578772931117701,1623,0.3,134281.04540161206]
[null,null,null,null,null,0.27562634957093457,1624,0.3,134285.15751095934]
[null,null,null,null,null,0.2754650691718743,1625,0.3,134289.22122128872]
[null,null,null,null,null,0.27530388799176797,1626,0.3,134293.23656238441]
[null,null,null,null,null,0.27514280590861184,1627,0.3,134297.20356399342]
[null,null,null,null,null,0.27498182280062866,1628,0.3,134301.12225582704]
[null,null,null,null,null,0.27482093854626388,1629,0.3,134304.99266755916]
[null,null,null,null,null,0.27466015302418811,1630,0.3,134308.81482882798]
[null,null,null,null,null,0.27449946611329423,1631,0.3,134312.58876923483]
[null,null,null,null,null,0.27433887769269805,1632,0.3,134316.31451834497]
[null,null,null,null,null,0.27417838764173807,1633,0.3,134319.99210568747]
[null,null,null,null,null,0.27401799583997333,1634,0.3,134323.62156075492]
[null,null,null,null,null,0.27385770216718508,1635,0.3,134327.20291300429]
[null,null,null,null,null,0.27369750650337443,1636,0.3,134330.73619185618]
[null,null,null,null,null,0.27353740872876253,1637,0.3,134334.22142669529]
[null,null,null,null,null,0.27337740872378991,1638,0.3,134337.65864687035]
[null,null,null,null,null,0.27321750636911646,1639,0.3,134341.04788169457]
[null,null,null,null,null,0.27305770154561992,1640,0.3,134344.38916044499]
[null,null,null,null,null,0.27289799413439586,1641,0.3,134347.68251236307]
[null,null,null,null,null,0.2727383840167581,1642,0.3,134350.92796665503]
[null,null,null,null,null,0.27257887107423562,1643,0.3,134354.12555249073]
[null,null,null,null,null,0.27241945518857502,1644,0.3,134357.27529900518]
[null,null,null,null,null,0.27226013624173806,1645,0.3,134360.37723529772]
[null,null,null,null,null,0.27210091411590187,1646,0.3,134363.43139043232]
[null,null,null,null,null,0.27194178869345809,1647,0.3,134366.43779343765]
[null,null,null,null,null,0.27178275985701239,1648,0.3,134369.39647330693]
[null,null,null,null,null,0.27162382748938496,1649,0.3,134372.30745899872]
[null,null,null,null,null,0.27146499147360781,1650,0.3,134375.17077943587]
[null,null,null,null,null,0.2713062516929261,1651,0.3,134377.9864635063]
[null,null,null,null,null,0.27114760803079796,1652,0.3,134380.75454006347]
[null,null,null,null,null,0.27098906037089154,1653,0.3,134383.47503792509]
[null,null,null,null,null,0.27083060859708707,1654,0.3,134386.14798587462]
[null,null,null,null,null,0.27067225259347505,1655,0.3,134388.77341266035]
[null,null,null,null,null,0.27051399224435602,1656,0.3,134391.35134699606]
[null,null,null,null,null,0.27035582743424036,1657,0.3,134393.88181756088]
[null,null,null,null,null,0.27019775804784674,1658,0.3,134396.36485299899]
[null,null,null,null,null,0.27003978397010342,1659,0.3,134398.80048192045]
[null,null,null,null,null,0.26988190508614562,1660,0.3,134401.18873290051]
[null,null,null,null,null,0.26972412128131662,1661,0.3,134403.52963448007]
[null,null,null,null,null,0.26956643244116663,1662,0.3,134405.82321516567]
[null,null,null,null,null,0.2694088384514528,1663,0.3,134408.06950342981]
[null,null,null,null,null,0.26925133919813748,1664,0.3,134410.26852771023]
[null,null,null,null,null,{"$f":"-0.262*LN(G1751)+2.2125","v":0.26909393456738928},1665,0.3,{"$f":"$H$84*F1751*1000*G1751","v":134412.42031641095}]
[null,null,null,null,null,0.26893662444558153,1666,0.3,134414.52489790166]
[null,null,null,null,null,0.26877940871929185,1667,0.3,134416.58230051785]
[null,null,null,null,null,0.26862228727530235,1668,0.3,134418.59255256128]
[null,null,null,null,null,0.26846526000059923,1669,0.3,134420.55568230001]
[null,null,null,null,null,0.26830832678237004,1670,0.3,134422.47171796739]
[null,null,null,null,null,0.26815148750800688,1671,0.3,134424.34068776385]
[null,null,null,null,null,0.26799474206510232,1672,0.3,134426.16261985531]
[null,null,null,null,null,0.26783809034145212,1673,0.3,134427.93754237483]
[null,null,null,null,null,0.26768153222505164,1674,0.3,134429.66548342095]
[null,null,null,null,null,0.26752506760409811,1675,0.3,134431.34647105931]
[null,null,null,null,null,0.26736869636698835,1676,0.3,134432.98053332174]
[null,null,null,null,null,0.26721241840231902,1677,0.3,134434.56769820669]
[null,null,null,null,null,0.26705623359888619,1678,0.3,134436.1079936793]
[null,null,null,null,null,0.26690014184568422,1679,0.3,134437.60144767113]
[null,null,null,null,null,0.26674414303190597,1680,0.3,134439.0480880806]
[null,null,null,null,null,0.26658823704694257,1681,0.3,134440.44794277314]
[null,null,null,null,null,0.26643242378038168,1682,0.3,134441.80103958058]
[null,null,null,null,null,0.26627670312200857,1683,0.3,134443.10740630209]
[null,null,null,null,null,0.26612107496180459,1684,0.3,134444.36707070368]
[null,null,null,null,null,0.2659655391899467,1685,0.3,134445.58006051806]
[null,null,null,null,null,0.26581009569680791,1686,0.3,134446.74640344546]
[null,null,null,null,null,0.26565474437295622,1687,0.3,134447.86612715313]
[null,null,null,null,null,0.26549948510915322,1688,0.3,134448.93925927521]
[null,null,null,null,null,0.26534431779635637,1689,0.3,134449.96582741375]
[null,null,null,null,null,0.2651892423257145,1690,0.3,134450.94585913722]
[null,null,null,null,null,0.26503425858857188,1691,0.3,134451.87938198249]
[null,null,null,null,null,0.26487936647646371,1692,0.3,134452.76642345297]
[null,null,null,null,null,0.26472456588111837,1693,0.3,134453.60701102004]
[null,null,null,null,null,0.2645698566944561,1694,0.3,134454.40117212257]
[null,null,null,null,null,0.26441523880858764,1695,0.3,134455.14893416682]
[null,null,null,null,null,0.26426071211581559,1696,0.3,134455.85032452695]
[null,null,null,null,null,0.26410627650863239,1697,0.3,134456.50537054474]
[null,null,null,null,null,0.26395193187972121,1698,0.3,134457.11409952998]
[null,null,null,null,null,0.26379767812195354,1699,0.3,134457.6765387597]
[null,null,null,null,null,0.26364351512839135,1700,0.3,134458.19271547958]
[null,null,null,null,null,0.26348944279228403,1701,0.3,134458.66265690254]
[null,null,null,null,null,0.26333546100706995,1702,0.3,134459.08639020991]
[null,null,null,null,null,0.26318156966637551,1703,0.3,134459.46394255126]
[null,null,null,null,null,0.26302776866401345,1704,0.3,134459.79534104367]
[null,null,null,null,null,0.2628740578939841,1705,0.3,134460.08061277284]
[null,null,null,null,null,0.26272043725047411,1706,0.3,134460.31978479263]
[null,null,null,null,null,0.26256690662785642,1707,0.3,134460.51288412526]
[null,null,null,null,null,0.2624134659206887,1708,0.3,134460.65993776088]
[null,null,null,null,null,0.26226011502371516,1709,0.3,134460.76097265873]
[null,null,null,null,null,0.26210685383186294,1710,0.3,134460.81601574572]
[null,null,null,null,null,0.26195368224024507,1711,0.3,134460.82509391778]
[null,null,null,null,null,0.26180060014415774,1712,0.3,134460.78823403941]
[null,null,null,null,null,0.26164760743908055,1713,0.3,134460.7054629435]
[null,null,null,null,null,0.26149470402067587,1714,0.3,134460.57680743153]
[null,null,null,null,null,0.26134188978478945,1715,0.3,134460.40229427419]
[null,null,null,null,null,0.26118916462744801,1716,0.3,134460.18195021024]
[null,null,null,null,null,0.26103652844486125,1717,0.3,134459.91580194802]
[null,null,null,null,null,0.26088398113341937,1718,0.3,134459.60387616436]
[null,null,null,null,null,0.26073152258969334,1719,0.3,134459.24619950485]
[null,null,null,null,null,0.26057915271043508,1720,0.3,134458.84279858449]
[null,null,null,null,null,0.26042687139257659,1721,0.3,134458.39369998727]
[null,null,null,null,null,0.26027467853322883,1722,0.3,134457.89893026603]
[null,null,null,null,null,0.2601225740296822,1723,0.3,134457.35851594273]
[null,null,null,null,null,0.2599705577794067,1724,0.3,134456.77248350915]
[null,null,null,null,null,0.25981862968004932,1725,0.3,134456.1408594255]
[null,null,null,null,null,0.25966678962943601,1726,0.3,134455.46367012197]
[null,null,null,null,null,0.25951503752557015,1727,0.3,134454.74094199788]
[null,null,null,null,null,0.25936337326663161,1728,0.3,134453.97270142182]
[null,null,null,null,null,{"$f":"-0.262*LN(G1815)+2.2125","v":0.25921179675097772},1729,0.3,{"$f":"$H$84*F1815*1000*G1815","v":134453.15897473213}]
[null,null,null,null,null,0.25906030787714185,1730,0.3,134452.29978823662]
[null,null,null,null,null,0.25890890654383303,1731,0.3,134451.3951682125]
[null,null,null,null,null,0.25875759264993614,1732,0.3,134450.44514090681]
[null,null,null,null,null,0.25860636609451104,1733,0.3,134449.44973253628]
[null,null,null,null,null,0.25845522677679234,1734,0.3,134448.40896928735]
[null,null,null,null,null,0.25830417459618826,1735,0.3,134447.32287731598]
[null,null,null,null,null,0.25815320945228226,1736,0.3,134446.1914827486]
[null,null,null,null,null,0.2580023312448303,1737,0.3,134445.01481168106]
[null,null,null,null,null,0.2578515398737613,1738,0.3,134443.79289017915]
[null,null,null,null,null,0.25770083523917764,1739,0.3,134442.525744279]
[null,null,null,null,null,0.25755021724135307,1740,0.3,134441.2133999863]
[null,null,null,null,null,0.25739968578073436,1741,0.3,134439.85588327755]
[null,null,null,null,null,0.25724924075793831,1742,0.3,134438.45322009857]
[null,null,null,null,null,0.25709888207375431,1743,0.3,134437.00543636613]
[null,null,null,null,null,0.25694860962914157,1744,0.3,134435.51255796684]
[null,null,null,null,null,0.25679842332522962,1745,0.3,134433.97461075769]
[null,null,null,null,null,0.25664832306331853,1746,0.3,134432.39162056622]
[null,null,null,null,null,0.25649830874487711,1747,0.3,134430.76361319012]
[null,null,null,null,null,0.25634838027154383,1748,0.3,134429.09061439757]
[null,null,null,null,null,0.25619853754512611,1749,0.3,134427.37264992768]
[null,null,null,null,null,0.25604878046759927,1750,0.3,134425.60974548961]
[null,null,null,null,null,0.25589910894110668,1751,0.3,134423.80192676335]
[null,null,null,null,null,0.2557495228679596,1752,0.3,134421.94921939957]
[null,null,null,null,null,0.25560002215063649,1753,0.3,134420.05164901973]
[null,null,null,null,null,0.2554506066917821,1754,0.3,134418.10924121572]
[null,null,null,null,null,0.25530127639420885,1755,0.3,134416.12202155098]
[null,null,null,null,null,0.25515203116089347,1756,0.3,134414.0900155587]
[null,null,null,null,null,0.25500287089498053,1757,0.3,134412.01324874425]
[null,null,null,null,null,0.25485379549977782,1758,0.3,134409.89174658284]
[null,null,null,null,null,0.25470480487875968,1759,0.3,134407.72553452148]
[null,null,null,null,null,0.25455589893556407,1760,0.3,134405.51463797782]
[null,null,null,null,null,0.25440707757399394,1761,0.3,134403.25908234101]
[null,null,null,null,null,0.25425834069801523,1762,0.3,134400.95889297084]
[null,null,null,null,null,0.25410968821175794,1763,0.3,134398.61409519878]
[null,null,null,null,null,0.25396112001951487,1764,0.3,134396.22471432728]
[null,null,null,null,null,0.25381263602574178,1765,0.3,134393.79077563024]
[null,null,null,null,null,0.25366423613505673,1766,0.3,134391.31230435302]
[null,null,null,null,null,0.25351592025223924,1767,0.3,134388.78932571202]
[null,null,null,null,null,0.25336768828223155,1768,0.3,134386.2218648956]
[null,null,null,null,null,0.25321954013013626,1769,0.3,134383.60994706329]
[null,null,null,null,null,0.25307147570121669,1770,0.3,134380.95359734609]
[null,null,null,null,null,0.25292349490089738,1771,0.3,134378.25284084678]
[null,null,null,null,null,0.25277559763476298,1772,0.3,134375.50770264]
[null,null,null,null,null,0.25262778380855733,1773,0.3,134372.71820777163]
[null,null,null,null,null,0.25248005332818435,1774,0.3,134369.8843812597]
[null,null,null,null,null,0.25233240609970653,1775,0.3,134367.0062480937]
[null,null,null,null,null,0.25218484202934555,1776,0.3,134364.08383323529]
[null,null,null,null,null,0.25203736102348118,1777,0.3,134361.11716161782]
[null,null,null,null,null,0.25188996298865107,1778,0.3,134358.10625814646]
[null,null,null,null,null,0.25174264783155098,1779,0.3,134355.05114769877]
[null,null,null,null,null,0.25159541545903363,1780,0.3,134351.95185512395]
[null,null,null,null,null,0.25144826577810853,1781,0.3,134348.80840524338]
[null,null,null,null,null,0.25130119869594214,1782,0.3,134345.62082285067]
[null,null,null,null,null,0.25115421411985706,1783,0.3,134342.38913271151]
[null,null,null,null,null,0.2510073119573315,1784,0.3,134339.11335956381]
[null,null,null,null,null,0.25086049211600026,1785,0.3,134335.79352811811]
[null,null,null,null,null,0.25071375450365152,1786,0.3,134332.42966305645]
[null,null,null,null,null,0.25056709902822982,1787,0.3,134329.02178903398]
[null,null,null,null,null,0.25042052559783357,1788,0.3,134325.56993067791]
[null,null,null,null,null,0.25027403412071547,1789,0.3,134322.07411258799]
[null,null,null,null,null,0.25012762450528192,1790,0.3,134318.53435933639]
[null,null,null,null,null,0.24998129666009339,1791,0.3,134314.95069546817]
[null,null,null,null,null,0.24983505049386245,1792,0.3,134311.32314550044]
[null,null,null,null,null,{"$f":"-0.262*LN(G1879)+2.2125","v":0.24968888591545491},1793,0.3,{"$f":"$H$84*F1879*1000*G1879","v":134307.65173392318}]
[null,null,null,null,null,0.24954280283388952,1794,0.3,134303.93648519932]
[null,null,null,null,null,0.24939680115833651,1795,0.3,134300.17742376419]
[null,null,null,null,null,0.24925088079811775,1796,0.3,134296.37457402586]
[null,null,null,null,null,0.24910504166270742,1797,0.3,134292.52796036555]
[null,null,null,null,null,0.24895928366172981,1798,0.3,134288.63760713703]
[null,null,null,null,null,0.24881360670496,1799,0.3,134284.70353866692]
[null,null,null,null,null,0.24866801070232469,1800,0.3,134280.7257792553]
[null,null,null,null,null,0.24852249556389938,1801,0.3,134276.70435317483]
[null,null,null,null,null,0.24837706119990965,1802,0.3,134272.63928467114]
[null,null,null,null,null,0.24823170752073054,1803,0.3,134268.53059796314]
[null,null,null,null,null,0.24808643443688694,1804,0.3,134264.37831724322]
[null,null,null,null,null,0.24794124185905075,1805,0.3,134260.18246667599]
[null,null,null,null,null,0.24779612969804399,1806,0.3,134255.94307040022]
[null,null,null,null,null,0.24765109786483586,1807,0.3,134251.6601525275]
[null,null,null,null,null,0.2475061462705439,1808,0.3,134247.333737143]
[null,null,null,null,null,0.24736127482643266,1809,0.3,134242.96384830499]
[null,null,null,null,null,0.24721648344391367,1810,0.3,134238.55051004511]
[null,null,null,null,null,0.24707177203454567,1811,0.3,134234.09374636863]
[null,null,null,null,null,0.24692714051003373,1812,0.3,134229.59358125433]
[null,null,null,null,null,0.24678258878222903,1813,0.3,134225.05003865436]
[null,null,null,null,null,0.24663811676312841,1814,0.3,134220.4631424945]
[null,null,null,null,null,0.2464937243648746,1815,0.3,134215.8329166742]
[null,null,null,null,null,0.24634941149975531,1816,0.3,134211.15938506671]
[null,null,null,null,null,0.24620517808020304,1817,0.3,134206.44257151865]
[null,null,null,null,null,0.24606102401879459,1818,0.3,134201.68249985058]
[null,null,null,null,null,0.2459169492282518,1819,0.3,134196.87919385699]
[null,null,null,null,null,0.24577295362143947,1820,0.3,134192.03267730595]
[null,null,null,null,null,0.24562903711136652,1821,0.3,134187.14297393951]
[null,null,null,null,null,0.24548519961118509,1822,0.3,134182.21010747377]
[null,null,null,null,null,0.24534144103419009,1823,0.3,134177.23410159856]
[null,null,null,null,null,0.24519776129381943,1824,0.3,134172.21497997799]
[null,null,null,null,null,0.24505416030365268,1825,0.3,134167.15276624984]
[null,null,null,null,null,0.24491063797741242,1826,0.3,134162.04748402652]
[null,null,null,null,null,0.2447671942289622,1827,0.3,134156.89915689419]
[null,null,null,null,null,0.24462382897230683,1828,0.3,134151.70780841308]
[null,null,null,null,null,0.24448054212159298,1829,0.3,134146.47346211807]
[null,null,null,null,null,0.24433733359110765,1830,0.3,134141.1961415181]
[null,null,null,null,null,0.24419420329527819,1831,0.3,134135.87587009632]
[null,null,null,null,null,0.24405115114867204,1832,0.3,134130.51267131016]
[null,null,null,null,null,0.24390817706599721,1833,0.3,134125.10656859184]
[null,null,null,null,null,0.24376528096210048,1834,0.3,134119.65758534768]
[null,null,null,null,null,0.24362246275196831,1835,0.3,134114.16574495853]
[null,null,null,null,null,0.24347972235072568,1836,0.3,134108.63107077969]
[null,null,null,null,null,0.24333705967363706,1837,0.3,134103.05358614138]
[null,null,null,null,null,0.24319447463610411,1838,0.3,134097.43331434779]
[null,null,null,null,null,0.24305196715366773,1839,0.3,134091.77027867848]
[null,null,null,null,null,0.2429095371420058,1840,0.3,134086.06450238719]
[null,null,null,null,null,0.24276718451693324,1841,0.3,134080.31600870221]
[null,null,null,null,null,0.24262490919440372,1842,0.3,134074.52482082747]
[null,null,null,null,null,0.24248271109050612,1843,0.3,134068.69096194085]
[null,null,null,null,null,0.24234059012146658,1844,0.3,134062.8144551953]
[null,null,null,null,null,0.24219854620364734,1845,0.3,134056.89532371881]
[null,null,null,null,null,0.24205657925354696,1846,0.3,134050.9335906143]
[null,null,null,null,null,0.24191468918779901,1847,0.3,134044.92927895946]
[null,null,null,null,null,0.24177287592317298,1848,0.3,134038.88241180711]
[null,null,null,null,null,0.2416311393765731,1849,0.3,134032.79301218511]
[null,null,null,null,null,0.24148947946503885,1850,0.3,134026.66110309656]
[null,null,null,null,null,0.24134789610574359,1851,0.3,134020.48670751942]
[null,null,null,null,null,0.24120638921599502,1852,0.3,134014.26984840681]
[null,null,null,null,null,0.24106495871323563,1853,0.3,134008.01054868766]
[null,null,null,null,null,0.24092360451504002,1854,0.3,134001.70883126525]
[null,null,null,null,null,0.24078232653911757,1855,0.3,133995.36471901895]
[null,null,null,null,null,0.24064112470330956,1856,0.3,133988.97823480275]
[null,null,null,null,null,{"$f":"-0.262*LN(G1943)+2.2125","v":0.24049999892559071},1857,0.3,{"$f":"$H$84*F1943*1000*G1943","v":133982.54940144659}]
[null,null,null,null,null,0.24035894912406852,1858,0.3,133976.07824175578]
[null,null,null,null,null,0.24021797521698152,1859,0.3,133969.5647785106]
[null,null,null,null,null,0.24007707712270121,1860,0.3,133963.00903446728]
[null,null,null,null,null,0.23993625475973013,1861,0.3,133956.41103235731]
[null,null,null,null,null,0.23979550804670247,1862,0.3,133949.770794888]
[null,null,null,null,null,0.23965483690238365,1863,0.3,133943.08834474219]
[null,null,null,null,null,0.23951424124566922,1864,0.3,133936.36370457822]
[null,null,null,null,null,0.23937372099558596,1865,0.3,133929.59689703034]
[null,null,null,null,null,0.23923327607129008,1866,0.3,133922.78794470817]
[null,null,null,null,null,0.23909290639206859,1867,0.3,133915.93687019762]
[null,null,null,null,null,0.2389526118773373,1868,0.3,133909.04369605982]
[null,null,null,null,null,0.23881239244664232,1869,0.3,133902.10844483235]
[null,null,null,null,null,0.23867224801965814,1870,0.3,133895.13113902821]
[null,null,null,null,null,0.23853217851618846,1871,0.3,133888.11180113658]
[null,null,null,null,null,0.23839218385616512,1872,0.3,133881.05045362233]
[null,null,null,null,null,0.23825226395964871,1873,0.3,133873.94711892662]
[null,null,null,null,null,0.23811241874682754,1874,0.3,133866.80181946646]
[null,null,null,null,null,0.23797264813801799,1875,0.3,133859.6145776351]
[null,null,null,null,null,0.23783295205366328,1876,0.3,133852.38541580166]
[null,null,null,null,null,0.23769333041433449,1877,0.3,133845.11435631174]
[null,null,null,null,null,0.23755378314072928,1878,0.3,133837.80142148689]
[null,null,null,null,null,0.23741431015367209,1879,0.3,133830.44663362496]
[null,null,null,null,null,0.23727491137411305,1880,0.3,133823.05001499975]
[null,null,null,null,null,0.23713558672312995,1881,0.3,133815.61158786222]
[null,null,null,null,null,0.23699633612192472,1882,0.3,133808.1313744387]
[null,null,null,null,null,0.23685715949182584,1883,0.3,133800.60939693241]
[null,null,null,null,null,0.23671805675428703,1884,0.3,133793.04567752304]
[null,null,null,null,null,0.23657902783088658,1885,0.3,133785.44023836637]
[null,null,null,null,null,0.23644007264332823,1886,0.3,133777.7931015951]
[null,null,null,null,null,0.23630119111343961,1887,0.3,133770.10428931817]
[null,null,null,null,null,0.23616238316317295,1888,0.3,133762.37382362114]
[null,null,null,null,null,0.23602364871460435,1889,0.3,133754.60172656627]
[null,null,null,null,null,0.23588498768993338,1890,0.3,133746.78802019221]
[null,null,null,null,null,0.23574640001148395,1891,0.3,133738.93272651485]
[null,null,null,null,null,0.23560788560170209,1892,0.3,133731.03586752611]
[null,null,null,null,null,0.23546944438315731,1893,0.3,133723.09746519502]
[null,null,null,null,null,0.23533107627854166,1894,0.3,133715.11754146736]
[null,null,null,null,null,0.23519278121066978,1895,0.3,133707.09611826576]
[null,null,null,null,null,0.23505455910247863,1896,0.3,133699.03321748984]
[null,null,null,null,null,0.234916409877026,1897,0.3,133690.92886101551]
[null,null,null,null,null,0.23477833345749288,1898,0.3,133682.78307069646]
[null,null,null,null,null,0.23464032976718086,1899,0.3,133674.59586836296]
[null,null,null,null,null,0.23450239872951251,1900,0.3,133666.36727582215]
[null,null,null,null,null,0.23436454026803144,1901,0.3,133658.09731485831]
[null,null,null,null,null,0.23422675430640183,1902,0.3,133649.78600723285]
[null,null,null,null,null,0.23408904076840886,1903,0.3,133641.4333746846]
[null,null,null,null,null,0.23395139957795652,1904,0.3,133633.03943892877]
[null,null,null,null,null,0.2338138306590698,1905,0.3,133624.60422165837]
[null,null,null,null,null,0.23367633393589338,1906,0.3,133616.1277445438]
[null,null,null,null,null,0.23353890933269006,1907,0.3,133607.61002923196]
[null,null,null,null,null,0.23340155677384322,1908,0.3,133599.05109734787]
[null,null,null,null,null,0.23326427618385392,1909,0.3,133590.45097049314]
[null,null,null,null,null,0.23312706748734269,1910,0.3,133581.80967024734]
[null,null,null,null,null,0.23298993060904816,1911,0.3,133573.12721816727]
[null,null,null,null,null,0.23285286547382711,1912,0.3,133564.40363578722]
[null,null,null,null,null,0.23271587200665356,1913,0.3,133555.63894461849]
[null,null,null,null,null,0.23257895013262009,1914,0.3,133546.83316615043]
[null,null,null,null,null,0.23244209977693631,1915,0.3,133537.98632184992]
[null,null,null,null,null,0.23230532086492883,1916,0.3,133529.09843316107]
[null,null,null,null,null,0.23216861332204086,1917,0.3,133520.16952150568]
[null,null,null,null,null,0.23203197707383327,1918,0.3,133511.19960828367]
[null,null,null,null,null,0.23189541204598241,1919,0.3,133502.18871487206]
[null,null,null,null,null,0.23175891816428096,1920,0.3,133493.13686262583]
[null,null,null,null,null,{"$f":"-0.262*LN(G2007)+2.2125","v":0.23162249535463797},1921,0.3,{"$f":"$H$84*F2007*1000*G2007","v":133484.04407287785}]
[null,null,null,null,null,0.2314861435430775,1922,0.3,133474.91036693848]
[null,null,null,null,null,0.23134986265573954,1923,0.3,133465.73576609613]
[null,null,null,null,null,0.23121365261887905,1924,0.3,133456.52029161699]
[null,null,null,null,null,0.23107751335886606,1925,0.3,133447.26396474513]
[null,null,null,null,null,0.23094144480218515,1926,0.3,133437.96680670258]
[null,null,null,null,null,0.23080544687543592,1927,0.3,133428.62883868947]
[null,null,null,null,null,0.23066951950533121,1928,0.3,133419.2500818836]
[null,null,null,null,null,0.2305336626186989,1929,0.3,133409.83055744105]
[null,null,null,null,null,0.23039787614247986,1930,0.3,133400.37028649586]
[null,null,null,null,null,0.23026216000372912,1931,0.3,133390.86929016028]
[null,null,null,null,null,0.23012651412961449,1932,0.3,133381.32758952453]
[null,null,null,null,null,0.22999093844741703,1933,0.3,133371.74520565712]
[null,null,null,null,null,0.22985543288453103,1934,0.3,133362.12215960489]
[null,null,null,null,null,0.22971999736846271,1935,0.3,133352.45847239261]
[null,null,null,null,null,0.22958463182683109,1936,0.3,133342.75416502351]
[null,null,null,null,null,0.22944933618736707,1937,0.3,133333.009258479]
[null,null,null,null,null,0.22931411037791327,1938,0.3,133323.22377371875]
[null,null,null,null,null,0.2291789543264251,1939,0.3,133313.39773168147]
[null,null,null,null,null,0.22904386796096787,1940,0.3,133303.53115328329]
[null,null,null,null,null,0.22890885120971927,1941,0.3,133293.62405941953]
[null,null,null,null,null,0.22877390400096687,1942,0.3,133283.67647096328]
[null,null,null,null,null,0.22863902626311039,1943,0.3,133273.68840876702]
[null,null,null,null,null,0.22850421792465903,1944,0.3,133263.65989366116]
[null,null,null,null,null,0.22836947891423276,1945,0.3,133253.59094645482]
[null,null,null,null,null,0.22823480916056083,1946,0.3,133243.48158793538]
[null,null,null,null,null,0.22810020859248348,1947,0.3,133233.33183886961]
[null,null,null,null,null,0.22796567713895,1948,0.3,133223.14172000237]
[null,null,null,null,null,0.2278312147290189,1949,0.3,133212.91125205733]
[null,null,null,null,null,0.2276968212918582,1950,0.3,133202.64045573704]
[null,null,null,null,null,0.22756249675674467,1951,0.3,133192.32935172267]
[null,null,null,null,null,0.22742824105306392,1952,0.3,133181.97796067424]
[null,null,null,null,null,0.2272940541103099,1953,0.3,133171.58630323058]
[null,null,null,null,null,0.22715993585808514,1954,0.3,133161.15440000949]
[null,null,null,null,null,0.22702588622609965,1955,0.3,133150.68227160745]
[null,null,null,null,null,0.22689190514417223,1956,0.3,133140.16993860027]
[null,null,null,null,null,0.22675799254222784,1957,0.3,133129.61742154195]
[null,null,null,null,null,0.22662414835030043,1958,0.3,133119.02474096644]
[null,null,null,null,null,0.2264903724985301,1959,0.3,133108.39191738612]
[null,null,null,null,null,0.22635666491716444,1960,0.3,133097.71897129269]
[null,null,null,null,null,0.22622302553655715,1961,0.3,133087.00592315657]
[null,null,null,null,null,0.2260894542871692,1962,0.3,133076.25279342776]
[null,null,null,null,null,0.22595595109956701,1963,0.3,133065.459602535]
[null,null,null,null,null,0.22582251590442404,1964,0.3,133054.62637088663]
[null,null,null,null,null,0.22568914863251899,1965,0.3,133043.75311886994]
[null,null,null,null,null,0.22555584921473648,1966,0.3,133032.83986685157]
[null,null,null,null,null,0.22542261758206639,1967,0.3,133021.88663517739]
[null,null,null,null,null,0.22528945366560382,1968,0.3,133010.89344417251]
[null,null,null,null,null,0.22515635739654893,1969,0.3,132999.86031414144]
[null,null,null,null,null,0.22502332870620689,1970,0.3,132988.78726536824]
[null,null,null,null,null,0.22489036752598723,1971,0.3,132977.67431811625]
[null,null,null,null,null,0.22475747378740363,1972,0.3,132966.52149262797]
[null,null,null,null,null,0.22462464742207455,1973,0.3,132955.32880912593]
[null,null,null,null,null,0.22449188836172196,1974,0.3,132944.09628781176]
[null,null,null,null,null,0.22435919653817149,1975,0.3,132932.8239488666]
[null,null,null,null,null,0.22422657188335293,1976,0.3,132921.51181245159]
[null,null,null,null,null,0.22409401432929821,1977,0.3,132910.15989870677]
[null,null,null,null,null,0.2239615238081436,1978,0.3,132898.76822775241]
[null,null,null,null,null,0.22382910025212777,1979,0.3,132887.33681968824]
[null,null,null,null,null,0.22369674359359148,1980,0.3,132875.86569459335]
[null,null,null,null,null,0.22356445376497946,1981,0.3,132864.3548725273]
[null,null,null,null,null,0.22343223069883722,1982,0.3,132852.8043735286]
[null,null,null,null,null,0.22330007432781329,1983,0.3,132841.21421761613]
[null,null,null,null,null,0.22316798458465748,1984,0.3,132829.5844247881]
[null,null,null,null,null,{"$f":"-0.262*LN(G2071)+2.2125","v":0.22303596140222171},1985,0.3,{"$f":"$H$84*F2071*1000*G2071","v":132817.91501502306}]
[null,null,null,null,null,0.22290400471345895,1986,0.3,132806.20600827885]
[null,null,null,null,null,0.22277211445142364,1987,0.3,132794.45742449362]
[null,null,null,null,null,0.2226402905492717,1988,0.3,132782.66928358562]
[null,null,null,null,null,0.22250853294025896,1989,0.3,132770.84160545253]
[null,null,null,null,null,0.22237684155774273,1990,0.3,132758.9744099724]
[null,null,null,null,null,0.22224521633518046,1991,0.3,132747.06771700329]
[null,null,null,null,null,0.22211365720612952,1992,0.3,132735.12154638299]
[null,null,null,null,null,0.22198216410424765,1993,0.3,132723.1359179297]
[null,null,null,null,null,0.22185073696329249,1994,0.3,132711.11085144157]
[null,null,null,null,null,0.22171937571712119,1995,0.3,132699.04636669703]
[null,null,null,null,null,0.22158808029969057,1996,0.3,132686.94248345471]
[null,null,null,null,null,0.22145685064505627,1997,0.3,132674.79922145323]
[null,null,null,null,null,0.22132568668737318,1998,0.3,132662.61660041148]
[null,null,null,null,null,0.22119458836089501,1999,0.3,132650.39464002871]
[null,null,null,null,null,0.22106355559997426,2000,0.3,132638.13335998455]

{"sheet":"Tevékenységi lista","index":4,"n_rows":298,"n_cols":10,"rows_kept":298,"cut":false,"hidden":true,"merged":[]}
["Biztosított tevékenység:","kockázati osztály","munkáltatói felelősség díj /fő"]
["ABC, élelmiszer jellegű vegyeskereskedés",2,1200,null,null,null,{"$f":"IF(--ISNUMBER(SEARCH(tev.lista,A2)),MAX($G$1:G1)+1,\"\")","v":1},{"$f":"IFERROR(INDEX($A$2:$A$298,MATCH(ROWS($G$2:G2),$G$2:$G$298,0)),\"\")","v":"ABC, élelmiszer jellegű vegyeskereskedés"},null,{"$f":"$H$2:INDEX($H$2:$H$298,COUNTIF($H$2:$H$298,\"?*\"))","v":"ABC, élelmiszer jellegű vegyeskereskedés"}]
["Acélkereskedelem",2,1200,null,null,null,{"$f":"IF(--ISNUMBER(SEARCH(tev.lista,A3)),MAX($G$1:G2)+1,\"\")","v":2},{"$f":"IFERROR(INDEX($A$2:$A$298,MATCH(ROWS($G$2:G3),$G$2:$G$298,0)),\"\")","v":"Acélkereskedelem"}]
["Acélszerkezetépítés",5,4200,null,null,null,{"$f":"IF(--ISNUMBER(SEARCH(tev.lista,A4)),MAX($G$1:G3)+1,\"\")","v":3},{"$f":"IFERROR(INDEX($A$2:$A$298,MATCH(ROWS($G$2:G4),$G$2:$G$298,0)),\"\")","v":"Acélszerkezetépítés"}]
["Ács, állványozó",5,4200,null,null,null,{"$f":"IF(--ISNUMBER(SEARCH(tev.lista,A5)),MAX($G$1:G4)+1,\"\")","v":4},{"$f":"IFERROR(INDEX($A$2:$A$298,MATCH(ROWS($G$2:G5),$G$2:$G$298,0)),\"\")","v":"Ács, állványozó"}]
["Ajándék, bizsu kereskedés",2,1200,null,null,null,{"$f":"IF(--ISNUMBER(SEARCH(tev.lista,A6)),MAX($G$1:G5)+1,\"\")","v":5},{"$f":"IFERROR(INDEX($A$2:$A$298,MATCH(ROWS($G$2:G6),$G$2:$G$298,0)),\"\")","v":"Ajándék, bizsu kereskedés"}]
["Akkumulátor kereskedelem",4,1200,null,null,null,{"$f":"IF(--ISNUMBER(SEARCH(tev.lista,A7)),MAX($G$1:G6)+1,\"\")","v":6},{"$f":"IFERROR(INDEX($A$2:$A$298,MATCH(ROWS($G$2:G7),$G$2:$G$298,0)),\"\")","v":"Akkumulátor kereskedelem"}]
["Akkumulátor, szárazelemgyártás",3,2400,null,null,null,{"$f":"IF(--ISNUMBER(SEARCH(tev.lista,A8)),MAX($G$1:G7)+1,\"\")","v":7},{"$f":"IFERROR(INDEX($A$2:$A$298,MATCH(ROWS($G$2:G8),$G$2:$G$298,0)),\"\")","v":"Akkumulátor, szárazelemgyártás"}]
["Állateledel kereskedés",2,1200,null,null,null,{"$f":"IF(--ISNUMBER(SEARCH(tev.lista,A9)),MAX($G$1:G8)+1,\"\")","v":8},{"$f":"IFERROR(INDEX($A$2:$A$298,MATCH(ROWS($G$2:G9),$G$2:$G$298,0)),\"\")","v":"Állateledel kereskedés"}]
["Általános rendeltetésű gépek és berendezések gyártása",3,2400,null,null,null,{"$f":"IF(--ISNUMBER(SEARCH(tev.lista,A10)),MAX($G$1:G9)+1,\"\")","v":9},{"$f":"IFERROR(INDEX($A$2:$A$298,MATCH(ROWS($G$2:G10),$G$2:$G$298,0)),\"\")","v":"Általános rendeltetésű gépek és berendezések gyártása"}]
["Antikvárium",2,1200,null,null,null,{"$f":"IF(--ISNUMBER(SEARCH(tev.lista,A11)),MAX($G$1:G10)+1,\"\")","v":10},{"$f":"IFERROR(INDEX($A$2:$A$298,MATCH(ROWS($G$2:G11),$G$2:$G$298,0)),\"\")","v":"Antikvárium"}]
["Árnyékolástechnikai berendezések kereskedelme és telepítése",5,4200,null,null,null,{"$f":"IF(--ISNUMBER(SEARCH(tev.lista,A12)),MAX($G$1:G11)+1,\"\")","v":11},{"$f":"IFERROR(INDEX($A$2:$A$298,MATCH(ROWS($G$2:G12),$G$2:$G$298,0)),\"\")","v":"Árnyékolástechnikai berendezések kereskedelme és telepítése"}]
["Asztalosműhely",4,2400,null,null,null,{"$f":"IF(--ISNUMBER(SEARCH(tev.lista,A13)),MAX($G$1:G12)+1,\"\")","v":12},{"$f":"IFERROR(INDEX($A$2:$A$298,MATCH(ROWS($G$2:G13),$G$2:$G$298,0)),\"\")","v":"Asztalosműhely"}]
["Automatika és robotok gyártása",3,2400,null,null,null,{"$f":"IF(--ISNUMBER(SEARCH(tev.lista,A14)),MAX($G$1:G13)+1,\"\")","v":13},{"$f":"IFERROR(INDEX($A$2:$A$298,MATCH(ROWS($G$2:G14),$G$2:$G$298,0)),\"\")","v":"Automatika és robotok gyártása"}]
["Automatika és robotok kereskedelme",2,1200,null,null,null,{"$f":"IF(--ISNUMBER(SEARCH(tev.lista,A15)),MAX($G$1:G14)+1,\"\")","v":14},{"$f":"IFERROR(INDEX($A$2:$A$298,MATCH(ROWS($G$2:G15),$G$2:$G$298,0)),\"\")","v":"Automatika és robotok kereskedelme"}]
["Bababolt",2,1200,null,null,null,{"$f":"IF(--ISNUMBER(SEARCH(tev.lista,A16)),MAX($G$1:G15)+1,\"\")","v":15},{"$f":"IFERROR(INDEX($A$2:$A$298,MATCH(ROWS($G$2:G16),$G$2:$G$298,0)),\"\")","v":"Bababolt"}]
["Bádogos",5,4200,null,null,null,{"$f":"IF(--ISNUMBER(SEARCH(tev.lista,A17)),MAX($G$1:G16)+1,\"\")","v":16},{"$f":"IFERROR(INDEX($A$2:$A$298,MATCH(ROWS($G$2:G17),$G$2:$G$298,0)),\"\")","v":"Bádogos"}]
["Barkács-műszaki áru kereskedelem (faáruk nélkül)",2,1200,null,null,null,{"$f":"IF(--ISNUMBER(SEARCH(tev.lista,A18)),MAX($G$1:G17)+1,\"\")","v":17},{"$f":"IFERROR(INDEX($A$2:$A$298,MATCH(ROWS($G$2:G18),$G$2:$G$298,0)),\"\")","v":"Barkács-műszaki áru kereskedelem (faáruk nélkül)"}]
["Barkácsgépek gyártása",3,2400,null,null,null,{"$f":"IF(--ISNUMBER(SEARCH(tev.lista,A19)),MAX($G$1:G18)+1,\"\")","v":18},{"$f":"IFERROR(INDEX($A$2:$A$298,MATCH(ROWS($G$2:G19),$G$2:$G$298,0)),\"\")","v":"Barkácsgépek gyártása"}]
["Baromfi-feldolgozás",3,2400,null,null,null,{"$f":"IF(--ISNUMBER(SEARCH(tev.lista,A20)),MAX($G$1:G19)+1,\"\")","v":19},{"$f":"IFERROR(INDEX($A$2:$A$298,MATCH(ROWS($G$2:G20),$G$2:$G$298,0)),\"\")","v":"Baromfi-feldolgozás"}]
["Biztonságtechnikai berendezések gyártása",3,2400,null,null,null,{"$f":"IF(--ISNUMBER(SEARCH(tev.lista,A21)),MAX($G$1:G20)+1,\"\")","v":20},{"$f":"IFERROR(INDEX($A$2:$A$298,MATCH(ROWS($G$2:G21),$G$2:$G$298,0)),\"\")","v":"Biztonságtechnikai berendezések gyártása"}]
["Biztonságtechnikai berendezések kereskedelme",2,1200,null,null,null,{"$f":"IF(--ISNUMBER(SEARCH(tev.lista,A22)),MAX($G$1:G21)+1,\"\")","v":21},{"$f":"IFERROR(INDEX($A$2:$A$298,MATCH(ROWS($G$2:G22),$G$2:$G$298,0)),\"\")","v":"Biztonságtechnikai berendezések kereskedelme"}]
["Borfeldolgozás, pezsgőgyártás, palackozás",3,2400,null,null,null,{"$f":"IF(--ISNUMBER(SEARCH(tev.lista,A23)),MAX($G$1:G22)+1,\"\")","v":22},{"$f":"IFERROR(INDEX($A$2:$A$298,MATCH(ROWS($G$2:G23),$G$2:$G$298,0)),\"\")","v":"Borfeldolgozás, pezsgőgyártás, palackozás"}]
["Borozó, söröző, italbolt, büfé, bisztró, kávézó, eszpresszó",3,1800,null,null,null,{"$f":"IF(--ISNUMBER(SEARCH(tev.lista,A24)),MAX($G$1:G23)+1,\"\")","v":23},{"$f":"IFERROR(INDEX($A$2:$A$298,MATCH(ROWS($G$2:G24),$G$2:$G$298,0)),\"\")","v":"Borozó, söröző, italbolt, büfé, bisztró, kávézó, eszpresszó"}]
["Bőr konfekcionált termékek javítása",4,1800,null,null,null,{"$f":"IF(--ISNUMBER(SEARCH(tev.lista,A25)),MAX($G$1:G24)+1,\"\")","v":24},{"$f":"IFERROR(INDEX($A$2:$A$298,MATCH(ROWS($G$2:G25),$G$2:$G$298,0)),\"\")","v":"Bőr konfekcionált termékek javítása"}]
["Bőr, bőrdíszmű kereskedelem",2,1200,null,null,null,{"$f":"IF(--ISNUMBER(SEARCH(tev.lista,A26)),MAX($G$1:G25)+1,\"\")","v":25},{"$f":"IFERROR(INDEX($A$2:$A$298,MATCH(ROWS($G$2:G26),$G$2:$G$298,0)),\"\")","v":"Bőr, bőrdíszmű kereskedelem"}]
["Bőrkikészítés, bőrtermékek gyártása",3,2400,null,null,null,{"$f":"IF(--ISNUMBER(SEARCH(tev.lista,A27)),MAX($G$1:G26)+1,\"\")","v":26},{"$f":"IFERROR(INDEX($A$2:$A$298,MATCH(ROWS($G$2:G27),$G$2:$G$298,0)),\"\")","v":"Bőrkikészítés, bőrtermékek gyártása"}]
["Bőrruházat gyártása",3,2400,null,null,null,{"$f":"IF(--ISNUMBER(SEARCH(tev.lista,A28)),MAX($G$1:G27)+1,\"\")","v":27},{"$f":"IFERROR(INDEX($A$2:$A$298,MATCH(ROWS($G$2:G28),$G$2:$G$298,0)),\"\")","v":"Bőrruházat gyártása"}]
["Bőrruházati kereskedelem",2,1200,null,null,null,{"$f":"IF(--ISNUMBER(SEARCH(tev.lista,A29)),MAX($G$1:G28)+1,\"\")","v":28},{"$f":"IFERROR(INDEX($A$2:$A$298,MATCH(ROWS($G$2:G29),$G$2:$G$298,0)),\"\")","v":"Bőrruházati kereskedelem"}]
["Bútor (fa alapanyagú, illetve kárpitozott) kereskedelem",2,1200,null,null,null,{"$f":"IF(--ISNUMBER(SEARCH(tev.lista,A30)),MAX($G$1:G29)+1,\"\")","v":29},{"$f":"IFERROR(INDEX($A$2:$A$298,MATCH(ROWS($G$2:G30),$G$2:$G$298,0)),\"\")","v":"Bútor (fa alapanyagú, illetve kárpitozott) kereskedelem"}]
["Bútorgyártás, egyéb feldolgozóipari termékek gyártása",3,2400,null,null,null,{"$f":"IF(--ISNUMBER(SEARCH(tev.lista,A31)),MAX($G$1:G30)+1,\"\")","v":30},{"$f":"IFERROR(INDEX($A$2:$A$298,MATCH(ROWS($G$2:G31),$G$2:$G$298,0)),\"\")","v":"Bútorgyártás, egyéb feldolgozóipari termékek gyártása"}]
["Bútorjavítás (fa anyagok felhasználásával)",4,2400,null,null,null,{"$f":"IF(--ISNUMBER(SEARCH(tev.lista,A32)),MAX($G$1:G31)+1,\"\")","v":31},{"$f":"IFERROR(INDEX($A$2:$A$298,MATCH(ROWS($G$2:G32),$G$2:$G$298,0)),\"\")","v":"Bútorjavítás (fa anyagok felhasználásával)"}]
["Bútorkereskedelem",2,1200,null,null,null,{"$f":"IF(--ISNUMBER(SEARCH(tev.lista,A33)),MAX($G$1:G32)+1,\"\")","v":32},{"$f":"IFERROR(INDEX($A$2:$A$298,MATCH(ROWS($G$2:G33),$G$2:$G$298,0)),\"\")","v":"Bútorkereskedelem"}]
["Camping",3,1800,null,null,null,{"$f":"IF(--ISNUMBER(SEARCH(tev.lista,A34)),MAX($G$1:G33)+1,\"\")","v":33},{"$f":"IFERROR(INDEX($A$2:$A$298,MATCH(ROWS($G$2:G34),$G$2:$G$298,0)),\"\")","v":"Camping"}]
["Címfestő, vésnök",4,1800,null,null,null,{"$f":"IF(--ISNUMBER(SEARCH(tev.lista,A35)),MAX($G$1:G34)+1,\"\")","v":34},{"$f":"IFERROR(INDEX($A$2:$A$298,MATCH(ROWS($G$2:G35),$G$2:$G$298,0)),\"\")","v":"Címfestő, vésnök"}]
["Cipőkereskedelem",2,1200,null,null,null,{"$f":"IF(--ISNUMBER(SEARCH(tev.lista,A36)),MAX($G$1:G35)+1,\"\")","v":35},{"$f":"IFERROR(INDEX($A$2:$A$298,MATCH(ROWS($G$2:G36),$G$2:$G$298,0)),\"\")","v":"Cipőkereskedelem"}]
["Cipőjavítás",4,1800,null,null,null,{"$f":"IF(--ISNUMBER(SEARCH(tev.lista,A37)),MAX($G$1:G36)+1,\"\")","v":36},{"$f":"IFERROR(INDEX($A$2:$A$298,MATCH(ROWS($G$2:G37),$G$2:$G$298,0)),\"\")","v":"Cipőjavítás"}]
["Cukorgyártás",3,2400,null,null,null,{"$f":"IF(--ISNUMBER(SEARCH(tev.lista,A38)),MAX($G$1:G37)+1,\"\")","v":37},{"$f":"IFERROR(INDEX($A$2:$A$298,MATCH(ROWS($G$2:G38),$G$2:$G$298,0)),\"\")","v":"Cukorgyártás"}]
["Cukrászda",3,1800,null,null,null,{"$f":"IF(--ISNUMBER(SEARCH(tev.lista,A39)),MAX($G$1:G38)+1,\"\")","v":38},{"$f":"IFERROR(INDEX($A$2:$A$298,MATCH(ROWS($G$2:G39),$G$2:$G$298,0)),\"\")","v":"Cukrászda"}]
["Csomagoló- és tároló fatermékek gyártása",4,2400,null,null,null,{"$f":"IF(--ISNUMBER(SEARCH(tev.lista,A40)),MAX($G$1:G39)+1,\"\")","v":39},{"$f":"IFERROR(INDEX($A$2:$A$298,MATCH(ROWS($G$2:G40),$G$2:$G$298,0)),\"\")","v":"Csomagoló- és tároló fatermékek gyártása"}]
["Csőgyártás",4,2400,null,null,null,{"$f":"IF(--ISNUMBER(SEARCH(tev.lista,A41)),MAX($G$1:G40)+1,\"\")","v":40},{"$f":"IFERROR(INDEX($A$2:$A$298,MATCH(ROWS($G$2:G41),$G$2:$G$298,0)),\"\")","v":"Csőgyártás"}]
["Dekoratőr",4,1800,null,null,null,{"$f":"IF(--ISNUMBER(SEARCH(tev.lista,A42)),MAX($G$1:G41)+1,\"\")","v":41},{"$f":"IFERROR(INDEX($A$2:$A$298,MATCH(ROWS($G$2:G42),$G$2:$G$298,0)),\"\")","v":"Dekoratőr"}]
["Delicatesse, édesség kereskedés",2,1200,null,null,null,{"$f":"IF(--ISNUMBER(SEARCH(tev.lista,A43)),MAX($G$1:G42)+1,\"\")","v":42},{"$f":"IFERROR(INDEX($A$2:$A$298,MATCH(ROWS($G$2:G43),$G$2:$G$298,0)),\"\")","v":"Delicatesse, édesség kereskedés"}]
["Diákétkeztetés",4,1800,null,null,null,{"$f":"IF(--ISNUMBER(SEARCH(tev.lista,A44)),MAX($G$1:G43)+1,\"\")","v":43},{"$f":"IFERROR(INDEX($A$2:$A$298,MATCH(ROWS($G$2:G44),$G$2:$G$298,0)),\"\")","v":"Diákétkeztetés"}]
["Dísz- és ajándéktárgyak gyártása",3,2400,null,null,null,{"$f":"IF(--ISNUMBER(SEARCH(tev.lista,A45)),MAX($G$1:G44)+1,\"\")","v":44},{"$f":"IFERROR(INDEX($A$2:$A$298,MATCH(ROWS($G$2:G45),$G$2:$G$298,0)),\"\")","v":"Dísz- és ajándéktárgyak gyártása"}]
["Divatáru kereskedés (butik)",2,1200,null,null,null,{"$f":"IF(--ISNUMBER(SEARCH(tev.lista,A46)),MAX($G$1:G45)+1,\"\")","v":45},{"$f":"IFERROR(INDEX($A$2:$A$298,MATCH(ROWS($G$2:G46),$G$2:$G$298,0)),\"\")","v":"Divatáru kereskedés (butik)"}]
["Dohány, ajándék, bizsu, hírlap kereskedés",2,1200,null,null,null,{"$f":"IF(--ISNUMBER(SEARCH(tev.lista,A47)),MAX($G$1:G46)+1,\"\")","v":46},{"$f":"IFERROR(INDEX($A$2:$A$298,MATCH(ROWS($G$2:G47),$G$2:$G$298,0)),\"\")","v":"Dohány, ajándék, bizsu, hírlap kereskedés"}]
["Édesipari termékek gyártása",3,2400,null,null,null,{"$f":"IF(--ISNUMBER(SEARCH(tev.lista,A48)),MAX($G$1:G47)+1,\"\")","v":47},{"$f":"IFERROR(INDEX($A$2:$A$298,MATCH(ROWS($G$2:G48),$G$2:$G$298,0)),\"\")","v":"Édesipari termékek gyártása"}]
["Elektromos és elektronikus alkatrészek kereskedelme",2,1200,null,null,null,{"$f":"IF(--ISNUMBER(SEARCH(tev.lista,A49)),MAX($G$1:G48)+1,\"\")","v":48},{"$f":"IFERROR(INDEX($A$2:$A$298,MATCH(ROWS($G$2:G49),$G$2:$G$298,0)),\"\")","v":"Elektromos és elektronikus alkatrészek kereskedelme"}]
["Élelmiszer nagykereskedelem",2,1200,null,null,null,{"$f":"IF(--ISNUMBER(SEARCH(tev.lista,A50)),MAX($G$1:G49)+1,\"\")","v":49},{"$f":"IFERROR(INDEX($A$2:$A$298,MATCH(ROWS($G$2:G50),$G$2:$G$298,0)),\"\")","v":"Élelmiszer nagykereskedelem"}]
["Élelmiszer, ital, dohányáru nagykereskedelem",2,1200,null,null,null,{"$f":"IF(--ISNUMBER(SEARCH(tev.lista,A51)),MAX($G$1:G50)+1,\"\")","v":50},{"$f":"IFERROR(INDEX($A$2:$A$298,MATCH(ROWS($G$2:G51),$G$2:$G$298,0)),\"\")","v":"Élelmiszer, ital, dohányáru nagykereskedelem"}]
["Élelmiszeripari gépgyártás",3,2400,null,null,null,{"$f":"IF(--ISNUMBER(SEARCH(tev.lista,A52)),MAX($G$1:G51)+1,\"\")","v":51},{"$f":"IFERROR(INDEX($A$2:$A$298,MATCH(ROWS($G$2:G52),$G$2:$G$298,0)),\"\")","v":"Élelmiszeripari gépgyártás"}]
["Építési és épületgépészeti szerelőipar",5,4200,null,null,null,{"$f":"IF(--ISNUMBER(SEARCH(tev.lista,A53)),MAX($G$1:G52)+1,\"\")","v":52},{"$f":"IFERROR(INDEX($A$2:$A$298,MATCH(ROWS($G$2:G53),$G$2:$G$298,0)),\"\")","v":"Építési és épületgépészeti szerelőipar"}]
["Építőipar",5,4200,null,null,null,{"$f":"IF(--ISNUMBER(SEARCH(tev.lista,A54)),MAX($G$1:G53)+1,\"\")","v":53},{"$f":"IFERROR(INDEX($A$2:$A$298,MATCH(ROWS($G$2:G54),$G$2:$G$298,0)),\"\")","v":"Építőipar"}]
["Építőipari gépek, berendezések kölcsönzése (kivéve daru)",2,1800,null,null,null,{"$f":"IF(--ISNUMBER(SEARCH(tev.lista,A55)),MAX($G$1:G54)+1,\"\")","v":54},{"$f":"IFERROR(INDEX($A$2:$A$298,MATCH(ROWS($G$2:G55),$G$2:$G$298,0)),\"\")","v":"Építőipari gépek, berendezések kölcsönzése (kivéve daru)"}]
["Építőipari vas- és fémszerkezetek gyártása",4,2400,null,null,null,{"$f":"IF(--ISNUMBER(SEARCH(tev.lista,A56)),MAX($G$1:G55)+1,\"\")","v":55},{"$f":"IFERROR(INDEX($A$2:$A$298,MATCH(ROWS($G$2:G56),$G$2:$G$298,0)),\"\")","v":"Építőipari vas- és fémszerkezetek gyártása"}]
["Épület-, illetve gépjármű fóliázás",5,4200,null,null,null,{"$f":"IF(--ISNUMBER(SEARCH(tev.lista,A57)),MAX($G$1:G56)+1,\"\")","v":56},{"$f":"IFERROR(INDEX($A$2:$A$298,MATCH(ROWS($G$2:G57),$G$2:$G$298,0)),\"\")","v":"Épület-, illetve gépjármű fóliázás"}]
["Épületács- és épületasztalosipari termékek gyártása",4,2400,null,null,null,{"$f":"IF(--ISNUMBER(SEARCH(tev.lista,A58)),MAX($G$1:G57)+1,\"\")","v":57},{"$f":"IFERROR(INDEX($A$2:$A$298,MATCH(ROWS($G$2:G58),$G$2:$G$298,0)),\"\")","v":"Épületács- és épületasztalosipari termékek gyártása"}]
["Épületasztalos",5,4200,null,null,null,{"$f":"IF(--ISNUMBER(SEARCH(tev.lista,A59)),MAX($G$1:G58)+1,\"\")","v":58},{"$f":"IFERROR(INDEX($A$2:$A$298,MATCH(ROWS($G$2:G59),$G$2:$G$298,0)),\"\")","v":"Épületasztalos"}]
["Épülettisztítás (takarítás, ablaktisztítás)",4,1800,null,null,null,{"$f":"IF(--ISNUMBER(SEARCH(tev.lista,A60)),MAX($G$1:G59)+1,\"\")","v":59},{"$f":"IFERROR(INDEX($A$2:$A$298,MATCH(ROWS($G$2:G60),$G$2:$G$298,0)),\"\")","v":"Épülettisztítás (takarítás, ablaktisztítás)"}]
["Épületüzemeltetés (kivéve társasház, lakásszövetkezet)",4,1800,null,null,null,{"$f":"IF(--ISNUMBER(SEARCH(tev.lista,A61)),MAX($G$1:G60)+1,\"\")","v":60},{"$f":"IFERROR(INDEX($A$2:$A$298,MATCH(ROWS($G$2:G61),$G$2:$G$298,0)),\"\")","v":"Épületüzemeltetés (kivéve társasház, lakásszövetkezet)"}]
["Erőművi és ipari kazángyártás",4,2400,null,null,null,{"$f":"IF(--ISNUMBER(SEARCH(tev.lista,A62)),MAX($G$1:G61)+1,\"\")","v":61},{"$f":"IFERROR(INDEX($A$2:$A$298,MATCH(ROWS($G$2:G62),$G$2:$G$298,0)),\"\")","v":"Erőművi és ipari kazángyártás"}]
["Esküvőiruha-kölcsönző",2,1800,null,null,null,{"$f":"IF(--ISNUMBER(SEARCH(tev.lista,A63)),MAX($G$1:G62)+1,\"\")","v":62},{"$f":"IFERROR(INDEX($A$2:$A$298,MATCH(ROWS($G$2:G63),$G$2:$G$298,0)),\"\")","v":"Esküvőiruha-kölcsönző"}]
["Étrendkiegészítő készítmények forgalmazása",2,1200,null,null,null,{"$f":"IF(--ISNUMBER(SEARCH(tev.lista,A64)),MAX($G$1:G63)+1,\"\")","v":63},{"$f":"IFERROR(INDEX($A$2:$A$298,MATCH(ROWS($G$2:G64),$G$2:$G$298,0)),\"\")","v":"Étrendkiegészítő készítmények forgalmazása"}]
["Éttermi vendéglátás",3,1800,null,null,null,{"$f":"IF(--ISNUMBER(SEARCH(tev.lista,A65)),MAX($G$1:G64)+1,\"\")","v":64},{"$f":"IFERROR(INDEX($A$2:$A$298,MATCH(ROWS($G$2:G65),$G$2:$G$298,0)),\"\")","v":"Éttermi vendéglátás"}]
["Faanyag- és barkácsáru kereskedelem",2,1200,null,null,null,{"$f":"IF(--ISNUMBER(SEARCH(tev.lista,A66)),MAX($G$1:G65)+1,\"\")","v":65},{"$f":"IFERROR(INDEX($A$2:$A$298,MATCH(ROWS($G$2:G66),$G$2:$G$298,0)),\"\")","v":"Faanyag- és barkácsáru kereskedelem"}]
["Fafeldolgozás",4,1200,null,null,null,{"$f":"IF(--ISNUMBER(SEARCH(tev.lista,A67)),MAX($G$1:G66)+1,\"\")","v":66},{"$f":"IFERROR(INDEX($A$2:$A$298,MATCH(ROWS($G$2:G67),$G$2:$G$298,0)),\"\")","v":"Fafeldolgozás"}]
["Falusi turizmus - lovaglás",3,1800,null,null,null,{"$f":"IF(--ISNUMBER(SEARCH(tev.lista,A68)),MAX($G$1:G67)+1,\"\")","v":67},{"$f":"IFERROR(INDEX($A$2:$A$298,MATCH(ROWS($G$2:G68),$G$2:$G$298,0)),\"\")","v":"Falusi turizmus - lovaglás"}]
["Faragott kőtermékek előállítása",3,2400,null,null,null,{"$f":"IF(--ISNUMBER(SEARCH(tev.lista,A69)),MAX($G$1:G68)+1,\"\")","v":68},{"$f":"IFERROR(INDEX($A$2:$A$298,MATCH(ROWS($G$2:G69),$G$2:$G$298,0)),\"\")","v":"Faragott kőtermékek előállítása"}]
["Fatömegcikk gyártása",4,2400,null,null,null,{"$f":"IF(--ISNUMBER(SEARCH(tev.lista,A70)),MAX($G$1:G69)+1,\"\")","v":69},{"$f":"IFERROR(INDEX($A$2:$A$298,MATCH(ROWS($G$2:G70),$G$2:$G$298,0)),\"\")","v":"Fatömegcikk gyártása"}]
["Felvonó szerelés és javítás",5,4200,null,null,null,{"$f":"IF(--ISNUMBER(SEARCH(tev.lista,A71)),MAX($G$1:G70)+1,\"\")","v":70},{"$f":"IFERROR(INDEX($A$2:$A$298,MATCH(ROWS($G$2:G71),$G$2:$G$298,0)),\"\")","v":"Felvonó szerelés és javítás"}]
["Fémfeldolgozási termékek gyártása",4,2400,null,null,null,{"$f":"IF(--ISNUMBER(SEARCH(tev.lista,A72)),MAX($G$1:G71)+1,\"\")","v":71},{"$f":"IFERROR(INDEX($A$2:$A$298,MATCH(ROWS($G$2:G72),$G$2:$G$298,0)),\"\")","v":"Fémfeldolgozási termékek gyártása"}]
["Fémmegmunkálás és felületkezelés",4,1800,null,null,null,{"$f":"IF(--ISNUMBER(SEARCH(tev.lista,A73)),MAX($G$1:G72)+1,\"\")","v":72},{"$f":"IFERROR(INDEX($A$2:$A$298,MATCH(ROWS($G$2:G73),$G$2:$G$298,0)),\"\")","v":"Fémmegmunkálás és felületkezelés"}]
["Fémszerkezetgyártás (hegesztés)",4,1800,null,null,null,{"$f":"IF(--ISNUMBER(SEARCH(tev.lista,A74)),MAX($G$1:G73)+1,\"\")","v":73},{"$f":"IFERROR(INDEX($A$2:$A$298,MATCH(ROWS($G$2:G74),$G$2:$G$298,0)),\"\")","v":"Fémszerkezetgyártás (hegesztés)"}]
["Fémtartály, szállítótartály gyártása (védőgázas hegesztés)",4,1800,null,null,null,{"$f":"IF(--ISNUMBER(SEARCH(tev.lista,A75)),MAX($G$1:G74)+1,\"\")","v":74},{"$f":"IFERROR(INDEX($A$2:$A$298,MATCH(ROWS($G$2:G75),$G$2:$G$298,0)),\"\")","v":"Fémtartály, szállítótartály gyártása (védőgázas hegesztés)"}]
["Fényforrás- és világítóberendezés-gyártás",3,2400,null,null,null,{"$f":"IF(--ISNUMBER(SEARCH(tev.lista,A76)),MAX($G$1:G75)+1,\"\")","v":75},{"$f":"IFERROR(INDEX($A$2:$A$298,MATCH(ROWS($G$2:G76),$G$2:$G$298,0)),\"\")","v":"Fényforrás- és világítóberendezés-gyártás"}]
["Fényképészet, videofelvétel készítés",4,1800,null,null,null,{"$f":"IF(--ISNUMBER(SEARCH(tev.lista,A77)),MAX($G$1:G76)+1,\"\")","v":76},{"$f":"IFERROR(INDEX($A$2:$A$298,MATCH(ROWS($G$2:G77),$G$2:$G$298,0)),\"\")","v":"Fényképészet, videofelvétel készítés"}]
["Fénymásolás, sokszorosítás, bélyegzőkészítés",4,1800,null,null,null,{"$f":"IF(--ISNUMBER(SEARCH(tev.lista,A78)),MAX($G$1:G77)+1,\"\")","v":77},{"$f":"IFERROR(INDEX($A$2:$A$298,MATCH(ROWS($G$2:G78),$G$2:$G$298,0)),\"\")","v":"Fénymásolás, sokszorosítás, bélyegzőkészítés"}]
["Festék, lakk kereskedelem",4,1200,null,null,null,{"$f":"IF(--ISNUMBER(SEARCH(tev.lista,A79)),MAX($G$1:G78)+1,\"\")","v":78},{"$f":"IFERROR(INDEX($A$2:$A$298,MATCH(ROWS($G$2:G79),$G$2:$G$298,0)),\"\")","v":"Festék, lakk kereskedelem"}]
["Festés, mázolás, tapétázás",5,4200,null,null,null,{"$f":"IF(--ISNUMBER(SEARCH(tev.lista,A80)),MAX($G$1:G79)+1,\"\")","v":79},{"$f":"IFERROR(INDEX($A$2:$A$298,MATCH(ROWS($G$2:G80),$G$2:$G$298,0)),\"\")","v":"Festés, mázolás, tapétázás"}]
["Filmvetítés (mozi)",1,600,null,null,null,{"$f":"IF(--ISNUMBER(SEARCH(tev.lista,A81)),MAX($G$1:G80)+1,\"\")","v":80},{"$f":"IFERROR(INDEX($A$2:$A$298,MATCH(ROWS($G$2:G81),$G$2:$G$298,0)),\"\")","v":"Filmvetítés (mozi)"}]
["Fitnesz center",1,600,null,null,null,{"$f":"IF(--ISNUMBER(SEARCH(tev.lista,A82)),MAX($G$1:G81)+1,\"\")","v":81},{"$f":"IFERROR(INDEX($A$2:$A$298,MATCH(ROWS($G$2:G82),$G$2:$G$298,0)),\"\")","v":"Fitnesz center"}]
["Fodrászat",4,1800,null,null,null,{"$f":"IF(--ISNUMBER(SEARCH(tev.lista,A83)),MAX($G$1:G82)+1,\"\")","v":82},{"$f":"IFERROR(INDEX($A$2:$A$298,MATCH(ROWS($G$2:G83),$G$2:$G$298,0)),\"\")","v":"Fodrászat"}]
["Fotócikkek kereskedelme",2,1200,null,null,null,{"$f":"IF(--ISNUMBER(SEARCH(tev.lista,A84)),MAX($G$1:G83)+1,\"\")","v":83},{"$f":"IFERROR(INDEX($A$2:$A$298,MATCH(ROWS($G$2:G84),$G$2:$G$298,0)),\"\")","v":"Fotócikkek kereskedelme"}]
["Fűrészárugyártás",4,2400,null,null,null,{"$f":"IF(--ISNUMBER(SEARCH(tev.lista,A85)),MAX($G$1:G84)+1,\"\")","v":84},{"$f":"IFERROR(INDEX($A$2:$A$298,MATCH(ROWS($G$2:G85),$G$2:$G$298,0)),\"\")","v":"Fűrészárugyártás"}]
["Fűszerpaprika őrlése vagy egyéb feldolgozása",3,2400,null,null,null,{"$f":"IF(--ISNUMBER(SEARCH(tev.lista,A86)),MAX($G$1:G85)+1,\"\")","v":85},{"$f":"IFERROR(INDEX($A$2:$A$298,MATCH(ROWS($G$2:G86),$G$2:$G$298,0)),\"\")","v":"Fűszerpaprika őrlése vagy egyéb feldolgozása"}]
["Fűtő-hűtő berendezések szerelése",5,4200,null,null,null,{"$f":"IF(--ISNUMBER(SEARCH(tev.lista,A87)),MAX($G$1:G86)+1,\"\")","v":86},{"$f":"IFERROR(INDEX($A$2:$A$298,MATCH(ROWS($G$2:G87),$G$2:$G$298,0)),\"\")","v":"Fűtő-hűtő berendezések szerelése"}]
["Gázcseretelep",4,1800,null,null,null,{"$f":"IF(--ISNUMBER(SEARCH(tev.lista,A88)),MAX($G$1:G87)+1,\"\")","v":87},{"$f":"IFERROR(INDEX($A$2:$A$298,MATCH(ROWS($G$2:G88),$G$2:$G$298,0)),\"\")","v":"Gázcseretelep"}]
["Gázkészülékek javítása",4,1800,null,null,null,{"$f":"IF(--ISNUMBER(SEARCH(tev.lista,A89)),MAX($G$1:G88)+1,\"\")","v":88},{"$f":"IFERROR(INDEX($A$2:$A$298,MATCH(ROWS($G$2:G89),$G$2:$G$298,0)),\"\")","v":"Gázkészülékek javítása"}]
["Gáz-, víz-, villanyszerelés",5,4200,null,null,null,{"$f":"IF(--ISNUMBER(SEARCH(tev.lista,A90)),MAX($G$1:G89)+1,\"\")","v":89},{"$f":"IFERROR(INDEX($A$2:$A$298,MATCH(ROWS($G$2:G90),$G$2:$G$298,0)),\"\")","v":"Gáz-, víz-, villanyszerelés"}]
["Gépállomás ",4,1800,null,null,null,{"$f":"IF(--ISNUMBER(SEARCH(tev.lista,A91)),MAX($G$1:G90)+1,\"\")","v":90},{"$f":"IFERROR(INDEX($A$2:$A$298,MATCH(ROWS($G$2:G91),$G$2:$G$298,0)),\"\")","v":"Gépállomás "}]
["Gépek, gépi berendezések kölcsönzése",2,1800,null,null,null,{"$f":"IF(--ISNUMBER(SEARCH(tev.lista,A92)),MAX($G$1:G91)+1,\"\")","v":91},{"$f":"IFERROR(INDEX($A$2:$A$298,MATCH(ROWS($G$2:G92),$G$2:$G$298,0)),\"\")","v":"Gépek, gépi berendezések kölcsönzése"}]
["Gépek, gépi berendezések gyártása",3,2400,null,null,null,{"$f":"IF(--ISNUMBER(SEARCH(tev.lista,A93)),MAX($G$1:G92)+1,\"\")","v":92},{"$f":"IFERROR(INDEX($A$2:$A$298,MATCH(ROWS($G$2:G93),$G$2:$G$298,0)),\"\")","v":"Gépek, gépi berendezések gyártása"}]
["Gépészeti berendezések kereskedelme",2,1200,null,null,null,{"$f":"IF(--ISNUMBER(SEARCH(tev.lista,A94)),MAX($G$1:G93)+1,\"\")","v":93},{"$f":"IFERROR(INDEX($A$2:$A$298,MATCH(ROWS($G$2:G94),$G$2:$G$298,0)),\"\")","v":"Gépészeti berendezések kereskedelme"}]
["Gépjármű-felszerelési cikk kereskedelem",4,1200,null,null,null,{"$f":"IF(--ISNUMBER(SEARCH(tev.lista,A95)),MAX($G$1:G94)+1,\"\")","v":94},{"$f":"IFERROR(INDEX($A$2:$A$298,MATCH(ROWS($G$2:G95),$G$2:$G$298,0)),\"\")","v":"Gépjármű-felszerelési cikk kereskedelem"}]
["Gépjárműalkatrész kereskedelem",4,1200,null,null,null,{"$f":"IF(--ISNUMBER(SEARCH(tev.lista,A96)),MAX($G$1:G95)+1,\"\")","v":95},{"$f":"IFERROR(INDEX($A$2:$A$298,MATCH(ROWS($G$2:G96),$G$2:$G$298,0)),\"\")","v":"Gépjárműalkatrész kereskedelem"}]
["Gumitermékek gyártása",4,2400,null,null,null,{"$f":"IF(--ISNUMBER(SEARCH(tev.lista,A97)),MAX($G$1:G96)+1,\"\")","v":96},{"$f":"IFERROR(INDEX($A$2:$A$298,MATCH(ROWS($G$2:G97),$G$2:$G$298,0)),\"\")","v":"Gumitermékek gyártása"}]
["Gyapjúfonás, szövés",3,2400,null,null,null,{"$f":"IF(--ISNUMBER(SEARCH(tev.lista,A98)),MAX($G$1:G97)+1,\"\")","v":97},{"$f":"IFERROR(INDEX($A$2:$A$298,MATCH(ROWS($G$2:G98),$G$2:$G$298,0)),\"\")","v":"Gyapjúfonás, szövés"}]
["Gyógyászati segédeszközök gyártása",3,2400,null,null,null,{"$f":"IF(--ISNUMBER(SEARCH(tev.lista,A99)),MAX($G$1:G98)+1,\"\")","v":98},{"$f":"IFERROR(INDEX($A$2:$A$298,MATCH(ROWS($G$2:G99),$G$2:$G$298,0)),\"\")","v":"Gyógyászati segédeszközök gyártása"}]
["Gyógyászati segédeszközök kereskedelme",2,1200,null,null,null,{"$f":"IF(--ISNUMBER(SEARCH(tev.lista,A100)),MAX($G$1:G99)+1,\"\")","v":99},{"$f":"IFERROR(INDEX($A$2:$A$298,MATCH(ROWS($G$2:G100),$G$2:$G$298,0)),\"\")","v":"Gyógyászati segédeszközök kereskedelme"}]
["Gyógynövény kereskedelem",2,1200,null,null,null,{"$f":"IF(--ISNUMBER(SEARCH(tev.lista,A101)),MAX($G$1:G100)+1,\"\")","v":100},{"$f":"IFERROR(INDEX($A$2:$A$298,MATCH(ROWS($G$2:G101),$G$2:$G$298,0)),\"\")","v":"Gyógynövény kereskedelem"}]
["Gyógynövények szárítása, feldolgozása és kiszerelése",3,2400,null,null,null,{"$f":"IF(--ISNUMBER(SEARCH(tev.lista,A102)),MAX($G$1:G101)+1,\"\")","v":101},{"$f":"IFERROR(INDEX($A$2:$A$298,MATCH(ROWS($G$2:G102),$G$2:$G$298,0)),\"\")","v":"Gyógynövények szárítása, feldolgozása és kiszerelése"}]
["Gyümölcs- és zöldségfeldolgozás",3,2400,null,null,null,{"$f":"IF(--ISNUMBER(SEARCH(tev.lista,A103)),MAX($G$1:G102)+1,\"\")","v":102},{"$f":"IFERROR(INDEX($A$2:$A$298,MATCH(ROWS($G$2:G103),$G$2:$G$298,0)),\"\")","v":"Gyümölcs- és zöldségfeldolgozás"}]
["Hangfelvétel készítés (hangstúdió)",4,1800,null,null,null,{"$f":"IF(--ISNUMBER(SEARCH(tev.lista,A104)),MAX($G$1:G103)+1,\"\")","v":103},{"$f":"IFERROR(INDEX($A$2:$A$298,MATCH(ROWS($G$2:G104),$G$2:$G$298,0)),\"\")","v":"Hangfelvétel készítés (hangstúdió)"}]
["Hangszerkereskedés",2,1200,null,null,null,{"$f":"IF(--ISNUMBER(SEARCH(tev.lista,A105)),MAX($G$1:G104)+1,\"\")","v":104},{"$f":"IFERROR(INDEX($A$2:$A$298,MATCH(ROWS($G$2:G105),$G$2:$G$298,0)),\"\")","v":"Hangszerkereskedés"}]
["Hangszergyártás",3,2400,null,null,null,{"$f":"IF(--ISNUMBER(SEARCH(tev.lista,A106)),MAX($G$1:G105)+1,\"\")","v":105},{"$f":"IFERROR(INDEX($A$2:$A$298,MATCH(ROWS($G$2:G106),$G$2:$G$298,0)),\"\")","v":"Hangszergyártás"}]
["Hangszerjavítás",4,1800,null,null,null,{"$f":"IF(--ISNUMBER(SEARCH(tev.lista,A107)),MAX($G$1:G106)+1,\"\")","v":106},{"$f":"IFERROR(INDEX($A$2:$A$298,MATCH(ROWS($G$2:G107),$G$2:$G$298,0)),\"\")","v":"Hangszerjavítás"}]
["Hangtechnikai kis- és nagykereskedelem ",2,1200,null,null,null,{"$f":"IF(--ISNUMBER(SEARCH(tev.lista,A108)),MAX($G$1:G107)+1,\"\")","v":107},{"$f":"IFERROR(INDEX($A$2:$A$298,MATCH(ROWS($G$2:G108),$G$2:$G$298,0)),\"\")","v":"Hangtechnikai kis- és nagykereskedelem "}]
["Háztartási elektromos készülékek kereskedelme (hűtő, mosógép, bojler)",2,1200,null,null,null,{"$f":"IF(--ISNUMBER(SEARCH(tev.lista,A109)),MAX($G$1:G108)+1,\"\")","v":108},{"$f":"IFERROR(INDEX($A$2:$A$298,MATCH(ROWS($G$2:G109),$G$2:$G$298,0)),\"\")","v":"Háztartási elektromos készülékek kereskedelme (hűtő, mosógép, bojler)"}]
["Háztartási- és egészségügyi papírtermékgyártás ",4,2400,null,null,null,{"$f":"IF(--ISNUMBER(SEARCH(tev.lista,A110)),MAX($G$1:G109)+1,\"\")","v":109},{"$f":"IFERROR(INDEX($A$2:$A$298,MATCH(ROWS($G$2:G110),$G$2:$G$298,0)),\"\")","v":"Háztartási- és egészségügyi papírtermékgyártás "}]
["Háztartási fémáru (finomacél áru, edény, étkészlet stb.) kereskedelem",2,1200,null,null,null,{"$f":"IF(--ISNUMBER(SEARCH(tev.lista,A111)),MAX($G$1:G110)+1,\"\")","v":110},{"$f":"IFERROR(INDEX($A$2:$A$298,MATCH(ROWS($G$2:G111),$G$2:$G$298,0)),\"\")","v":"Háztartási fémáru (finomacél áru, edény, étkészlet stb.) kereskedelem"}]
["Háztartási főző-,  fűtő- és vízmelegítő készülékek kereskedelme",2,1200,null,null,null,{"$f":"IF(--ISNUMBER(SEARCH(tev.lista,A112)),MAX($G$1:G111)+1,\"\")","v":111},{"$f":"IFERROR(INDEX($A$2:$A$298,MATCH(ROWS($G$2:G112),$G$2:$G$298,0)),\"\")","v":"Háztartási főző-,  fűtő- és vízmelegítő készülékek kereskedelme"}]
["Háztartási gépek javítása (hűtő, mosógép, bojler)",4,1800,null,null,null,{"$f":"IF(--ISNUMBER(SEARCH(tev.lista,A113)),MAX($G$1:G112)+1,\"\")","v":112},{"$f":"IFERROR(INDEX($A$2:$A$298,MATCH(ROWS($G$2:G113),$G$2:$G$298,0)),\"\")","v":"Háztartási gépek javítása (hűtő, mosógép, bojler)"}]
["Háztartási készülékek gyártása",3,2400,null,null,null,{"$f":"IF(--ISNUMBER(SEARCH(tev.lista,A114)),MAX($G$1:G113)+1,\"\")","v":113},{"$f":"IFERROR(INDEX($A$2:$A$298,MATCH(ROWS($G$2:G114),$G$2:$G$298,0)),\"\")","v":"Háztartási készülékek gyártása"}]
["Háztartási műanyagáru kereskedelem",2,1200,null,null,null,{"$f":"IF(--ISNUMBER(SEARCH(tev.lista,A115)),MAX($G$1:G114)+1,\"\")","v":114},{"$f":"IFERROR(INDEX($A$2:$A$298,MATCH(ROWS($G$2:G115),$G$2:$G$298,0)),\"\")","v":"Háztartási műanyagáru kereskedelem"}]
["Háztartási vegyiáru kereskedelem",4,1200,null,null,null,{"$f":"IF(--ISNUMBER(SEARCH(tev.lista,A116)),MAX($G$1:G115)+1,\"\")","v":115},{"$f":"IFERROR(INDEX($A$2:$A$298,MATCH(ROWS($G$2:G116),$G$2:$G$298,0)),\"\")","v":"Háztartási vegyiáru kereskedelem"}]
["Hidegburkoló (kerámia padlólap, csempe stb.)",5,4200,null,null,null,{"$f":"IF(--ISNUMBER(SEARCH(tev.lista,A117)),MAX($G$1:G116)+1,\"\")","v":116},{"$f":"IFERROR(INDEX($A$2:$A$298,MATCH(ROWS($G$2:G117),$G$2:$G$298,0)),\"\")","v":"Hidegburkoló (kerámia padlólap, csempe stb.)"}]
["Híradástechnikai berendezések, fotócikkek kölcsönzése",2,1800,null,null,null,{"$f":"IF(--ISNUMBER(SEARCH(tev.lista,A118)),MAX($G$1:G117)+1,\"\")","v":117},{"$f":"IFERROR(INDEX($A$2:$A$298,MATCH(ROWS($G$2:G118),$G$2:$G$298,0)),\"\")","v":"Híradástechnikai berendezések, fotócikkek kölcsönzése"}]
["Híradástechnikai- és elektronikai alkatrészgyártás",3,2400,null,null,null,{"$f":"IF(--ISNUMBER(SEARCH(tev.lista,A119)),MAX($G$1:G118)+1,\"\")","v":118},{"$f":"IFERROR(INDEX($A$2:$A$298,MATCH(ROWS($G$2:G119),$G$2:$G$298,0)),\"\")","v":"Híradástechnikai- és elektronikai alkatrészgyártás"}]
["Hiradástechnikai termékek gyártása",3,2400,null,null,null,{"$f":"IF(--ISNUMBER(SEARCH(tev.lista,A120)),MAX($G$1:G119)+1,\"\")","v":119},{"$f":"IFERROR(INDEX($A$2:$A$298,MATCH(ROWS($G$2:G120),$G$2:$G$298,0)),\"\")","v":"Hiradástechnikai termékek gyártása"}]
["Hirdetési tevékenység",4,1800,null,null,null,{"$f":"IF(--ISNUMBER(SEARCH(tev.lista,A121)),MAX($G$1:G120)+1,\"\")","v":120},{"$f":"IFERROR(INDEX($A$2:$A$298,MATCH(ROWS($G$2:G121),$G$2:$G$298,0)),\"\")","v":"Hirdetési tevékenység"}]
["Hírlapárusítás",2,1800,null,null,null,{"$f":"IF(--ISNUMBER(SEARCH(tev.lista,A122)),MAX($G$1:G121)+1,\"\")","v":121},{"$f":"IFERROR(INDEX($A$2:$A$298,MATCH(ROWS($G$2:G122),$G$2:$G$298,0)),\"\")","v":"Hírlapárusítás"}]
["Hordós vagy tartályos bortárolás",3,2400,null,null,null,{"$f":"IF(--ISNUMBER(SEARCH(tev.lista,A123)),MAX($G$1:G122)+1,\"\")","v":122},{"$f":"IFERROR(INDEX($A$2:$A$298,MATCH(ROWS($G$2:G123),$G$2:$G$298,0)),\"\")","v":"Hordós vagy tartályos bortárolás"}]
["Horgász, vadász szaküzlet (lőfegyverek nélkül)",2,1200,null,null,null,{"$f":"IF(--ISNUMBER(SEARCH(tev.lista,A124)),MAX($G$1:G123)+1,\"\")","v":123},{"$f":"IFERROR(INDEX($A$2:$A$298,MATCH(ROWS($G$2:G124),$G$2:$G$298,0)),\"\")","v":"Horgász, vadász szaküzlet (lőfegyverek nélkül)"}]
["Hús- és halfeldogozás",3,2400,null,null,null,{"$f":"IF(--ISNUMBER(SEARCH(tev.lista,A125)),MAX($G$1:G124)+1,\"\")","v":124},{"$f":"IFERROR(INDEX($A$2:$A$298,MATCH(ROWS($G$2:G125),$G$2:$G$298,0)),\"\")","v":"Hús- és halfeldogozás"}]
["Hús-, hal-, baromfi kereskedelem",2,1200,null,null,null,{"$f":"IF(--ISNUMBER(SEARCH(tev.lista,A126)),MAX($G$1:G125)+1,\"\")","v":125},{"$f":"IFERROR(INDEX($A$2:$A$298,MATCH(ROWS($G$2:G126),$G$2:$G$298,0)),\"\")","v":"Hús-, hal-, baromfi kereskedelem"}]
["Ingóvagyon kölcsönzése",2,1800,null,null,null,{"$f":"IF(--ISNUMBER(SEARCH(tev.lista,A127)),MAX($G$1:G126)+1,\"\")","v":126},{"$f":"IFERROR(INDEX($A$2:$A$298,MATCH(ROWS($G$2:G127),$G$2:$G$298,0)),\"\")","v":"Ingóvagyon kölcsönzése"}]
["Ipari fémtömegcikkek gyártása (forgácsolás)",4,2400,null,null,null,{"$f":"IF(--ISNUMBER(SEARCH(tev.lista,A128)),MAX($G$1:G127)+1,\"\")","v":127},{"$f":"IFERROR(INDEX($A$2:$A$298,MATCH(ROWS($G$2:G128),$G$2:$G$298,0)),\"\")","v":"Ipari fémtömegcikkek gyártása (forgácsolás)"}]
["Ipari híradástechnikai termékek gyártása",3,2400,null,null,null,{"$f":"IF(--ISNUMBER(SEARCH(tev.lista,A129)),MAX($G$1:G128)+1,\"\")","v":128},{"$f":"IFERROR(INDEX($A$2:$A$298,MATCH(ROWS($G$2:G129),$G$2:$G$298,0)),\"\")","v":"Ipari híradástechnikai termékek gyártása"}]
["Iparművészeti jellegű üveg- és porcelán kereskedelem",2,1200,null,null,null,{"$f":"IF(--ISNUMBER(SEARCH(tev.lista,A130)),MAX($G$1:G129)+1,\"\")","v":129},{"$f":"IFERROR(INDEX($A$2:$A$298,MATCH(ROWS($G$2:G130),$G$2:$G$298,0)),\"\")","v":"Iparművészeti jellegű üveg- és porcelán kereskedelem"}]
["Iroda - telephelyen, lakóházban",1,600,null,null,null,{"$f":"IF(--ISNUMBER(SEARCH(tev.lista,A131)),MAX($G$1:G130)+1,\"\")","v":130},{"$f":"IFERROR(INDEX($A$2:$A$298,MATCH(ROWS($G$2:G131),$G$2:$G$298,0)),\"\")","v":"Iroda - telephelyen, lakóházban"}]
["Iroda- és számítógépjavítás és -karbantartás",3,1800,null,null,null,{"$f":"IF(--ISNUMBER(SEARCH(tev.lista,A132)),MAX($G$1:G131)+1,\"\")","v":131},{"$f":"IFERROR(INDEX($A$2:$A$298,MATCH(ROWS($G$2:G132),$G$2:$G$298,0)),\"\")","v":"Iroda- és számítógépjavítás és -karbantartás"}]
["Irodagép- és számítógépgyártás",3,2400,null,null,null,{"$f":"IF(--ISNUMBER(SEARCH(tev.lista,A133)),MAX($G$1:G132)+1,\"\")","v":132},{"$f":"IFERROR(INDEX($A$2:$A$298,MATCH(ROWS($G$2:G133),$G$2:$G$298,0)),\"\")","v":"Irodagép- és számítógépgyártás"}]
["Irodagépek és gépi berendezések, számítástechnikai eszközök kölcsönzése",2,1800,null,null,null,{"$f":"IF(--ISNUMBER(SEARCH(tev.lista,A134)),MAX($G$1:G133)+1,\"\")","v":133},{"$f":"IFERROR(INDEX($A$2:$A$298,MATCH(ROWS($G$2:G134),$G$2:$G$298,0)),\"\")","v":"Irodagépek és gépi berendezések, számítástechnikai eszközök kölcsönzése"}]
["Italkereskedés (szeszesital)",2,1200,null,null,null,{"$f":"IF(--ISNUMBER(SEARCH(tev.lista,A135)),MAX($G$1:G134)+1,\"\")","v":134},{"$f":"IFERROR(INDEX($A$2:$A$298,MATCH(ROWS($G$2:G135),$G$2:$G$298,0)),\"\")","v":"Italkereskedés (szeszesital)"}]
["Italok raktározása, nagykereskedelem, palackozás",3,2400,null,null,null,{"$f":"IF(--ISNUMBER(SEARCH(tev.lista,A136)),MAX($G$1:G135)+1,\"\")","v":135},{"$f":"IFERROR(INDEX($A$2:$A$298,MATCH(ROWS($G$2:G136),$G$2:$G$298,0)),\"\")","v":"Italok raktározása, nagykereskedelem, palackozás"}]
["Járművillamossági készülékek gyártása",3,2400,null,null,null,{"$f":"IF(--ISNUMBER(SEARCH(tev.lista,A137)),MAX($G$1:G136)+1,\"\")","v":136},{"$f":"IFERROR(INDEX($A$2:$A$298,MATCH(ROWS($G$2:G137),$G$2:$G$298,0)),\"\")","v":"Járművillamossági készülékek gyártása"}]
["Játékkereskedés",2,1200,null,null,null,{"$f":"IF(--ISNUMBER(SEARCH(tev.lista,A138)),MAX($G$1:G137)+1,\"\")","v":137},{"$f":"IFERROR(INDEX($A$2:$A$298,MATCH(ROWS($G$2:G138),$G$2:$G$298,0)),\"\")","v":"Játékkereskedés"}]
["Játékgyártás",3,2400,null,null,null,{"$f":"IF(--ISNUMBER(SEARCH(tev.lista,A139)),MAX($G$1:G138)+1,\"\")","v":138},{"$f":"IFERROR(INDEX($A$2:$A$298,MATCH(ROWS($G$2:G139),$G$2:$G$298,0)),\"\")","v":"Játékgyártás"}]
["Szórakoztató-, illetve kulturális tevékenység",1,600,null,null,null,{"$f":"IF(--ISNUMBER(SEARCH(tev.lista,A140)),MAX($G$1:G139)+1,\"\")","v":139},{"$f":"IFERROR(INDEX($A$2:$A$298,MATCH(ROWS($G$2:G140),$G$2:$G$298,0)),\"\")","v":"Szórakoztató-, illetve kulturális tevékenység"}]
["Kaputechnika, egyéb épületgépészeti szerelés",5,4200,null,null,null,{"$f":"IF(--ISNUMBER(SEARCH(tev.lista,A141)),MAX($G$1:G140)+1,\"\")","v":140},{"$f":"IFERROR(INDEX($A$2:$A$298,MATCH(ROWS($G$2:G141),$G$2:$G$298,0)),\"\")","v":"Kaputechnika, egyéb épületgépészeti szerelés"}]
["Kárpitos",4,1800,null,null,null,{"$f":"IF(--ISNUMBER(SEARCH(tev.lista,A142)),MAX($G$1:G141)+1,\"\")","v":141},{"$f":"IFERROR(INDEX($A$2:$A$298,MATCH(ROWS($G$2:G142),$G$2:$G$298,0)),\"\")","v":"Kárpitos"}]
["Kávépörkölés, forgalmazás",3,1200,null,null,null,{"$f":"IF(--ISNUMBER(SEARCH(tev.lista,A143)),MAX($G$1:G142)+1,\"\")","v":142},{"$f":"IFERROR(INDEX($A$2:$A$298,MATCH(ROWS($G$2:G143),$G$2:$G$298,0)),\"\")","v":"Kávépörkölés, forgalmazás"}]
["Képkeretező",4,1800,null,null,null,{"$f":"IF(--ISNUMBER(SEARCH(tev.lista,A144)),MAX($G$1:G143)+1,\"\")","v":143},{"$f":"IFERROR(INDEX($A$2:$A$298,MATCH(ROWS($G$2:G144),$G$2:$G$298,0)),\"\")","v":"Képkeretező"}]
["Képző- és iparművészeti tárgyak kereskedelme",2,1200,null,null,null,{"$f":"IF(--ISNUMBER(SEARCH(tev.lista,A145)),MAX($G$1:G144)+1,\"\")","v":144},{"$f":"IFERROR(INDEX($A$2:$A$298,MATCH(ROWS($G$2:G145),$G$2:$G$298,0)),\"\")","v":"Képző- és iparművészeti tárgyak kereskedelme"}]
["Képzőművészeti tárgyak, festmények kereskedelme",2,1200,null,null,null,{"$f":"IF(--ISNUMBER(SEARCH(tev.lista,A146)),MAX($G$1:G145)+1,\"\")","v":145},{"$f":"IFERROR(INDEX($A$2:$A$298,MATCH(ROWS($G$2:G146),$G$2:$G$298,0)),\"\")","v":"Képzőművészeti tárgyak, festmények kereskedelme"}]
["Kerámiacsempék és -lapok gyártása",3,2400,null,null,null,{"$f":"IF(--ISNUMBER(SEARCH(tev.lista,A147)),MAX($G$1:G146)+1,\"\")","v":146},{"$f":"IFERROR(INDEX($A$2:$A$298,MATCH(ROWS($G$2:G147),$G$2:$G$298,0)),\"\")","v":"Kerámiacsempék és -lapok gyártása"}]
["Kerékpár és -alkatrész kereskedelem",2,1200,null,null,null,{"$f":"IF(--ISNUMBER(SEARCH(tev.lista,A148)),MAX($G$1:G147)+1,\"\")","v":147},{"$f":"IFERROR(INDEX($A$2:$A$298,MATCH(ROWS($G$2:G148),$G$2:$G$298,0)),\"\")","v":"Kerékpár és -alkatrész kereskedelem"}]
["Kerékpár és motorkerékpár gyártása",3,1200,null,null,null,{"$f":"IF(--ISNUMBER(SEARCH(tev.lista,A149)),MAX($G$1:G148)+1,\"\")","v":148},{"$f":"IFERROR(INDEX($A$2:$A$298,MATCH(ROWS($G$2:G149),$G$2:$G$298,0)),\"\")","v":"Kerékpár és motorkerékpár gyártása"}]
["Kert- és parképítés",5,4200,null,null,null,{"$f":"IF(--ISNUMBER(SEARCH(tev.lista,A150)),MAX($G$1:G149)+1,\"\")","v":149},{"$f":"IFERROR(INDEX($A$2:$A$298,MATCH(ROWS($G$2:G150),$G$2:$G$298,0)),\"\")","v":"Kert- és parképítés"}]
["Kézi- és gépszerszámgyártás",3,2400,null,null,null,{"$f":"IF(--ISNUMBER(SEARCH(tev.lista,A151)),MAX($G$1:G150)+1,\"\")","v":150},{"$f":"IFERROR(INDEX($A$2:$A$298,MATCH(ROWS($G$2:G151),$G$2:$G$298,0)),\"\")","v":"Kézi- és gépszerszámgyártás"}]
["Kézműipari textiláruk előállítása",3,2400,null,null,null,{"$f":"IF(--ISNUMBER(SEARCH(tev.lista,A152)),MAX($G$1:G151)+1,\"\")","v":151},{"$f":"IFERROR(INDEX($A$2:$A$298,MATCH(ROWS($G$2:G152),$G$2:$G$298,0)),\"\")","v":"Kézműipari textiláruk előállítása"}]
["Kisállatkozmetika",4,1800,null,null,null,{"$f":"IF(--ISNUMBER(SEARCH(tev.lista,A153)),MAX($G$1:G152)+1,\"\")","v":152},{"$f":"IFERROR(INDEX($A$2:$A$298,MATCH(ROWS($G$2:G153),$G$2:$G$298,0)),\"\")","v":"Kisállatkozmetika"}]
["Kisállatkereskedés",2,1200,null,null,null,{"$f":"IF(--ISNUMBER(SEARCH(tev.lista,A154)),MAX($G$1:G153)+1,\"\")","v":153},{"$f":"IFERROR(INDEX($A$2:$A$298,MATCH(ROWS($G$2:G154),$G$2:$G$298,0)),\"\")","v":"Kisállatkereskedés"}]
["Klímaberendezések forgalmazása, telepítése",5,4200,null,null,null,{"$f":"IF(--ISNUMBER(SEARCH(tev.lista,A155)),MAX($G$1:G154)+1,\"\")","v":154},{"$f":"IFERROR(INDEX($A$2:$A$298,MATCH(ROWS($G$2:G155),$G$2:$G$298,0)),\"\")","v":"Klímaberendezések forgalmazása, telepítése"}]
["Klímaberendezések gyártása",3,2400,null,null,null,{"$f":"IF(--ISNUMBER(SEARCH(tev.lista,A156)),MAX($G$1:G155)+1,\"\")","v":155},{"$f":"IFERROR(INDEX($A$2:$A$298,MATCH(ROWS($G$2:G156),$G$2:$G$298,0)),\"\")","v":"Klímaberendezések gyártása"}]
["Konfekció kereskedelem",2,1200,null,null,null,{"$f":"IF(--ISNUMBER(SEARCH(tev.lista,A157)),MAX($G$1:G156)+1,\"\")","v":156},{"$f":"IFERROR(INDEX($A$2:$A$298,MATCH(ROWS($G$2:G157),$G$2:$G$298,0)),\"\")","v":"Konfekció kereskedelem"}]
["Konfekcióáruk gyártása (textil)",3,2400,null,null,null,{"$f":"IF(--ISNUMBER(SEARCH(tev.lista,A158)),MAX($G$1:G157)+1,\"\")","v":157},{"$f":"IFERROR(INDEX($A$2:$A$298,MATCH(ROWS($G$2:G158),$G$2:$G$298,0)),\"\")","v":"Konfekcióáruk gyártása (textil)"}]
["Konzervgyártás és egyéb tartósított termékek előállítása",3,2400,null,null,null,{"$f":"IF(--ISNUMBER(SEARCH(tev.lista,A159)),MAX($G$1:G158)+1,\"\")","v":158},{"$f":"IFERROR(INDEX($A$2:$A$298,MATCH(ROWS($G$2:G159),$G$2:$G$298,0)),\"\")","v":"Konzervgyártás és egyéb tartósított termékek előállítása"}]
["Konyhabútor és konyhafelszerelési cikkek kereskedelme",2,1200,null,null,null,{"$f":"IF(--ISNUMBER(SEARCH(tev.lista,A160)),MAX($G$1:G159)+1,\"\")","v":159},{"$f":"IFERROR(INDEX($A$2:$A$298,MATCH(ROWS($G$2:G160),$G$2:$G$298,0)),\"\")","v":"Konyhabútor és konyhafelszerelési cikkek kereskedelme"}]
["Kozmetikai cikk, illatszer kereskedelem (drogéria)",4,1200,null,null,null,{"$f":"IF(--ISNUMBER(SEARCH(tev.lista,A161)),MAX($G$1:G160)+1,\"\")","v":160},{"$f":"IFERROR(INDEX($A$2:$A$298,MATCH(ROWS($G$2:G161),$G$2:$G$298,0)),\"\")","v":"Kozmetikai cikk, illatszer kereskedelem (drogéria)"}]
["Kozmetikai szalon",4,1800,null,null,null,{"$f":"IF(--ISNUMBER(SEARCH(tev.lista,A162)),MAX($G$1:G161)+1,\"\")","v":161},{"$f":"IFERROR(INDEX($A$2:$A$298,MATCH(ROWS($G$2:G162),$G$2:$G$298,0)),\"\")","v":"Kozmetikai szalon"}]
["Könyv- és lapnyomás",4,2400,null,null,null,{"$f":"IF(--ISNUMBER(SEARCH(tev.lista,A163)),MAX($G$1:G162)+1,\"\")","v":162},{"$f":"IFERROR(INDEX($A$2:$A$298,MATCH(ROWS($G$2:G163),$G$2:$G$298,0)),\"\")","v":"Könyv- és lapnyomás"}]
["Könyvkereskedés",2,1200,null,null,null,{"$f":"IF(--ISNUMBER(SEARCH(tev.lista,A164)),MAX($G$1:G163)+1,\"\")","v":163},{"$f":"IFERROR(INDEX($A$2:$A$298,MATCH(ROWS($G$2:G164),$G$2:$G$298,0)),\"\")","v":"Könyvkereskedés"}]
["Könyvkötés",4,1800,null,null,null,{"$f":"IF(--ISNUMBER(SEARCH(tev.lista,A165)),MAX($G$1:G164)+1,\"\")","v":164},{"$f":"IFERROR(INDEX($A$2:$A$298,MATCH(ROWS($G$2:G165),$G$2:$G$298,0)),\"\")","v":"Könyvkötés"}]
["Könyvtári tevékenység",1,600,null,null,null,{"$f":"IF(--ISNUMBER(SEARCH(tev.lista,A166)),MAX($G$1:G165)+1,\"\")","v":165},{"$f":"IFERROR(INDEX($A$2:$A$298,MATCH(ROWS($G$2:G166),$G$2:$G$298,0)),\"\")","v":"Könyvtári tevékenység"}]
["Kötött kelmék és cikkek gyártása",3,2400,null,null,null,{"$f":"IF(--ISNUMBER(SEARCH(tev.lista,A167)),MAX($G$1:G166)+1,\"\")","v":166},{"$f":"IFERROR(INDEX($A$2:$A$298,MATCH(ROWS($G$2:G167),$G$2:$G$298,0)),\"\")","v":"Kötött kelmék és cikkek gyártása"}]
["Kötöttáru kereskedelem",2,1200,null,null,null,{"$f":"IF(--ISNUMBER(SEARCH(tev.lista,A168)),MAX($G$1:G167)+1,\"\")","v":167},{"$f":"IFERROR(INDEX($A$2:$A$298,MATCH(ROWS($G$2:G168),$G$2:$G$298,0)),\"\")","v":"Kötöttáru kereskedelem"}]
["Közhasználatú fémtömegcikkek gyártása",4,2400,null,null,null,{"$f":"IF(--ISNUMBER(SEARCH(tev.lista,A169)),MAX($G$1:G168)+1,\"\")","v":168},{"$f":"IFERROR(INDEX($A$2:$A$298,MATCH(ROWS($G$2:G169),$G$2:$G$298,0)),\"\")","v":"Közhasználatú fémtömegcikkek gyártása"}]
["Központi fűtési kazán és radiátor gyártása",4,2400,null,null,null,{"$f":"IF(--ISNUMBER(SEARCH(tev.lista,A170)),MAX($G$1:G169)+1,\"\")","v":169},{"$f":"IFERROR(INDEX($A$2:$A$298,MATCH(ROWS($G$2:G170),$G$2:$G$298,0)),\"\")","v":"Központi fűtési kazán és radiátor gyártása"}]
["Közszükségleti fémtömegcikk (zár, lakat, csavar, szeg stb.) kereskedelem",2,1200,null,null,null,{"$f":"IF(--ISNUMBER(SEARCH(tev.lista,A171)),MAX($G$1:G170)+1,\"\")","v":170},{"$f":"IFERROR(INDEX($A$2:$A$298,MATCH(ROWS($G$2:G171),$G$2:$G$298,0)),\"\")","v":"Közszükségleti fémtömegcikk (zár, lakat, csavar, szeg stb.) kereskedelem"}]
["Kulcsmásolás",4,1800,null,null,null,{"$f":"IF(--ISNUMBER(SEARCH(tev.lista,A172)),MAX($G$1:G171)+1,\"\")","v":171},{"$f":"IFERROR(INDEX($A$2:$A$298,MATCH(ROWS($G$2:G172),$G$2:$G$298,0)),\"\")","v":"Kulcsmásolás"}]
["Kultúrcikk kereskedelem",2,1200,null,null,null,{"$f":"IF(--ISNUMBER(SEARCH(tev.lista,A173)),MAX($G$1:G172)+1,\"\")","v":172},{"$f":"IFERROR(INDEX($A$2:$A$298,MATCH(ROWS($G$2:G173),$G$2:$G$298,0)),\"\")","v":"Kultúrcikk kereskedelem"}]
["Lábbeligyártás",3,2400,null,null,null,{"$f":"IF(--ISNUMBER(SEARCH(tev.lista,A174)),MAX($G$1:G173)+1,\"\")","v":173},{"$f":"IFERROR(INDEX($A$2:$A$298,MATCH(ROWS($G$2:G174),$G$2:$G$298,0)),\"\")","v":"Lábbeligyártás"}]
["Lakásfelszerelési cikkek (kivéve bútor) kereskedelme",2,1200,null,null,null,{"$f":"IF(--ISNUMBER(SEARCH(tev.lista,A175)),MAX($G$1:G174)+1,\"\")","v":174},{"$f":"IFERROR(INDEX($A$2:$A$298,MATCH(ROWS($G$2:G175),$G$2:$G$298,0)),\"\")","v":"Lakásfelszerelési cikkek (kivéve bútor) kereskedelme"}]
["Lakásszerviz szolgáltatás (zár-, villany-, víz stb. szerelés)",4,1800,null,null,null,{"$f":"IF(--ISNUMBER(SEARCH(tev.lista,A176)),MAX($G$1:G175)+1,\"\")","v":175},{"$f":"IFERROR(INDEX($A$2:$A$298,MATCH(ROWS($G$2:G176),$G$2:$G$298,0)),\"\")","v":"Lakásszerviz szolgáltatás (zár-, villany-, víz stb. szerelés)"}]
["Látszerész, optikai kereskedés",2,1200,null,null,null,{"$f":"IF(--ISNUMBER(SEARCH(tev.lista,A177)),MAX($G$1:G176)+1,\"\")","v":176},{"$f":"IFERROR(INDEX($A$2:$A$298,MATCH(ROWS($G$2:G177),$G$2:$G$298,0)),\"\")","v":"Látszerész, optikai kereskedés"}]
["Látszerészeti és optikai eszközök javítása",4,1800,null,null,null,{"$f":"IF(--ISNUMBER(SEARCH(tev.lista,A178)),MAX($G$1:G177)+1,\"\")","v":177},{"$f":"IFERROR(INDEX($A$2:$A$298,MATCH(ROWS($G$2:G178),$G$2:$G$298,0)),\"\")","v":"Látszerészeti és optikai eszközök javítása"}]
["Látszerészeti, optikai és fényképészeti eszközök gyártása",3,2400,null,null,null,{"$f":"IF(--ISNUMBER(SEARCH(tev.lista,A179)),MAX($G$1:G178)+1,\"\")","v":178},{"$f":"IFERROR(INDEX($A$2:$A$298,MATCH(ROWS($G$2:G179),$G$2:$G$298,0)),\"\")","v":"Látszerészeti, optikai és fényképészeti eszközök gyártása"}]
["Len- és kenderfonás, szövés",3,2400,null,null,null,{"$f":"IF(--ISNUMBER(SEARCH(tev.lista,A180)),MAX($G$1:G179)+1,\"\")","v":179},{"$f":"IFERROR(INDEX($A$2:$A$298,MATCH(ROWS($G$2:G180),$G$2:$G$298,0)),\"\")","v":"Len- és kenderfonás, szövés"}]
["Malomipari termékek kereskedelme",2,1200,null,null,null,{"$f":"IF(--ISNUMBER(SEARCH(tev.lista,A181)),MAX($G$1:G180)+1,\"\")","v":180},{"$f":"IFERROR(INDEX($A$2:$A$298,MATCH(ROWS($G$2:G181),$G$2:$G$298,0)),\"\")","v":"Malomipari termékek kereskedelme"}]
["Manikűr és pedikűr",4,1800,null,null,null,{"$f":"IF(--ISNUMBER(SEARCH(tev.lista,A182)),MAX($G$1:G181)+1,\"\")","v":181},{"$f":"IFERROR(INDEX($A$2:$A$298,MATCH(ROWS($G$2:G182),$G$2:$G$298,0)),\"\")","v":"Manikűr és pedikűr"}]
["Melegburkoló (parketta, szőnyegpadló stb.)",5,4200,null,null,null,{"$f":"IF(--ISNUMBER(SEARCH(tev.lista,A183)),MAX($G$1:G182)+1,\"\")","v":182},{"$f":"IFERROR(INDEX($A$2:$A$298,MATCH(ROWS($G$2:G183),$G$2:$G$298,0)),\"\")","v":"Melegburkoló (parketta, szőnyegpadló stb.)"}]
["Mérés- és irányítástechnikai berendezések gyártása",3,2400,null,null,null,{"$f":"IF(--ISNUMBER(SEARCH(tev.lista,A184)),MAX($G$1:G183)+1,\"\")","v":183},{"$f":"IFERROR(INDEX($A$2:$A$298,MATCH(ROWS($G$2:G184),$G$2:$G$298,0)),\"\")","v":"Mérés- és irányítástechnikai berendezések gyártása"}]
["Mérőműszergyártás",3,2400,null,null,null,{"$f":"IF(--ISNUMBER(SEARCH(tev.lista,A185)),MAX($G$1:G184)+1,\"\")","v":184},{"$f":"IFERROR(INDEX($A$2:$A$298,MATCH(ROWS($G$2:G185),$G$2:$G$298,0)),\"\")","v":"Mérőműszergyártás"}]
["Mezőgazdasági gépgyártás",3,2400,null,null,null,{"$f":"IF(--ISNUMBER(SEARCH(tev.lista,A186)),MAX($G$1:G185)+1,\"\")","v":185},{"$f":"IFERROR(INDEX($A$2:$A$298,MATCH(ROWS($G$2:G186),$G$2:$G$298,0)),\"\")","v":"Mezőgazdasági gépgyártás"}]
["Mezőgazdasági- és kertészeti szaküzlet (kisgépek nélkül)",2,1200,null,null,null,{"$f":"IF(--ISNUMBER(SEARCH(tev.lista,A187)),MAX($G$1:G186)+1,\"\")","v":186},{"$f":"IFERROR(INDEX($A$2:$A$298,MATCH(ROWS($G$2:G187),$G$2:$G$298,0)),\"\")","v":"Mezőgazdasági- és kertészeti szaküzlet (kisgépek nélkül)"}]
["Mezőgazdasági gép nagykereskedelem, javítás",2,1800,null,null,null,{"$f":"IF(--ISNUMBER(SEARCH(tev.lista,A188)),MAX($G$1:G187)+1,\"\")","v":187},{"$f":"IFERROR(INDEX($A$2:$A$298,MATCH(ROWS($G$2:G188),$G$2:$G$298,0)),\"\")","v":"Mezőgazdasági gép nagykereskedelem, javítás"}]
["Mezőgazdasági gépállomás (gépjavítás, karbantartás)",4,1800,null,null,null,{"$f":"IF(--ISNUMBER(SEARCH(tev.lista,A189)),MAX($G$1:G188)+1,\"\")","v":188},{"$f":"IFERROR(INDEX($A$2:$A$298,MATCH(ROWS($G$2:G189),$G$2:$G$298,0)),\"\")","v":"Mezőgazdasági gépállomás (gépjavítás, karbantartás)"}]
["Mezőgazdasági gépek és eszközök kereskedelme",2,1200,null,null,null,{"$f":"IF(--ISNUMBER(SEARCH(tev.lista,A190)),MAX($G$1:G189)+1,\"\")","v":189},{"$f":"IFERROR(INDEX($A$2:$A$298,MATCH(ROWS($G$2:G190),$G$2:$G$298,0)),\"\")","v":"Mezőgazdasági gépek és eszközök kereskedelme"}]
["Mosás, vegytisztítás, textilfestés",4,1800,null,null,null,{"$f":"IF(--ISNUMBER(SEARCH(tev.lista,A191)),MAX($G$1:G190)+1,\"\")","v":190},{"$f":"IFERROR(INDEX($A$2:$A$298,MATCH(ROWS($G$2:G191),$G$2:$G$298,0)),\"\")","v":"Mosás, vegytisztítás, textilfestés"}]
["Munkásszállás",3,1800,null,null,null,{"$f":"IF(--ISNUMBER(SEARCH(tev.lista,A192)),MAX($G$1:G191)+1,\"\")","v":191},{"$f":"IFERROR(INDEX($A$2:$A$298,MATCH(ROWS($G$2:G192),$G$2:$G$298,0)),\"\")","v":"Munkásszállás"}]
["Munkavédelmi termékek kis- és nagykereskedelme",2,1200,null,null,null,{"$f":"IF(--ISNUMBER(SEARCH(tev.lista,A193)),MAX($G$1:G192)+1,\"\")","v":192},{"$f":"IFERROR(INDEX($A$2:$A$298,MATCH(ROWS($G$2:G193),$G$2:$G$298,0)),\"\")","v":"Munkavédelmi termékek kis- és nagykereskedelme"}]
["Műanyagalapanyag-gyártás",4,2400,null,null,null,{"$f":"IF(--ISNUMBER(SEARCH(tev.lista,A194)),MAX($G$1:G193)+1,\"\")","v":193},{"$f":"IFERROR(INDEX($A$2:$A$298,MATCH(ROWS($G$2:G194),$G$2:$G$298,0)),\"\")","v":"Műanyagalapanyag-gyártás"}]
["Műanyagalapú hő-, hang- és vízszigetelő anyagok gyártása",3,2400,null,null,null,{"$f":"IF(--ISNUMBER(SEARCH(tev.lista,A195)),MAX($G$1:G194)+1,\"\")","v":194},{"$f":"IFERROR(INDEX($A$2:$A$298,MATCH(ROWS($G$2:G195),$G$2:$G$298,0)),\"\")","v":"Műanyagalapú hő-, hang- és vízszigetelő anyagok gyártása"}]
["Műanyag bevonatok készítése szinterezéssel",4,1800,null,null,null,{"$f":"IF(--ISNUMBER(SEARCH(tev.lista,A196)),MAX($G$1:G195)+1,\"\")","v":195},{"$f":"IFERROR(INDEX($A$2:$A$298,MATCH(ROWS($G$2:G196),$G$2:$G$298,0)),\"\")","v":"Műanyag bevonatok készítése szinterezéssel"}]
["Műanyag termékek gyártása",4,2400,null,null,null,{"$f":"IF(--ISNUMBER(SEARCH(tev.lista,A197)),MAX($G$1:G196)+1,\"\")","v":196},{"$f":"IFERROR(INDEX($A$2:$A$298,MATCH(ROWS($G$2:G197),$G$2:$G$298,0)),\"\")","v":"Műanyag termékek gyártása"}]
["Műbőr és viaszosvászongyártás",3,2400,null,null,null,{"$f":"IF(--ISNUMBER(SEARCH(tev.lista,A198)),MAX($G$1:G197)+1,\"\")","v":197},{"$f":"IFERROR(INDEX($A$2:$A$298,MATCH(ROWS($G$2:G198),$G$2:$G$298,0)),\"\")","v":"Műbőr és viaszosvászongyártás"}]
["Műszaki cikkek kereskedelme",2,1200,null,null,null,{"$f":"IF(--ISNUMBER(SEARCH(tev.lista,A199)),MAX($G$1:G198)+1,\"\")","v":198},{"$f":"IFERROR(INDEX($A$2:$A$298,MATCH(ROWS($G$2:G199),$G$2:$G$298,0)),\"\")","v":"Műszaki cikkek kereskedelme"}]
["Műszergyártás",3,2400,null,null,null,{"$f":"IF(--ISNUMBER(SEARCH(tev.lista,A200)),MAX($G$1:G199)+1,\"\")","v":199},{"$f":"IFERROR(INDEX($A$2:$A$298,MATCH(ROWS($G$2:G200),$G$2:$G$298,0)),\"\")","v":"Műszergyártás"}]
["Műszeripari termékek javítása",4,1800,null,null,null,{"$f":"IF(--ISNUMBER(SEARCH(tev.lista,A201)),MAX($G$1:G200)+1,\"\")","v":200},{"$f":"IFERROR(INDEX($A$2:$A$298,MATCH(ROWS($G$2:G201),$G$2:$G$298,0)),\"\")","v":"Műszeripari termékek javítása"}]
["Nem építési célú kerámiatermékek gyártása",3,2400,null,null,null,{"$f":"IF(--ISNUMBER(SEARCH(tev.lista,A202)),MAX($G$1:G201)+1,\"\")","v":201},{"$f":"IFERROR(INDEX($A$2:$A$298,MATCH(ROWS($G$2:G202),$G$2:$G$298,0)),\"\")","v":"Nem építési célú kerámiatermékek gyártása"}]
["Növényolajgyártás és feldolgozás (extrakció nélkül)",3,2400,null,null,null,{"$f":"IF(--ISNUMBER(SEARCH(tev.lista,A203)),MAX($G$1:G202)+1,\"\")","v":202},{"$f":"IFERROR(INDEX($A$2:$A$298,MATCH(ROWS($G$2:G203),$G$2:$G$298,0)),\"\")","v":"Növényolajgyártás és feldolgozás (extrakció nélkül)"}]
["Növényvédőszer, műtrágya kereskedelem",4,1200,null,null,null,{"$f":"IF(--ISNUMBER(SEARCH(tev.lista,A204)),MAX($G$1:G203)+1,\"\")","v":203},{"$f":"IFERROR(INDEX($A$2:$A$298,MATCH(ROWS($G$2:G204),$G$2:$G$298,0)),\"\")","v":"Növényvédőszer, műtrágya kereskedelem"}]
["Nyílászárók gyártása",4,2400,null,null,null,{"$f":"IF(--ISNUMBER(SEARCH(tev.lista,A205)),MAX($G$1:G204)+1,\"\")","v":204},{"$f":"IFERROR(INDEX($A$2:$A$298,MATCH(ROWS($G$2:G205),$G$2:$G$298,0)),\"\")","v":"Nyílászárók gyártása"}]
["Nyílászárók kereskedelme",2,1200,null,null,null,{"$f":"IF(--ISNUMBER(SEARCH(tev.lista,A206)),MAX($G$1:G205)+1,\"\")","v":205},{"$f":"IFERROR(INDEX($A$2:$A$298,MATCH(ROWS($G$2:G206),$G$2:$G$298,0)),\"\")","v":"Nyílászárók kereskedelme"}]
["Nyomdai szolgáltatás",4,2400,null,null,null,{"$f":"IF(--ISNUMBER(SEARCH(tev.lista,A207)),MAX($G$1:G206)+1,\"\")","v":206},{"$f":"IFERROR(INDEX($A$2:$A$298,MATCH(ROWS($G$2:G207),$G$2:$G$298,0)),\"\")","v":"Nyomdai szolgáltatás"}]
["Oktatást kiegészítő egyéb tevékenység",4,1800,null,null,null,{"$f":"IF(--ISNUMBER(SEARCH(tev.lista,A208)),MAX($G$1:G207)+1,\"\")","v":207},{"$f":"IFERROR(INDEX($A$2:$A$298,MATCH(ROWS($G$2:G208),$G$2:$G$298,0)),\"\")","v":"Oktatást kiegészítő egyéb tevékenység"}]
["Órakereskedés (ékszer nélkül)",2,1200,null,null,null,{"$f":"IF(--ISNUMBER(SEARCH(tev.lista,A209)),MAX($G$1:G208)+1,\"\")","v":208},{"$f":"IFERROR(INDEX($A$2:$A$298,MATCH(ROWS($G$2:G209),$G$2:$G$298,0)),\"\")","v":"Órakereskedés (ékszer nélkül)"}]
["Órajavítás",4,1800,null,null,null,{"$f":"IF(--ISNUMBER(SEARCH(tev.lista,A210)),MAX($G$1:G209)+1,\"\")","v":209},{"$f":"IFERROR(INDEX($A$2:$A$298,MATCH(ROWS($G$2:G210),$G$2:$G$298,0)),\"\")","v":"Órajavítás"}]
["Orvosi műszerek, gyógyászati- és laboratóriumi berendezések gyártása",3,2400,null,null,null,{"$f":"IF(--ISNUMBER(SEARCH(tev.lista,A211)),MAX($G$1:G210)+1,\"\")","v":210},{"$f":"IFERROR(INDEX($A$2:$A$298,MATCH(ROWS($G$2:G211),$G$2:$G$298,0)),\"\")","v":"Orvosi műszerek, gyógyászati- és laboratóriumi berendezések gyártása"}]
["Palackozott italok kereskedelme",2,1200,null,null,null,{"$f":"IF(--ISNUMBER(SEARCH(tev.lista,A212)),MAX($G$1:G211)+1,\"\")","v":211},{"$f":"IFERROR(INDEX($A$2:$A$298,MATCH(ROWS($G$2:G212),$G$2:$G$298,0)),\"\")","v":"Palackozott italok kereskedelme"}]
["Pamutfonás, szövés",3,2400,null,null,null,{"$f":"IF(--ISNUMBER(SEARCH(tev.lista,A213)),MAX($G$1:G212)+1,\"\")","v":212},{"$f":"IFERROR(INDEX($A$2:$A$298,MATCH(ROWS($G$2:G213),$G$2:$G$298,0)),\"\")","v":"Pamutfonás, szövés"}]
["Papír csomagolóeszközök gyártása",4,2400,null,null,null,{"$f":"IF(--ISNUMBER(SEARCH(tev.lista,A214)),MAX($G$1:G213)+1,\"\")","v":213},{"$f":"IFERROR(INDEX($A$2:$A$298,MATCH(ROWS($G$2:G214),$G$2:$G$298,0)),\"\")","v":"Papír csomagolóeszközök gyártása"}]
["Papír- és papírtermékek gyártása",4,2400,null,null,null,{"$f":"IF(--ISNUMBER(SEARCH(tev.lista,A215)),MAX($G$1:G214)+1,\"\")","v":214},{"$f":"IFERROR(INDEX($A$2:$A$298,MATCH(ROWS($G$2:G215),$G$2:$G$298,0)),\"\")","v":"Papír- és papírtermékek gyártása"}]
["Papír-írószer",2,1200,null,null,null,{"$f":"IF(--ISNUMBER(SEARCH(tev.lista,A216)),MAX($G$1:G215)+1,\"\")","v":215},{"$f":"IFERROR(INDEX($A$2:$A$298,MATCH(ROWS($G$2:G216),$G$2:$G$298,0)),\"\")","v":"Papír-írószer"}]
["Paplan- és párnagyártás",3,2400,null,null,null,{"$f":"IF(--ISNUMBER(SEARCH(tev.lista,A217)),MAX($G$1:G216)+1,\"\")","v":216},{"$f":"IFERROR(INDEX($A$2:$A$298,MATCH(ROWS($G$2:G217),$G$2:$G$298,0)),\"\")","v":"Paplan- és párnagyártás"}]
["Parafa, szalma és fonott termékek gyártása",4,2400,null,null,null,{"$f":"IF(--ISNUMBER(SEARCH(tev.lista,A218)),MAX($G$1:G217)+1,\"\")","v":217},{"$f":"IFERROR(INDEX($A$2:$A$298,MATCH(ROWS($G$2:G218),$G$2:$G$298,0)),\"\")","v":"Parafa, szalma és fonott termékek gyártása"}]
["Padlóburkolati cikkek kereskedelme (melegburkolat)",2,1200,null,null,null,{"$f":"IF(--ISNUMBER(SEARCH(tev.lista,A219)),MAX($G$1:G218)+1,\"\")","v":218},{"$f":"IFERROR(INDEX($A$2:$A$298,MATCH(ROWS($G$2:G219),$G$2:$G$298,0)),\"\")","v":"Padlóburkolati cikkek kereskedelme (melegburkolat)"}]
["Pékáru, édesipari termékek kereskedelme",2,1200,null,null,null,{"$f":"IF(--ISNUMBER(SEARCH(tev.lista,A220)),MAX($G$1:G219)+1,\"\")","v":219},{"$f":"IFERROR(INDEX($A$2:$A$298,MATCH(ROWS($G$2:G220),$G$2:$G$298,0)),\"\")","v":"Pékáru, édesipari termékek kereskedelme"}]
["Rádiós- és televíziós tevékenység (stúdiók)",4,1800,null,null,null,{"$f":"IF(--ISNUMBER(SEARCH(tev.lista,A221)),MAX($G$1:G220)+1,\"\")","v":220},{"$f":"IFERROR(INDEX($A$2:$A$298,MATCH(ROWS($G$2:G221),$G$2:$G$298,0)),\"\")","v":"Rádiós- és televíziós tevékenység (stúdiók)"}]
["Régiség, antikvitás kereskedelem",2,1200,null,null,null,{"$f":"IF(--ISNUMBER(SEARCH(tev.lista,A222)),MAX($G$1:G221)+1,\"\")","v":221},{"$f":"IFERROR(INDEX($A$2:$A$298,MATCH(ROWS($G$2:G222),$G$2:$G$298,0)),\"\")","v":"Régiség, antikvitás kereskedelem"}]
["Rövidáru- és lakástextilgyártás",3,2400,null,null,null,{"$f":"IF(--ISNUMBER(SEARCH(tev.lista,A223)),MAX($G$1:G222)+1,\"\")","v":222},{"$f":"IFERROR(INDEX($A$2:$A$298,MATCH(ROWS($G$2:G223),$G$2:$G$298,0)),\"\")","v":"Rövidáru- és lakástextilgyártás"}]
["Ruházati áruházak",2,1200,null,null,null,{"$f":"IF(--ISNUMBER(SEARCH(tev.lista,A224)),MAX($G$1:G223)+1,\"\")","v":223},{"$f":"IFERROR(INDEX($A$2:$A$298,MATCH(ROWS($G$2:G224),$G$2:$G$298,0)),\"\")","v":"Ruházati áruházak"}]
["Ruházati cikkek gyártása textilanyagok felhasználásával",3,2400,null,null,null,{"$f":"IF(--ISNUMBER(SEARCH(tev.lista,A225)),MAX($G$1:G224)+1,\"\")","v":224},{"$f":"IFERROR(INDEX($A$2:$A$298,MATCH(ROWS($G$2:G225),$G$2:$G$298,0)),\"\")","v":"Ruházati cikkek gyártása textilanyagok felhasználásával"}]
["Ruházati cikkek kereskedelme",2,1200,null,null,null,{"$f":"IF(--ISNUMBER(SEARCH(tev.lista,A226)),MAX($G$1:G225)+1,\"\")","v":225},{"$f":"IFERROR(INDEX($A$2:$A$298,MATCH(ROWS($G$2:G226),$G$2:$G$298,0)),\"\")","v":"Ruházati cikkek kereskedelme"}]
["Ruházati- és egyéb konfekcionált termékek javítása",4,1800,null,null,null,{"$f":"IF(--ISNUMBER(SEARCH(tev.lista,A227)),MAX($G$1:G226)+1,\"\")","v":226},{"$f":"IFERROR(INDEX($A$2:$A$298,MATCH(ROWS($G$2:G227),$G$2:$G$298,0)),\"\")","v":"Ruházati- és egyéb konfekcionált termékek javítása"}]
["Ruházati- és textil kereskedelem",2,1200,null,null,null,{"$f":"IF(--ISNUMBER(SEARCH(tev.lista,A228)),MAX($G$1:G227)+1,\"\")","v":227},{"$f":"IFERROR(INDEX($A$2:$A$298,MATCH(ROWS($G$2:G228),$G$2:$G$298,0)),\"\")","v":"Ruházati- és textil kereskedelem"}]
["Ruházati termékek gyártása",3,2400,null,null,null,{"$f":"IF(--ISNUMBER(SEARCH(tev.lista,A229)),MAX($G$1:G228)+1,\"\")","v":228},{"$f":"IFERROR(INDEX($A$2:$A$298,MATCH(ROWS($G$2:G229),$G$2:$G$298,0)),\"\")","v":"Ruházati termékek gyártása"}]
["Selyemfonás, szövés",3,2400,null,null,null,{"$f":"IF(--ISNUMBER(SEARCH(tev.lista,A230)),MAX($G$1:G229)+1,\"\")","v":229},{"$f":"IFERROR(INDEX($A$2:$A$298,MATCH(ROWS($G$2:G230),$G$2:$G$298,0)),\"\")","v":"Selyemfonás, szövés"}]
["Seprű, kefe és nádfonat gyártása",3,2400,null,null,null,{"$f":"IF(--ISNUMBER(SEARCH(tev.lista,A231)),MAX($G$1:G230)+1,\"\")","v":230},{"$f":"IFERROR(INDEX($A$2:$A$298,MATCH(ROWS($G$2:G231),$G$2:$G$298,0)),\"\")","v":"Seprű, kefe és nádfonat gyártása"}]
["Söripari termékek gyártása",3,2400,null,null,null,{"$f":"IF(--ISNUMBER(SEARCH(tev.lista,A232)),MAX($G$1:G231)+1,\"\")","v":231},{"$f":"IFERROR(INDEX($A$2:$A$298,MATCH(ROWS($G$2:G232),$G$2:$G$298,0)),\"\")","v":"Söripari termékek gyártása"}]
["Sportcikkek, felszerelések javítása",4,1800,null,null,null,{"$f":"IF(--ISNUMBER(SEARCH(tev.lista,A233)),MAX($G$1:G232)+1,\"\")","v":232},{"$f":"IFERROR(INDEX($A$2:$A$298,MATCH(ROWS($G$2:G233),$G$2:$G$298,0)),\"\")","v":"Sportcikkek, felszerelések javítása"}]
["Sportcsarnokok, tornacsarnokok",1,600,null,null,null,{"$f":"IF(--ISNUMBER(SEARCH(tev.lista,A234)),MAX($G$1:G233)+1,\"\")","v":233},{"$f":"IFERROR(INDEX($A$2:$A$298,MATCH(ROWS($G$2:G234),$G$2:$G$298,0)),\"\")","v":"Sportcsarnokok, tornacsarnokok"}]
["Sportszer- és sportcikkgyártás",3,2400,null,null,null,{"$f":"IF(--ISNUMBER(SEARCH(tev.lista,A235)),MAX($G$1:G234)+1,\"\")","v":234},{"$f":"IFERROR(INDEX($A$2:$A$298,MATCH(ROWS($G$2:G235),$G$2:$G$298,0)),\"\")","v":"Sportszer- és sportcikkgyártás"}]
["Sportszerkereskedés",2,1200,null,null,null,{"$f":"IF(--ISNUMBER(SEARCH(tev.lista,A236)),MAX($G$1:G235)+1,\"\")","v":235},{"$f":"IFERROR(INDEX($A$2:$A$298,MATCH(ROWS($G$2:G236),$G$2:$G$298,0)),\"\")","v":"Sportszerkereskedés"}]
["Sütőipari termékek gyártása",3,2400,null,null,null,{"$f":"IF(--ISNUMBER(SEARCH(tev.lista,A237)),MAX($G$1:G236)+1,\"\")","v":236},{"$f":"IFERROR(INDEX($A$2:$A$298,MATCH(ROWS($G$2:G237),$G$2:$G$298,0)),\"\")","v":"Sütőipari termékek gyártása"}]
["Számítógépes hálózatok, egyéb gyengeáramú rendszerek szerelése",5,4200,null,null,null,{"$f":"IF(--ISNUMBER(SEARCH(tev.lista,A238)),MAX($G$1:G237)+1,\"\")","v":237},{"$f":"IFERROR(INDEX($A$2:$A$298,MATCH(ROWS($G$2:G238),$G$2:$G$298,0)),\"\")","v":"Számítógépes hálózatok, egyéb gyengeáramú rendszerek szerelése"}]
["Számítógép, irodatechnika kereskedelem",2,1200,null,null,null,{"$f":"IF(--ISNUMBER(SEARCH(tev.lista,A239)),MAX($G$1:G238)+1,\"\")","v":238},{"$f":"IFERROR(INDEX($A$2:$A$298,MATCH(ROWS($G$2:G239),$G$2:$G$298,0)),\"\")","v":"Számítógép, irodatechnika kereskedelem"}]
["Szaniter áruk gyártása",3,2400,null,null,null,{"$f":"IF(--ISNUMBER(SEARCH(tev.lista,A240)),MAX($G$1:G239)+1,\"\")","v":239},{"$f":"IFERROR(INDEX($A$2:$A$298,MATCH(ROWS($G$2:G240),$G$2:$G$298,0)),\"\")","v":"Szaniter áruk gyártása"}]
["Szaniter és kerámia áruk kereskedelme",4,1200,null,null,null,{"$f":"IF(--ISNUMBER(SEARCH(tev.lista,A241)),MAX($G$1:G240)+1,\"\")","v":240},{"$f":"IFERROR(INDEX($A$2:$A$298,MATCH(ROWS($G$2:G241),$G$2:$G$298,0)),\"\")","v":"Szaniter és kerámia áruk kereskedelme"}]
["Személyi használati tárgyak és háztartási eszközök javítása",4,1800,null,null,null,{"$f":"IF(--ISNUMBER(SEARCH(tev.lista,A242)),MAX($G$1:G241)+1,\"\")","v":241},{"$f":"IFERROR(INDEX($A$2:$A$298,MATCH(ROWS($G$2:G242),$G$2:$G$298,0)),\"\")","v":"Személyi használati tárgyak és háztartási eszközök javítása"}]
["Személyi használatú és háztartási cikkek kölcsönzése",2,1800,null,null,null,{"$f":"IF(--ISNUMBER(SEARCH(tev.lista,A243)),MAX($G$1:G242)+1,\"\")","v":242},{"$f":"IFERROR(INDEX($A$2:$A$298,MATCH(ROWS($G$2:G243),$G$2:$G$298,0)),\"\")","v":"Személyi használatú és háztartási cikkek kölcsönzése"}]
["Szépségszalon",4,1800,null,null,null,{"$f":"IF(--ISNUMBER(SEARCH(tev.lista,A244)),MAX($G$1:G243)+1,\"\")","v":243},{"$f":"IFERROR(INDEX($A$2:$A$298,MATCH(ROWS($G$2:G244),$G$2:$G$298,0)),\"\")","v":"Szépségszalon"}]
["Szerszám- és kisgép kereskedelem",2,1200,null,null,null,{"$f":"IF(--ISNUMBER(SEARCH(tev.lista,A245)),MAX($G$1:G244)+1,\"\")","v":244},{"$f":"IFERROR(INDEX($A$2:$A$298,MATCH(ROWS($G$2:G245),$G$2:$G$298,0)),\"\")","v":"Szerszám- és kisgép kereskedelem"}]
["Szerszámgépértékesítés és szerviz",4,1200,null,null,null,{"$f":"IF(--ISNUMBER(SEARCH(tev.lista,A246)),MAX($G$1:G245)+1,\"\")","v":245},{"$f":"IFERROR(INDEX($A$2:$A$298,MATCH(ROWS($G$2:G246),$G$2:$G$298,0)),\"\")","v":"Szerszámgépértékesítés és szerviz"}]
["Szerszámgépgyártás",3,2400,null,null,null,{"$f":"IF(--ISNUMBER(SEARCH(tev.lista,A247)),MAX($G$1:G246)+1,\"\")","v":246},{"$f":"IFERROR(INDEX($A$2:$A$298,MATCH(ROWS($G$2:G247),$G$2:$G$298,0)),\"\")","v":"Szerszámgépgyártás"}]
["Szesz- és szeszesitalgyártás",3,2400,null,null,null,{"$f":"IF(--ISNUMBER(SEARCH(tev.lista,A248)),MAX($G$1:G247)+1,\"\")","v":247},{"$f":"IFERROR(INDEX($A$2:$A$298,MATCH(ROWS($G$2:G248),$G$2:$G$298,0)),\"\")","v":"Szesz- és szeszesitalgyártás"}]
["Szigetelt vezeték és kábel gyártása",3,2400,null,null,null,{"$f":"IF(--ISNUMBER(SEARCH(tev.lista,A249)),MAX($G$1:G248)+1,\"\")","v":248},{"$f":"IFERROR(INDEX($A$2:$A$298,MATCH(ROWS($G$2:G249),$G$2:$G$298,0)),\"\")","v":"Szigetelt vezeték és kábel gyártása"}]
["Színház",1,1800,null,null,null,{"$f":"IF(--ISNUMBER(SEARCH(tev.lista,A250)),MAX($G$1:G249)+1,\"\")","v":249},{"$f":"IFERROR(INDEX($A$2:$A$298,MATCH(ROWS($G$2:G250),$G$2:$G$298,0)),\"\")","v":"Színház"}]
["Színpadtechnika, színpadok építése",5,4200,null,null,null,{"$f":"IF(--ISNUMBER(SEARCH(tev.lista,A251)),MAX($G$1:G250)+1,\"\")","v":250},{"$f":"IFERROR(INDEX($A$2:$A$298,MATCH(ROWS($G$2:G251),$G$2:$G$298,0)),\"\")","v":"Színpadtechnika, színpadok építése"}]
["Szintetikus mosószergyártás",4,2400,null,null,null,{"$f":"IF(--ISNUMBER(SEARCH(tev.lista,A252)),MAX($G$1:G251)+1,\"\")","v":251},{"$f":"IFERROR(INDEX($A$2:$A$298,MATCH(ROWS($G$2:G252),$G$2:$G$298,0)),\"\")","v":"Szintetikus mosószergyártás"}]
["Szolárium, szauna",4,1800,null,null,null,{"$f":"IF(--ISNUMBER(SEARCH(tev.lista,A253)),MAX($G$1:G252)+1,\"\")","v":252},{"$f":"IFERROR(INDEX($A$2:$A$298,MATCH(ROWS($G$2:G253),$G$2:$G$298,0)),\"\")","v":"Szolárium, szauna"}]
["Szórakoztató elektronika kereskedelem (TV, video, HIFI)",2,1200,null,null,null,{"$f":"IF(--ISNUMBER(SEARCH(tev.lista,A254)),MAX($G$1:G253)+1,\"\")","v":253},{"$f":"IFERROR(INDEX($A$2:$A$298,MATCH(ROWS($G$2:G254),$G$2:$G$298,0)),\"\")","v":"Szórakoztató elektronika kereskedelem (TV, video, HIFI)"}]
["Szórakoztató-, kulturális- és sporttevékenység",1,600,null,null,null,{"$f":"IF(--ISNUMBER(SEARCH(tev.lista,A255)),MAX($G$1:G254)+1,\"\")","v":254},{"$f":"IFERROR(INDEX($A$2:$A$298,MATCH(ROWS($G$2:G255),$G$2:$G$298,0)),\"\")","v":"Szórakoztató-, kulturális- és sporttevékenység"}]
["Szőnyegkereskedelem",2,1200,null,null,null,{"$f":"IF(--ISNUMBER(SEARCH(tev.lista,A256)),MAX($G$1:G255)+1,\"\")","v":255},{"$f":"IFERROR(INDEX($A$2:$A$298,MATCH(ROWS($G$2:G256),$G$2:$G$298,0)),\"\")","v":"Szőnyegkereskedelem"}]
["Szőnyegkészítés",3,2400,null,null,null,{"$f":"IF(--ISNUMBER(SEARCH(tev.lista,A257)),MAX($G$1:G256)+1,\"\")","v":256},{"$f":"IFERROR(INDEX($A$2:$A$298,MATCH(ROWS($G$2:G257),$G$2:$G$298,0)),\"\")","v":"Szőnyegkészítés"}]
["Szőrmecikkek gyártása",3,2400,null,null,null,{"$f":"IF(--ISNUMBER(SEARCH(tev.lista,A258)),MAX($G$1:G257)+1,\"\")","v":257},{"$f":"IFERROR(INDEX($A$2:$A$298,MATCH(ROWS($G$2:G258),$G$2:$G$298,0)),\"\")","v":"Szőrmecikkek gyártása"}]
["Szőrmekereskedelem",2,1200,null,null,null,{"$f":"IF(--ISNUMBER(SEARCH(tev.lista,A259)),MAX($G$1:G258)+1,\"\")","v":258},{"$f":"IFERROR(INDEX($A$2:$A$298,MATCH(ROWS($G$2:G259),$G$2:$G$298,0)),\"\")","v":"Szőrmekereskedelem"}]
["Szőrmekikészítés és festés",3,2400,null,null,null,{"$f":"IF(--ISNUMBER(SEARCH(tev.lista,A260)),MAX($G$1:G259)+1,\"\")","v":259},{"$f":"IFERROR(INDEX($A$2:$A$298,MATCH(ROWS($G$2:G260),$G$2:$G$298,0)),\"\")","v":"Szőrmekikészítés és festés"}]
["Tánciskola",1,600,null,null,null,{"$f":"IF(--ISNUMBER(SEARCH(tev.lista,A261)),MAX($G$1:G260)+1,\"\")","v":260},{"$f":"IFERROR(INDEX($A$2:$A$298,MATCH(ROWS($G$2:G261),$G$2:$G$298,0)),\"\")","v":"Tánciskola"}]
["Tejtermék kereskedelem",2,1200,null,null,null,{"$f":"IF(--ISNUMBER(SEARCH(tev.lista,A262)),MAX($G$1:G261)+1,\"\")","v":261},{"$f":"IFERROR(INDEX($A$2:$A$298,MATCH(ROWS($G$2:G262),$G$2:$G$298,0)),\"\")","v":"Tejtermék kereskedelem"}]
["Tejtermékek gyártása",3,2400,null,null,null,{"$f":"IF(--ISNUMBER(SEARCH(tev.lista,A263)),MAX($G$1:G262)+1,\"\")","v":262},{"$f":"IFERROR(INDEX($A$2:$A$298,MATCH(ROWS($G$2:G263),$G$2:$G$298,0)),\"\")","v":"Tejtermékek gyártása"}]
["Telekommunikációs termékek kiskereskedelme",2,1200,null,null,null,{"$f":"IF(--ISNUMBER(SEARCH(tev.lista,A264)),MAX($G$1:G263)+1,\"\")","v":263},{"$f":"IFERROR(INDEX($A$2:$A$298,MATCH(ROWS($G$2:G264),$G$2:$G$298,0)),\"\")","v":"Telekommunikációs termékek kiskereskedelme"}]
["Telepíthető faházak és elemek gyártása",4,2400,null,null,null,{"$f":"IF(--ISNUMBER(SEARCH(tev.lista,A265)),MAX($G$1:G264)+1,\"\")","v":264},{"$f":"IFERROR(INDEX($A$2:$A$298,MATCH(ROWS($G$2:G265),$G$2:$G$298,0)),\"\")","v":"Telepíthető faházak és elemek gyártása"}]
["Tésztagyártás",3,2400,null,null,null,{"$f":"IF(--ISNUMBER(SEARCH(tev.lista,A266)),MAX($G$1:G265)+1,\"\")","v":265},{"$f":"IFERROR(INDEX($A$2:$A$298,MATCH(ROWS($G$2:G266),$G$2:$G$298,0)),\"\")","v":"Tésztagyártás"}]
["Tetőfedés",5,4200,null,null,null,{"$f":"IF(--ISNUMBER(SEARCH(tev.lista,A267)),MAX($G$1:G266)+1,\"\")","v":266},{"$f":"IFERROR(INDEX($A$2:$A$298,MATCH(ROWS($G$2:G267),$G$2:$G$298,0)),\"\")","v":"Tetőfedés"}]
["Textil rövidáru, méteráru, fonal kereskedelem",2,1200,null,null,null,{"$f":"IF(--ISNUMBER(SEARCH(tev.lista,A268)),MAX($G$1:G267)+1,\"\")","v":267},{"$f":"IFERROR(INDEX($A$2:$A$298,MATCH(ROWS($G$2:G268),$G$2:$G$298,0)),\"\")","v":"Textil rövidáru, méteráru, fonal kereskedelem"}]
["Textil ruházat gyártása tűzveszélyes anyagok felhasználása nélkül",3,2400,null,null,null,{"$f":"IF(--ISNUMBER(SEARCH(tev.lista,A269)),MAX($G$1:G268)+1,\"\")","v":268},{"$f":"IFERROR(INDEX($A$2:$A$298,MATCH(ROWS($G$2:G269),$G$2:$G$298,0)),\"\")","v":"Textil ruházat gyártása tűzveszélyes anyagok felhasználása nélkül"}]
["Textil-, ruházati, bőripari gépgyártás",3,2400,null,null,null,{"$f":"IF(--ISNUMBER(SEARCH(tev.lista,A270)),MAX($G$1:G269)+1,\"\")","v":269},{"$f":"IFERROR(INDEX($A$2:$A$298,MATCH(ROWS($G$2:G270),$G$2:$G$298,0)),\"\")","v":"Textil-, ruházati, bőripari gépgyártás"}]
["Textíliák gyártása",3,2400,null,null,null,{"$f":"IF(--ISNUMBER(SEARCH(tev.lista,A271)),MAX($G$1:G270)+1,\"\")","v":270},{"$f":"IFERROR(INDEX($A$2:$A$298,MATCH(ROWS($G$2:G271),$G$2:$G$298,0)),\"\")","v":"Textíliák gyártása"}]
["Textíliák kikészítése, festése",3,2400,null,null,null,{"$f":"IF(--ISNUMBER(SEARCH(tev.lista,A272)),MAX($G$1:G271)+1,\"\")","v":271},{"$f":"IFERROR(INDEX($A$2:$A$298,MATCH(ROWS($G$2:G272),$G$2:$G$298,0)),\"\")","v":"Textíliák kikészítése, festése"}]
["Textíliák vízhatlanítása",3,2400,null,null,null,{"$f":"IF(--ISNUMBER(SEARCH(tev.lista,A273)),MAX($G$1:G272)+1,\"\")","v":272},{"$f":"IFERROR(INDEX($A$2:$A$298,MATCH(ROWS($G$2:G273),$G$2:$G$298,0)),\"\")","v":"Textíliák vízhatlanítása"}]
["Tisztító- és testápolószergyártás",4,2400,null,null,null,{"$f":"IF(--ISNUMBER(SEARCH(tev.lista,A274)),MAX($G$1:G273)+1,\"\")","v":273},{"$f":"IFERROR(INDEX($A$2:$A$298,MATCH(ROWS($G$2:G274),$G$2:$G$298,0)),\"\")","v":"Tisztító- és testápolószergyártás"}]
["Totó-lottó",4,1800,null,null,null,{"$f":"IF(--ISNUMBER(SEARCH(tev.lista,A275)),MAX($G$1:G274)+1,\"\")","v":274},{"$f":"IFERROR(INDEX($A$2:$A$298,MATCH(ROWS($G$2:G275),$G$2:$G$298,0)),\"\")","v":"Totó-lottó"}]
["Tűzálló kerámiatermékek gyártása",3,2400,null,null,null,{"$f":"IF(--ISNUMBER(SEARCH(tev.lista,A276)),MAX($G$1:G275)+1,\"\")","v":275},{"$f":"IFERROR(INDEX($A$2:$A$298,MATCH(ROWS($G$2:G276),$G$2:$G$298,0)),\"\")","v":"Tűzálló kerámiatermékek gyártása"}]
["Tüzelőanyag kereskedelem (HTO nélkül)",4,1200,null,null,null,{"$f":"IF(--ISNUMBER(SEARCH(tev.lista,A277)),MAX($G$1:G276)+1,\"\")","v":276},{"$f":"IFERROR(INDEX($A$2:$A$298,MATCH(ROWS($G$2:G277),$G$2:$G$298,0)),\"\")","v":"Tüzelőanyag kereskedelem (HTO nélkül)"}]
["Uszodatechnika telepítése, szerelése",5,4200,null,null,null,{"$f":"IF(--ISNUMBER(SEARCH(tev.lista,A278)),MAX($G$1:G277)+1,\"\")","v":277},{"$f":"IFERROR(INDEX($A$2:$A$298,MATCH(ROWS($G$2:G278),$G$2:$G$298,0)),\"\")","v":"Uszodatechnika telepítése, szerelése"}]
["Üdítőital- és ásványvíz kereskedelem",2,1200,null,null,null,{"$f":"IF(--ISNUMBER(SEARCH(tev.lista,A279)),MAX($G$1:G278)+1,\"\")","v":278},{"$f":"IFERROR(INDEX($A$2:$A$298,MATCH(ROWS($G$2:G279),$G$2:$G$298,0)),\"\")","v":"Üdítőital- és ásványvíz kereskedelem"}]
["Üdítőitalok gyártása",3,2400,null,null,null,{"$f":"IF(--ISNUMBER(SEARCH(tev.lista,A280)),MAX($G$1:G279)+1,\"\")","v":279},{"$f":"IFERROR(INDEX($A$2:$A$298,MATCH(ROWS($G$2:G280),$G$2:$G$298,0)),\"\")","v":"Üdítőitalok gyártása"}]
["Üveg- és porcelán tömegáru kereskedelem",2,1200,null,null,null,{"$f":"IF(--ISNUMBER(SEARCH(tev.lista,A281)),MAX($G$1:G280)+1,\"\")","v":280},{"$f":"IFERROR(INDEX($A$2:$A$298,MATCH(ROWS($G$2:G281),$G$2:$G$298,0)),\"\")","v":"Üveg- és porcelán tömegáru kereskedelem"}]
["Üvegezés",4,1800,null,null,null,{"$f":"IF(--ISNUMBER(SEARCH(tev.lista,A282)),MAX($G$1:G281)+1,\"\")","v":281},{"$f":"IFERROR(INDEX($A$2:$A$298,MATCH(ROWS($G$2:G282),$G$2:$G$298,0)),\"\")","v":"Üvegezés"}]
["Üveggyártás",3,2400,null,null,null,{"$f":"IF(--ISNUMBER(SEARCH(tev.lista,A283)),MAX($G$1:G282)+1,\"\")","v":282},{"$f":"IFERROR(INDEX($A$2:$A$298,MATCH(ROWS($G$2:G283),$G$2:$G$298,0)),\"\")","v":"Üveggyártás"}]
["Üzletházak (bevásárló központok)",2,1200,null,null,null,{"$f":"IF(--ISNUMBER(SEARCH(tev.lista,A284)),MAX($G$1:G283)+1,\"\")","v":283},{"$f":"IFERROR(INDEX($A$2:$A$298,MATCH(ROWS($G$2:G284),$G$2:$G$298,0)),\"\")","v":"Üzletházak (bevásárló központok)"}]
["Vas-, műszaki-, üvegáru kereskedelem",2,1200,null,null,null,{"$f":"IF(--ISNUMBER(SEARCH(tev.lista,A285)),MAX($G$1:G284)+1,\"\")","v":284},{"$f":"IFERROR(INDEX($A$2:$A$298,MATCH(ROWS($G$2:G285),$G$2:$G$298,0)),\"\")","v":"Vas-, műszaki-, üvegáru kereskedelem"}]
["Vegyi alapanyagok és termékek gyártása",4,2400,null,null,null,{"$f":"IF(--ISNUMBER(SEARCH(tev.lista,A286)),MAX($G$1:G285)+1,\"\")","v":285},{"$f":"IFERROR(INDEX($A$2:$A$298,MATCH(ROWS($G$2:G286),$G$2:$G$298,0)),\"\")","v":"Vegyi alapanyagok és termékek gyártása"}]
["Vegyi áru kereskedelem",4,1200,null,null,null,{"$f":"IF(--ISNUMBER(SEARCH(tev.lista,A287)),MAX($G$1:G286)+1,\"\")","v":286},{"$f":"IFERROR(INDEX($A$2:$A$298,MATCH(ROWS($G$2:G287),$G$2:$G$298,0)),\"\")","v":"Vegyi áru kereskedelem"}]
["Vegyi szálak gyártása",4,2400,null,null,null,{"$f":"IF(--ISNUMBER(SEARCH(tev.lista,A288)),MAX($G$1:G287)+1,\"\")","v":287},{"$f":"IFERROR(INDEX($A$2:$A$298,MATCH(ROWS($G$2:G288),$G$2:$G$298,0)),\"\")","v":"Vegyi szálak gyártása"}]
["Vetőmagkereskedés",2,1200,null,null,null,{"$f":"IF(--ISNUMBER(SEARCH(tev.lista,A289)),MAX($G$1:G288)+1,\"\")","v":288},{"$f":"IFERROR(INDEX($A$2:$A$298,MATCH(ROWS($G$2:G289),$G$2:$G$298,0)),\"\")","v":"Vetőmagkereskedés"}]
["Videokazetta, CD, hanglemez kereskedés",2,1200,null,null,null,{"$f":"IF(--ISNUMBER(SEARCH(tev.lista,A290)),MAX($G$1:G289)+1,\"\")","v":289},{"$f":"IFERROR(INDEX($A$2:$A$298,MATCH(ROWS($G$2:G290),$G$2:$G$298,0)),\"\")","v":"Videokazetta, CD, hanglemez kereskedés"}]
["Világítástechnikai cikkek kereskedelme",2,1200,null,null,null,{"$f":"IF(--ISNUMBER(SEARCH(tev.lista,A291)),MAX($G$1:G290)+1,\"\")","v":290},{"$f":"IFERROR(INDEX($A$2:$A$298,MATCH(ROWS($G$2:G291),$G$2:$G$298,0)),\"\")","v":"Világítástechnikai cikkek kereskedelme"}]
["Villamos és híradástechnikai közszükségleti cikkek javítása",4,1800,null,null,null,{"$f":"IF(--ISNUMBER(SEARCH(tev.lista,A292)),MAX($G$1:G291)+1,\"\")","v":291},{"$f":"IFERROR(INDEX($A$2:$A$298,MATCH(ROWS($G$2:G292),$G$2:$G$298,0)),\"\")","v":"Villamos és híradástechnikai közszükségleti cikkek javítása"}]
["Villamos és híradástechnikai termékek kereskedelme",2,1200,null,null,null,{"$f":"IF(--ISNUMBER(SEARCH(tev.lista,A293)),MAX($G$1:G292)+1,\"\")","v":292},{"$f":"IFERROR(INDEX($A$2:$A$298,MATCH(ROWS($G$2:G293),$G$2:$G$298,0)),\"\")","v":"Villamos és híradástechnikai termékek kereskedelme"}]
["Villamos motorok, áramfejlesztők, transzformátorok gyártása",3,2400,null,null,null,{"$f":"IF(--ISNUMBER(SEARCH(tev.lista,A294)),MAX($G$1:G293)+1,\"\")","v":293},{"$f":"IFERROR(INDEX($A$2:$A$298,MATCH(ROWS($G$2:G294),$G$2:$G$298,0)),\"\")","v":"Villamos motorok, áramfejlesztők, transzformátorok gyártása"}]
["Villamos szerelvények, huzalok, kábelek kereskedelme",2,1200,null,null,null,{"$f":"IF(--ISNUMBER(SEARCH(tev.lista,A295)),MAX($G$1:G294)+1,\"\")","v":294},{"$f":"IFERROR(INDEX($A$2:$A$298,MATCH(ROWS($G$2:G295),$G$2:$G$298,0)),\"\")","v":"Villamos szerelvények, huzalok, kábelek kereskedelme"}]
["Villamosipari gépek és készülékek gyártása",3,2400,null,null,null,{"$f":"IF(--ISNUMBER(SEARCH(tev.lista,A296)),MAX($G$1:G295)+1,\"\")","v":295},{"$f":"IFERROR(INDEX($A$2:$A$298,MATCH(ROWS($G$2:G296),$G$2:$G$298,0)),\"\")","v":"Villamosipari gépek és készülékek gyártása"}]
["Virág, dísznövény árusítás",2,1200,null,null,null,{"$f":"IF(--ISNUMBER(SEARCH(tev.lista,A297)),MAX($G$1:G296)+1,\"\")","v":296},{"$f":"IFERROR(INDEX($A$2:$A$298,MATCH(ROWS($G$2:G297),$G$2:$G$298,0)),\"\")","v":"Virág, dísznövény árusítás"}]
["Zöldség-gyümölcs kereskedelem",2,1200,null,null,null,{"$f":"IF(--ISNUMBER(SEARCH(tev.lista,A298)),MAX($G$1:G297)+1,\"\")","v":297},{"$f":"IFERROR(INDEX($A$2:$A$298,MATCH(ROWS($G$2:G298),$G$2:$G$298,0)),\"\")","v":"Zöldség-gyümölcs kereskedelem"}]