{"text_format":"1","workbook":"xlsx","n_sheets":5,"sheets":["Biztosítási termékismertető","Adatközlő","Ajánlat1","Ajánlat2","Tevékenységi lista"],"not_rendered":{"charts":0,"images":15,"macros":1,"external_links":0,"defined_names":75,"comments":0,"pivot_tables":0},"unopened":[],"bounds":{"document_bytes":16777216,"sheet_cells":100000,"rows_first":2000,"rows_last":500,"rows_between":2000,"halvings":0,"cell_chars":16384,"cell_head_chars":4096},"cells_cut":0,"cells_raw":0,"read":"whole","date_system":"1900"}

{"sheet":"Biztosítási termékismertető","index":0,"n_rows":0,"n_cols":0,"rows_kept":0,"cut":false,"hidden":false,"merged":[]}

{"sheet":"Adatközlő","index":1,"n_rows":131,"n_cols":14,"rows_kept":131,"cut":false,"hidden":false,"merged":[[3,3,4,3],[1,1,1,3],[3,1,4,1],[3,2,4,2],[3,5,3,6]]}
[null,"Szakág kereső: \n",""]
[null,"Adatközlő",null,null,null,null,null,null,null,null,null,null,null,1]
[null,null,"",null,null,null,null,null,null,null,null,"Volumenengedmény"]
[null,"Biztosított személyek száma","Szakág",null,null,"Limit",null,null,null,null,null,"fő","%"]
[null,null,null,null,null,"5/15","10/20",null,null,null,null,1,1]
[{"$f":"IF(B6>0,COUNTIF($I$6:I6,1),\"\")","v":""},null,"addiktológia (szenvedélybetegségek orvoslása)",null,null,13500,16000,{"$f":"B6*IF(Ajánlat1!$J$139=2,Adatközlő!G6,Adatközlő!F6)","v":0},{"$f":"IF(B6>0,1,\"\")","v":""},null,null,2,0.94]
[{"$f":"IF(B7>0,COUNTIF($I$6:I7,1),\"\")","v":""},null,"egészségbiztosítás",null,null,13500,16000,{"$f":"B7*IF(Ajánlat1!$J$139=2,Adatközlő!G7,Adatközlő!F7)","v":0},{"$f":"IF(B7>0,1,\"\")","v":""},null,null,3,0.92]
[{"$f":"IF(B8>0,COUNTIF($I$6:I8,1),\"\")","v":""},null,"foniátria (a beszédhangok képzési zavarának gyógyítása)",null,null,13500,16000,{"$f":"B8*IF(Ajánlat1!$J$139=2,Adatközlő!G8,Adatközlő!F8)","v":0},"",null,null,4,0.91]
[{"$f":"IF(B9>0,COUNTIF($I$6:I9,1),\"\")","v":""},null,"honvéd / katasztrófa orvostan",null,null,13500,16000,{"$f":"B9*IF(Ajánlat1!$J$139=2,Adatközlő!G9,Adatközlő!F9)","v":0},"",null,null,5,0.9]
[{"$f":"IF(B10>0,COUNTIF($I$6:I10,1),\"\")","v":""},null,"igazságügyi orvostan",null,null,13500,16000,{"$f":"B10*IF(Ajánlat1!$J$139=2,Adatközlő!G10,Adatközlő!F10)","v":0},"",null,null,6,0.88]
[{"$f":"IF(B11>0,COUNTIF($I$6:I11,1),\"\")","v":""},null,"igazságügyi elmeorvostan",null,null,13500,16000,{"$f":"B11*IF(Ajánlat1!$J$139=2,Adatközlő!G11,Adatközlő!F11)","v":0},"",null,null,7,0.86]
[{"$f":"IF(B12>0,COUNTIF($I$6:I12,1),\"\")","v":""},null,"immunológia",null,null,13500,16000,{"$f":"B12*IF(Ajánlat1!$J$139=2,Adatközlő!G12,Adatközlő!F12)","v":0},"",null,null,8,0.84]
[{"$f":"IF(B13>0,COUNTIF($I$6:I13,1),\"\")","v":""},null,"klinikai laboratóriumi vizsgálatok",null,null,13500,16000,{"$f":"B13*IF(Ajánlat1!$J$139=2,Adatközlő!G13,Adatközlő!F13)","v":0},"",null,null,9,0.82000000000000006]
[{"$f":"IF(B14>0,COUNTIF($I$6:I14,1),\"\")","v":""},null,"klinikai genetika",null,null,13500,16000,{"$f":"B14*IF(Ajánlat1!$J$139=2,Adatközlő!G14,Adatközlő!F14)","v":0},"",null,null,10,0.8]
[{"$f":"IF(B15>0,COUNTIF($I$6:I15,1),\"\")","v":""},null,"klinikai szakpszichológia (nem orvos)",null,null,13500,16000,{"$f":"B15*IF(Ajánlat1!$J$139=2,Adatközlő!G15,Adatközlő!F15)","v":0},"",null,null,11,0.79]
[{"$f":"IF(B16>0,COUNTIF($I$6:I16,1),\"\")","v":""},null,"kórbonctan-kórszövettan",null,null,13500,16000,{"$f":"B16*IF(Ajánlat1!$J$139=2,Adatközlő!G16,Adatközlő!F16)","v":0},"",null,null,12,0.79]
[{"$f":"IF(B17>0,COUNTIF($I$6:I17,1),\"\")","v":""},null,"laboratóriumi haematológia",null,null,13500,16000,{"$f":"B17*IF(Ajánlat1!$J$139=2,Adatközlő!G17,Adatközlő!F17)","v":0},"",null,null,13,0.78]
[{"$f":"IF(B18>0,COUNTIF($I$6:I18,1),\"\")","v":""},null,"neuropatológia (idegkórtan)",null,null,13500,16000,{"$f":"B18*IF(Ajánlat1!$J$139=2,Adatközlő!G18,Adatközlő!F18)","v":0},"",null,null,14,0.77]
[{"$f":"IF(B19>0,COUNTIF($I$6:I19,1),\"\")","v":""},null,"neurológia (ideggyógyászat, gyermek és felnőtt)",null,null,13500,16000,{"$f":"B19*IF(Ajánlat1!$J$139=2,Adatközlő!G19,Adatközlő!F19)","v":0},"",null,null,15,0.77]
[{"$f":"IF(B20>0,COUNTIF($I$6:I20,1),\"\")","v":""},null,"molekuláris genetikai diagnosztika",null,null,13500,16000,{"$f":"B20*IF(Ajánlat1!$J$139=2,Adatközlő!G20,Adatközlő!F20)","v":0},"",null,null,16,0.76]
[{"$f":"IF(B21>0,COUNTIF($I$6:I21,1),\"\")","v":""},null,"orvosi mikrobiológia",null,null,13500,16000,{"$f":"B21*IF(Ajánlat1!$J$139=2,Adatközlő!G21,Adatközlő!F21)","v":0},"",null,null,17,0.75]
[{"$f":"IF(B22>0,COUNTIF($I$6:I22,1),\"\")","v":""},null,"orvosi laboratóriumi diagnosztika",null,null,13500,16000,{"$f":"B22*IF(Ajánlat1!$J$139=2,Adatközlő!G22,Adatközlő!F22)","v":0},"",null,null,18,0.75]
[{"$f":"IF(B23>0,COUNTIF($I$6:I23,1),\"\")","v":""},null,"sugárbiológia, sugár-egészségügy",null,null,13500,16000,{"$f":"B23*IF(Ajánlat1!$J$139=2,Adatközlő!G23,Adatközlő!F23)","v":0},"",null,null,19,0.75]
[{"$f":"IF(B24>0,COUNTIF($I$6:I24,1),\"\")","v":""},null,"társadalom-orvostan",null,null,13500,16000,{"$f":"B24*IF(Ajánlat1!$J$139=2,Adatközlő!G24,Adatközlő!F24)","v":0},"",null,null,20,0.75]
[{"$f":"IF(B25>0,COUNTIF($I$6:I25,1),\"\")","v":""},null,"trópusi betegségek orvoslása",null,null,13500,16000,{"$f":"B25*IF(Ajánlat1!$J$139=2,Adatközlő!G25,Adatközlő!F25)","v":0},""]
[null,"2. csoport:"]
[{"$f":"IF(B27>0,COUNTIF($I$6:I27,1),\"\")","v":""},null,"allergologia",null,null,19000,23500,{"$f":"B27*IF(Ajánlat1!$J$139=2,Adatközlő!G27,Adatközlő!F27)","v":0},"",null,"Orvos van?"]
[{"$f":"IF(B28>0,COUNTIF($I$6:I28,1),\"\")","v":""},null,"audiológia (hallástan)",null,null,19000,23500,{"$f":"B28*IF(Ajánlat1!$J$139=2,Adatközlő!G28,Adatközlő!F28)","v":0},"",null,{"$f":"IF(OR(SUM(I6:I78)>0,SUM(B128:B129)>0),1,0)","v":0}]
[{"$f":"IF(B29>0,COUNTIF($I$6:I29,1),\"\")","v":""},null,"endokrinológia (hormonrendszer orvoslása)",null,null,19000,23500,{"$f":"B29*IF(Ajánlat1!$J$139=2,Adatközlő!G29,Adatközlő!F29)","v":0},""]
[{"$f":"IF(B30>0,COUNTIF($I$6:I30,1),\"\")","v":""},null,"fertőző betegségek orvoslása",null,null,19000,23500,{"$f":"B30*IF(Ajánlat1!$J$139=2,Adatközlő!G30,Adatközlő!F30)","v":0},""]
{"$rows_left_out":102}
{"sheet":"Ajánlat1","index":2,"n_rows":189,"n_cols":51,"rows_kept":189,"cut":false,"hidden":false,"merged":[[33,35,33,36],[34,35,34,36],[45,35,45,37],[35,35,35,36],[36,35,36,36],[37,35,37,36],[38,35,38,36],[39,35,39,36],[40,35,40,36],[41,35,41,36],[42,35,42,36],[43,35,43,36],[44,35,44,36],[128,36,128,48],[100,31,100,35],[90,31,90,35],[9,5,9,9],[9,36,9,49],[10,6,10,8],[16,22,16,32],[155,18,155,21],[140,18,140,21],[141,18,141,21],[142,18,142,21],[143,18,143,21],[144,18,144,21],[35,42,35,45],[36,42,36,45],[42,42,42,45],[43,42,43,45],[37,42,37,45],[38,42,38,45],[39,42,39,45],[40,42,40,45],[41,42,41,45],[10,40,10,49],[74,10,74,17],[156,18,156,21],[157,18,157,21],[158,18,158,21],[150,18,150,21],[151,18,151,21],[152,18,152,21],[153,18,153,21],[154,18,154,21],[145,18,145,21],[146,18,146,21],[147,18,147,21],[148,18,148,21],[149,18,149,21],[6,1,6,7],[14,11,14,49],[16,6,16,18],[52,9,52,20],[52,41,52,45],[50,3,50,6],[50,9,50,20],[50,41,50,45],[48,3,48,6],[48,9,48,20],[48,41,48,45],[9,16,9,29],[10,16,10,21],[22,23,22,37],[22,8,22,19],[44,42,44,45],[27,42,27,45],[28,42,28,45],[25,35,25,36],[26,35,26,36],[27,35,27,36],[28,35,28,36],[29,35,29,36],[30,35,30,36],[56,3,56,6],[56,9,56,20],[56,41,56,45],[48,24,48,37],[50,24,50,37],[54,3,54,6],[54,9,54,20],[7,1,7,34],[70,10,70,14],[68,10,68,14],[54,41,54,45],[11,6,11,15],[11,41,11,49],[19,23,19,37],[25,42,25,45],[26,42,26,45],[24,42,24,45],[29,42,29,45],[34,42,34,45],[16,36,16,49],[22,41,22,45],[19,41,19,45],[31,35,31,36],[32,35,32,36],[179,3,179,7],[179,8,179,10],[179,11,179,13],[19,2,19,5],[19,8,19,19],[128,19,128,31],[22,2,22,5],[52,3,52,6],[92,31,92,35],[96,31,96,35],[127,4,127,10],[98,31,98,35],[127,12,127,15],[94,31,94,35],[139,18,139,21],[162,18,162,21],[66,10,66,42],[52,24,52,37],[54,24,54,37],[56,24,56,37],[30,42,30,45],[31,42,31,45],[32,42,32,45],[33,42,33,45]]}
[]
[]
[]
[]
[null,null,"Kötvényszám:"]
[null,null,null,null,null,null,null,null,null,null,null,null,null,null,null,null,null,null,null,null,null,null,null,null,null,null,null,null,null,null,null,null,null,null,null,null,null,null,null,null,null,null,null,null,null,null,null,null,null,null,"UNION - Járóbeteg-szakellátás egészségügyi felelősségbiztosítás"]
[null,null,null,null,null,null,null,null,null,null,null,null,null,null,null,null,null,null,null,null,null,null,null,null,null,null,null,null,null,null,null,null,null,null,null,null,null,null,null,null,null,null,null,null,null,null,null,null,null,null,"Biztosítási Ajánlat"]
[null,"FIGYELEMFELHÍVÁS!\n1. CSAK A BIZTOSÍTOTT SAJÁT NEVÉBEN NYÚJTOTT MAGÁN EGÉSZSÉGÜGYI SZOLGÁLTATÁSA BIZTOSÍTHATÓ, ALKALMAZOTTI, VAGY (AL)VÁLLALKOZÓI JOGVISZONYÁRA A FEDEZET NEM TERJED KI!\n2. FEKVŐBETEG ELLÁTÁSI TEVÉKENYSÉG NEM BIZTOSÍTHATÓ!\n3. HASZONÁLLAT ORVOSLÁSA NEM BIZTOSÍTHATÓ!"]
[]
[null,null,"Módozat",null,null,7810,null,null,null,null,null,"Üzletkötő neve:",null,null,null,null,null,null,null,null,null,null,null,null,null,null,null,null,null,null,null,"Üzletkötő kódja:"]
[null,null,"Átdolgozás:",null,null,null,"nem",null,null,null,null,null,null,null,null,"Előzmény kötv.száma:",null,null,null,null,null,null,null,"Adóigazgatási szám: 1049 1984-2-44",null,null,null,null,null,null,null,null,null,null,null,null,null,null,null,"Ajánlat azonosító:"]
[null,null,"Készítette:",null,null,null,null,null,null,null,null,null,null,null,null,null,null,{"$f":"CONCATENATE(\"    Tel: \",IFERROR(VLOOKUP(G12,D183:K196,7,FALSE),\"\"),\"     E-mail: \",IFERROR(VLOOKUP(G12,D183:K196,4,FALSE),\"\"))","v":"    Tel:      E-mail: "},null,null,null,null,null,null,null,null,null,null,null,null,null,null,null,null,null,null,null,null,"Hiv.szám:"]
[]
[]
[null,null,"Szerződő / Biztosított neve:"]
[]
[null,null,"Adószáma:",null,null,null,null,null,null,null,null,null,null,null,null,null,null,null,null,null,null,"Tel:",null,null,null,null,null,null,null,null,null,null,null,null,null,"E-mail:"]
[]
[null,null,"Székhelye:"]
[null,null,null,null,null,null,"ir.sz.",null,null,null,null,null,null,null,null,null,null,null,null,null,"helység",null,null,null,null,null,null,null,null,null,null,null,null,null,null,null,null,null,"közterület",null,null,null,null,null,null,null,"hsz.em.ajtó"]
[]
[null,null,"Levelezési Címe:"]
[null,null,null,null,null,null,"ir.sz.",null,null,null,null,null,null,null,null,null,null,null,null,null,"helység",null,null,null,null,null,null,null,null,null,null,null,null,null,null,null,null,null,"közterület",null,null,null,null,null,null,null,"hsz.em.ajtó"]
[]
[null,null,"Biztosított szakágak:",null,null,null,null,null,null,null,"",null,null,null,null,null,null,null,null,null,null,null,null,null,null,null,null,null,null,null,null,null,null,null,null,"Létszám",null,null,null,null,null,null,"Díj"]
[null,null,null,null,{"$f":"VLOOKUP(1,Adatközlő!$A$6:$D$130,3,FALSE)","v":{"$error":"#N/A"}},null,null,null,null,null,null,null,null,null,null,null,null,null,null,null,null,null,null,null,null,null,null,null,null,null,null,null,null,null,null,{"$f":"IFERROR(IF(VLOOKUP(1,Adatközlő!$A$6:$D$130,2,FALSE)=0,\"\",VLOOKUP(1,Adatközlő!$A$6:$D$130,2,FALSE)),0)","v":0},null,null,null,null,null,null,{"$f":"IFERROR(IF(VLOOKUP(1,Adatközlő!$A$6:$H$130,8,FALSE)=0,\"\",IF(AND(summavalodidij<10000,J139=1),10000,IF(AND(J139=2,summavalodidij<13000),13000,VLOOKUP(1,Adatközlő!$A$6:$H$130,8,FALSE)))),0)","v":0}]
[null,null,null,null,{"$f":"VLOOKUP(2,Adatközlő!$A$6:$D$130,3,FALSE)","v":{"$error":"#N/A"}},null,null,null,null,null,null,null,null,null,null,null,null,null,null,null,null,null,null,null,null,null,null,null,null,null,null,null,null,null,null,{"$f":"IFERROR(IF(VLOOKUP(2,Adatközlő!$A$6:$D$130,2,FALSE)=0,\"\",VLOOKUP(2,Adatközlő!$A$6:$D$130,2,FALSE)),0)","v":0},null,null,null,null,null,null,{"$f":"IFERROR(IF(VLOOKUP(2,Adatközlő!$A$6:$H$130,8,FALSE)=0,\"\",VLOOKUP(2,Adatközlő!$A$6:$H$130,8,FALSE)),0)","v":0}]
[null,null,null,null,{"$f":"VLOOKUP(3,Adatközlő!$A$6:$D$130,3,FALSE)","v":{"$error":"#N/A"}},null,null,null,null,null,null,null,null,null,null,null,null,null,null,null,null,null,null,null,null,null,null,null,null,null,null,null,null,null,null,{"$f":"IFERROR(IF(VLOOKUP(3,Adatközlő!$A$6:$D$130,2,FALSE)=0,\"\",VLOOKUP(3,Adatközlő!$A$6:$D$130,2,FALSE)),0)","v":0},null,null,null,null,null,null,{"$f":"IFERROR(IF(VLOOKUP(3,Adatközlő!$A$6:$H$130,8,FALSE)=0,\"\",VLOOKUP(3,Adatközlő!$A$6:$H$130,8,FALSE)),0)","v":0}]
[null,null,null,null,{"$f":"VLOOKUP(4,Adatközlő!$A$6:$D$130,3,FALSE)","v":{"$error":"#N/A"}},null,null,null,null,null,null,null,null,null,null,null,null,null,null,null,null,null,null,null,null,null,null,null,null,null,null,null,null,null,null,{"$f":"IFERROR(IF(VLOOKUP(4,Adatközlő!$A$6:$D$130,2,FALSE)=0,\"\",VLOOKUP(4,Adatközlő!$A$6:$D$130,2,FALSE)),0)","v":0},null,null,null,null,null,null,{"$f":"IFERROR(IF(VLOOKUP(4,Adatközlő!$A$6:$H$130,8,FALSE)=0,\"\",VLOOKUP(4,Adatközlő!$A$6:$H$130,8,FALSE)),0)","v":0}]
[null,null,null,null,{"$f":"VLOOKUP(5,Adatközlő!$A$6:$D$130,3,FALSE)","v":{"$error":"#N/A"}},null,null,null,null,null,null,null,null,null,null,null,null,null,null,null,null,null,null,null,null,null,null,null,null,null,null,null,null,null,null,{"$f":"IFERROR(IF(VLOOKUP(5,Adatközlő!$A$6:$D$130,2,FALSE)=0,\"\",VLOOKUP(5,Adatközlő!$A$6:$D$130,2,FALSE)),0)","v":0},null,null,null,null,null,null,{"$f":"IFERROR(IF(VLOOKUP(5,Adatközlő!$A$6:$H$130,8,FALSE)=0,\"\",VLOOKUP(5,Adatközlő!$A$6:$H$130,8,FALSE)),0)","v":0}]
{"$rows_left_out":160}
{"sheet":"Ajánlat2","index":3,"n_rows":88,"n_cols":12,"rows_kept":88,"cut":false,"hidden":false,"merged":[[32,1,32,9],[87,3,87,8],[86,3,86,8],[20,3,20,5],[23,3,23,5],[25,3,25,5],[69,1,69,9],[66,1,66,9],[33,1,33,9],[41,1,41,9],[42,1,42,9],[39,1,39,9],[35,1,35,9],[62,1,62,9],[48,1,48,9],[52,1,52,9],[37,11,37,17],[64,1,64,9],[77,2,77,9],[78,2,78,9],[73,1,73,9],[75,2,75,9],[76,2,76,9],[85,1,85,2],[34,1,34,9],[46,1,46,9],[59,1,59,9],[50,1,50,9],[37,1,37,9],[81,2,81,9],[54,1,54,9],[57,1,57,9],[83,2,83,9],[53,1,53,9]]}
[null,"Kis és középvállallatok felelősségbiztosítása",null,null,null,null,null,null,null,null,null,"SZÍNKÓDOK, MAGYARÁZATOK"]
[null,"Biztosított kockázatok:","Általános felelősségbiztosítás"]
[null,null,"valamint:"]
[null,"Szolgáltatói felelősségbiztosítás",null,null,null,null,null,null,null,null,null,"innentől választható / legördülő menü"]
[null,"Szolgáltatói felelősség kiterjesztve a szolgáltatás tárgyára (egyedi záradék szerint)",null,null,null,null,null,null,null,null,null,"csak akkor választható, ha a szolg fel korábban kiválasztásra került"]
[null,"Szolgáltatói felelősség kiterjesztve rakodási tevékenységre (egyedi záradék szerint)",null,null,null,null,null,null,null,null,null,"csak akkor választható, ha a szolg fel korábban kiválasztásra került"]
[null,"Termékfelelősség-biztosítás"]
[null,"Kiterjesztett termékfelelősség-biztosítás",null,null,null,null,null,null,null,null,null,"csak akkor választható, ha a term fel korábban kiválasztásra került"]
[null,"Bérlői felelősségbiztosítás"]
[null,"Bérbeadói felelősségbiztosítás"]
[null,"Munkáltatói felelősségbiztosítás"]
[null,"Környezetszennyezési felelősségbiztosítás"]
[null,"Alvállalkozói fedezet (egyedi záradék szerint)"]
[null,"Építőipari tevékenység fedezete (egyedi záradék szerint)",null,null,null,null,null,null,null,null,null,"ha 5-ös kock. osztály, ez feljön, ÉS az önrész kötelezően min. 10%, de min 100 000 Ft/kár"]
[null,"Területi hatály kiterjesztése Európa (egyedi záradék szerint)",null,null,null,null,null,null,null,null,null,"ha Európa"]
[]
[null,"Dolgozói létszám:",null,14,"fő",null,null,null,null,null,null,"opcionálisan (munk fel esetén) kitöltendő mező"]
[]
[null,"Díjszámítási alap (éves bruttó forgalom):",null,2465,"MFt",null,null,null,null,null,null,"kötelezően kitöltendő mező"]
[]
[null,"Kombinált limit:",null,"5 MFt/kár, 10 MFt/év",null,null,null,null,null,null,null,"választható limitek legördülő menüben"]
[]
[]
[null,"Önrész:",null,"10 %, de min. 25 000 Ft",null,null,null,null,null,null,null,"választható önrészek legördülő menüben"]
[]
[null,"Díjtétel:",null,{"$f":"D28/(D19*1000000)*100","v":0},null,null,null,null,null,null,null,"háttértábla (tarifáló) alapján"]
[]
[null,"Éves díj:",null,{"$f":"Ajánlat1!C170","v":0},null,null,null,null,null,null,null,"háttértábla (tariáfló) alapján"]
[]
[null,"Egészségügyi szolgáltatók szakmai felelősségbiztosítása"]
{"$rows_left_out":59}
{"sheet":"Tevékenységi lista","index":4,"n_rows":117,"n_cols":12,"rows_kept":117,"cut":false,"hidden":true,"merged":[]}
["Biztosított tevékenység:","5 / 15","10 / 20"]
["addiktológia (szenvedélybetegségek orvoslása)",13500,16000,null,null,null,{"$f":"IF(--ISNUMBER(SEARCH(tev.lista,A2)),MAX($G$1:G1)+1,\"\")","v":1},{"$f":"IFERROR(INDEX($A$2:$A$117,MATCH(ROWS($G$2:G2),$G$2:$G$117,0)),\"\")","v":"addiktológia (szenvedélybetegségek orvoslása)"},null,{"$f":"$H$2:INDEX($H$2:$H$117,COUNTIF($H$2:$H$117,\"?*\"))","v":"addiktológia (szenvedélybetegségek orvoslása)"},null,{"$f":"IF(J2=H2,1,0)","v":1}]
["állatorvos-egészségügyi szakszemélyzet (orvossal együtt kötött szerződés esetén)",1500,1800,null,null,null,{"$f":"IF(--ISNUMBER(SEARCH(tev.lista,A3)),MAX($G$1:G2)+1,\"\")","v":2},{"$f":"IFERROR(INDEX($A$2:$A$117,MATCH(ROWS($G$2:G3),$G$2:$G$117,0)),\"\")","v":"állatorvos-egészségügyi szakszemélyzet (orvossal együtt kötött szerződés esetén)"}]
["állatorvoslás (nem haszonállatok orvoslása műtéti tevékenység nélkül)",13500,16000,null,null,null,{"$f":"IF(--ISNUMBER(SEARCH(tev.lista,A4)),MAX($G$1:G3)+1,\"\")","v":3},{"$f":"IFERROR(INDEX($A$2:$A$117,MATCH(ROWS($G$2:G4),$G$2:$G$117,0)),\"\")","v":"állatorvoslás (nem haszonállatok orvoslása műtéti tevékenység nélkül)"}]
["állatorvoslás (nem haszonállatok orvoslása, műtéti tevékenységgel)",33500,40000,null,null,null,{"$f":"IF(--ISNUMBER(SEARCH(tev.lista,A5)),MAX($G$1:G4)+1,\"\")","v":4},{"$f":"IFERROR(INDEX($A$2:$A$117,MATCH(ROWS($G$2:G5),$G$2:$G$117,0)),\"\")","v":"állatorvoslás (nem haszonállatok orvoslása, műtéti tevékenységgel)"}]
["allergologia",19000,23500,null,null,null,{"$f":"IF(--ISNUMBER(SEARCH(tev.lista,A6)),MAX($G$1:G5)+1,\"\")","v":5},{"$f":"IFERROR(INDEX($A$2:$A$117,MATCH(ROWS($G$2:G6),$G$2:$G$117,0)),\"\")","v":"allergologia"}]
["általános orvos",33500,40000,null,null,null,{"$f":"IF(--ISNUMBER(SEARCH(tev.lista,A7)),MAX($G$1:G6)+1,\"\")","v":6},{"$f":"IFERROR(INDEX($A$2:$A$117,MATCH(ROWS($G$2:G7),$G$2:$G$117,0)),\"\")","v":"általános orvos"}]
["andrológia (férfi betegségek orvoslása)",33500,40000,null,null,null,{"$f":"IF(--ISNUMBER(SEARCH(tev.lista,A8)),MAX($G$1:G7)+1,\"\")","v":7},{"$f":"IFERROR(INDEX($A$2:$A$117,MATCH(ROWS($G$2:G8),$G$2:$G$117,0)),\"\")","v":"andrológia (férfi betegségek orvoslása)"}]
["ápoló",1500,1800,null,null,null,{"$f":"IF(--ISNUMBER(SEARCH(tev.lista,A9)),MAX($G$1:G8)+1,\"\")","v":8},{"$f":"IFERROR(INDEX($A$2:$A$117,MATCH(ROWS($G$2:G9),$G$2:$G$117,0)),\"\")","v":"ápoló"}]
["asszisztens",1500,1800,null,null,null,{"$f":"IF(--ISNUMBER(SEARCH(tev.lista,A10)),MAX($G$1:G9)+1,\"\")","v":9},{"$f":"IFERROR(INDEX($A$2:$A$117,MATCH(ROWS($G$2:G10),$G$2:$G$117,0)),\"\")","v":"asszisztens"}]
["audiológia (hallástan)",19000,23500,null,null,null,{"$f":"IF(--ISNUMBER(SEARCH(tev.lista,A11)),MAX($G$1:G10)+1,\"\")","v":10},{"$f":"IFERROR(INDEX($A$2:$A$117,MATCH(ROWS($G$2:G11),$G$2:$G$117,0)),\"\")","v":"audiológia (hallástan)"}]
["belgyógyász",33500,40000,null,null,null,{"$f":"IF(--ISNUMBER(SEARCH(tev.lista,A12)),MAX($G$1:G11)+1,\"\")","v":11},{"$f":"IFERROR(INDEX($A$2:$A$117,MATCH(ROWS($G$2:G12),$G$2:$G$117,0)),\"\")","v":"belgyógyász"}]
["betegszállító",1500,1800,null,null,null,{"$f":"IF(--ISNUMBER(SEARCH(tev.lista,A13)),MAX($G$1:G12)+1,\"\")","v":12},{"$f":"IFERROR(INDEX($A$2:$A$117,MATCH(ROWS($G$2:G13),$G$2:$G$117,0)),\"\")","v":"betegszállító"}]
["biorezonancián alapuló eljárások",39000,46000,null,null,null,{"$f":"IF(--ISNUMBER(SEARCH(tev.lista,A14)),MAX($G$1:G13)+1,\"\")","v":13},{"$f":"IFERROR(INDEX($A$2:$A$117,MATCH(ROWS($G$2:G14),$G$2:$G$117,0)),\"\")","v":"biorezonancián alapuló eljárások"}]
["boncmester",1500,1800,null,null,null,{"$f":"IF(--ISNUMBER(SEARCH(tev.lista,A15)),MAX($G$1:G14)+1,\"\")","v":14},{"$f":"IFERROR(INDEX($A$2:$A$117,MATCH(ROWS($G$2:G15),$G$2:$G$117,0)),\"\")","v":"boncmester"}]
["bőrgyógyász",33500,40000,null,null,null,{"$f":"IF(--ISNUMBER(SEARCH(tev.lista,A16)),MAX($G$1:G15)+1,\"\")","v":15},{"$f":"IFERROR(INDEX($A$2:$A$117,MATCH(ROWS($G$2:G16),$G$2:$G$117,0)),\"\")","v":"bőrgyógyász"}]
["bőrgyógyász egynapos sebészettel",{"$f":"B16*1.8","v":60300},{"$f":"C16*1.8","v":72000},null,null,null,{"$f":"IF(--ISNUMBER(SEARCH(tev.lista,A17)),MAX($G$1:G16)+1,\"\")","v":16},{"$f":"IFERROR(INDEX($A$2:$A$117,MATCH(ROWS($G$2:G17),$G$2:$G$117,0)),\"\")","v":"bőrgyógyász egynapos sebészettel"}]
["cytopatológia (kórszövettan)",33500,40000,null,null,null,{"$f":"IF(--ISNUMBER(SEARCH(tev.lista,A18)),MAX($G$1:G17)+1,\"\")","v":17},{"$f":"IFERROR(INDEX($A$2:$A$117,MATCH(ROWS($G$2:G18),$G$2:$G$117,0)),\"\")","v":"cytopatológia (kórszövettan)"}]
["csecsemő-gyermekgyógyász",33500,40000,null,null,null,{"$f":"IF(--ISNUMBER(SEARCH(tev.lista,A19)),MAX($G$1:G18)+1,\"\")","v":18},{"$f":"IFERROR(INDEX($A$2:$A$117,MATCH(ROWS($G$2:G19),$G$2:$G$117,0)),\"\")","v":"csecsemő-gyermekgyógyász"}]
["diabetológus",33500,40000,null,null,null,{"$f":"IF(--ISNUMBER(SEARCH(tev.lista,A20)),MAX($G$1:G19)+1,\"\")","v":19},{"$f":"IFERROR(INDEX($A$2:$A$117,MATCH(ROWS($G$2:G20),$G$2:$G$117,0)),\"\")","v":"diabetológus"}]
["dietetikus",1500,1800,null,null,null,{"$f":"IF(--ISNUMBER(SEARCH(tev.lista,A21)),MAX($G$1:G20)+1,\"\")","v":20},{"$f":"IFERROR(INDEX($A$2:$A$117,MATCH(ROWS($G$2:G21),$G$2:$G$117,0)),\"\")","v":"dietetikus"}]
["egészségbiztosítás",13500,16000,null,null,null,{"$f":"IF(--ISNUMBER(SEARCH(tev.lista,A22)),MAX($G$1:G21)+1,\"\")","v":21},{"$f":"IFERROR(INDEX($A$2:$A$117,MATCH(ROWS($G$2:G22),$G$2:$G$117,0)),\"\")","v":"egészségbiztosítás"}]
["élelmezésvezető",1500,1800,null,null,null,{"$f":"IF(--ISNUMBER(SEARCH(tev.lista,A23)),MAX($G$1:G22)+1,\"\")","v":22},{"$f":"IFERROR(INDEX($A$2:$A$117,MATCH(ROWS($G$2:G23),$G$2:$G$117,0)),\"\")","v":"élelmezésvezető"}]
["endokrinológia (hormonrendszer orvoslása)",19000,23500,null,null,null,{"$f":"IF(--ISNUMBER(SEARCH(tev.lista,A24)),MAX($G$1:G23)+1,\"\")","v":23},{"$f":"IFERROR(INDEX($A$2:$A$117,MATCH(ROWS($G$2:G24),$G$2:$G$117,0)),\"\")","v":"endokrinológia (hormonrendszer orvoslása)"}]
["eü. ellenőr",1500,1800,null,null,null,{"$f":"IF(--ISNUMBER(SEARCH(tev.lista,A25)),MAX($G$1:G24)+1,\"\")","v":24},{"$f":"IFERROR(INDEX($A$2:$A$117,MATCH(ROWS($G$2:G25),$G$2:$G$117,0)),\"\")","v":"eü. ellenőr"}]
["eü. menedzser",1500,1800,null,null,null,{"$f":"IF(--ISNUMBER(SEARCH(tev.lista,A26)),MAX($G$1:G25)+1,\"\")","v":25},{"$f":"IFERROR(INDEX($A$2:$A$117,MATCH(ROWS($G$2:G26),$G$2:$G$117,0)),\"\")","v":"eü. menedzser"}]
["eü. szakoktató",1500,1800,null,null,null,{"$f":"IF(--ISNUMBER(SEARCH(tev.lista,A27)),MAX($G$1:G26)+1,\"\")","v":26},{"$f":"IFERROR(INDEX($A$2:$A$117,MATCH(ROWS($G$2:G27),$G$2:$G$117,0)),\"\")","v":"eü. szakoktató"}]
["fertőző betegségek orvoslása",19000,23500,null,null,null,{"$f":"IF(--ISNUMBER(SEARCH(tev.lista,A28)),MAX($G$1:G27)+1,\"\")","v":27},{"$f":"IFERROR(INDEX($A$2:$A$117,MATCH(ROWS($G$2:G28),$G$2:$G$117,0)),\"\")","v":"fertőző betegségek orvoslása"}]
["fizikális medicina és rehabilitációs orvoslás",19000,23500,null,null,null,{"$f":"IF(--ISNUMBER(SEARCH(tev.lista,A29)),MAX($G$1:G28)+1,\"\")","v":28},{"$f":"IFERROR(INDEX($A$2:$A$117,MATCH(ROWS($G$2:G29),$G$2:$G$117,0)),\"\")","v":"fizikális medicina és rehabilitációs orvoslás"}]
["fizioterápia",19000,23500,null,null,null,{"$f":"IF(--ISNUMBER(SEARCH(tev.lista,A30)),MAX($G$1:G29)+1,\"\")","v":29},{"$f":"IFERROR(INDEX($A$2:$A$117,MATCH(ROWS($G$2:G30),$G$2:$G$117,0)),\"\")","v":"fizioterápia"}]
{"$rows_left_out":87}