{"text_format":"1","workbook":"xlsx","n_sheets":18,"sheets":["Biztosítási termékismertető","Ajánlat1","Tevékenység lista","Tarifa táblák","Vagyonbiztosítási adatközlő","Gép,berendezés","Géplista","Munka10","GéptörésELBER","Kiegészítők","Összesítő","Kockázatfelmérő","Díjszámítás","Nyilatkozat","Zálogkötelezetti nyilatkozat","Munka8","Társbiztosítotti nyilatkozat","Fedezeti limittábla"],"not_rendered":{"charts":0,"images":20,"macros":1,"external_links":0,"defined_names":88,"comments":2,"pivot_tables":0},"unopened":[],"bounds":{"document_bytes":16777216,"sheet_cells":100000,"rows_first":2000,"rows_last":500,"rows_between":2000,"halvings":0,"cell_chars":16384,"cell_head_chars":4096},"cells_cut":0,"cells_raw":0,"read":"whole","date_system":"1900"}

{"sheet":"Biztosítási termékismertető","index":0,"n_rows":0,"n_cols":0,"rows_kept":0,"cut":false,"hidden":false,"merged":[]}

{"sheet":"Ajánlat1","index":1,"n_rows":137,"n_cols":15,"rows_kept":137,"cut":false,"hidden":false,"merged":[[55,1,55,10],[3,0,3,2],[120,2,120,3],[119,2,119,3],[25,3,25,4],[46,4,46,5],[36,4,36,6],[30,6,30,7],[37,1,37,10],[113,1,113,3],[114,5,114,6],[111,4,111,5],[51,1,51,10],[50,1,50,10],[46,7,46,8],[53,1,53,3],[52,6,52,7],[52,8,52,10],[1,1,1,3],[6,1,6,2],[15,4,15,10],[5,3,5,4],[8,2,8,3],[7,7,7,8],[7,5,7,6],[3,8,3,10],[13,1,13,10],[6,7,6,8],[7,1,7,2],[12,1,12,10],[7,3,7,4],[6,3,6,5],[2,7,2,10],[10,9,10,10],[24,2,24,3],[17,8,17,10],[20,1,20,10],[17,3,17,4],[21,6,21,7],[19,6,19,7],[18,1,18,10],[19,3,19,4],[21,3,21,4],[24,5,24,6],[24,8,24,10],[57,1,70,4],[57,8,70,10],[57,5,70,6],[25,8,25,10],[26,1,26,10],[27,3,27,4],[53,7,53,10],[27,6,27,7],[29,1,29,10],[48,4,48,8],[32,3,32,4],[42,4,42,6],[40,8,40,9],[32,6,32,7],[44,5,44,10],[30,3,30,4]]}
[]
[]
[null,null,null,null,null,null,null,"UNION-Business Class"]
[null,null,null,null,null,null,null,null,"Biztosítási ajánlat"]
[]
[null,"Módozat:",null,7910,null,null,null,null,null,"Beérkezett:"]
[null,"Üzletkötő neve:",null,null,null,null,"Üzletkötő kódja:"]
[null,"Átdolgozás:  ",null,"nem",null,"Előzmény kötv.száma:"]
{"$rows_left_out":130}
{"sheet":"Tevékenység lista","index":2,"n_rows":302,"n_cols":28,"rows_kept":302,"cut":false,"hidden":true,"merged":[]}
["Tevkor","Vagyon","Felelosseg","Betores","Üzemszünet","Géptörés","Elber",null,null,null,{"$f":"COUNTIF(L2:L302,\"?*\")","v":301},null,null,null,null,null,null,null,null,null,null,null,null,null,null,null,"Újraindít Akció lista"]
["1011 Húsfeldolgozás, -tartósítás",3,3,1,3,2,2,null,{"$f":"IF(ISNUMBER(SEARCH($H$2,'Tevékenység lista'!A2)),MAX($I$1:I1)+1,0)","v":1},"ABC, élelmiszer jellegű vegyeskereskedés",{"$f":"OFFSET($L$2,,,COUNTIF($L$2:$L$302,\"?*\"))","v":"ABC, élelmiszer jellegű vegyeskereskedés"},{"$f":"IFERROR(VLOOKUP(ROWS($L$2:L2),I2:$J$302,2,FALSE),\"\")","v":"ABC, élelmiszer jellegű vegyeskereskedés"},null,null,null,null,{"$f":"IF(--ISNUMBER(SEARCH(Díjszámítás!$C$12,A2)),MAX($Q$1:Q1)+1,\"\")","v":1},{"$f":"IFERROR(INDEX($A$2:$A$302,MATCH(ROWS($Q$2:Q2),$Q$2:$Q$302,0)),\"\")","v":"1011 Húsfeldolgozás, -tartósítás"},null,null,{"$f":"$R$2:INDEX($R$2:$R$302,COUNTIF($R$2:$R$302,\"?*\"))","v":"1011 Húsfeldolgozás, -tartósítás"},null,null,null,null,null,"4743 Audio-, videoberendezés kiskereskedelme",{"$f":"IFERROR(VLOOKUP(Díjszámítás!C12,'Tevékenység lista'!AA2:AA34,1,FALSE),0)","v":0}]
["1012 Baromfihús feldolgozása, tartósítása",3,3,1,3,2,2,null,{"$f":"IF(ISNUMBER(SEARCH($H$2,'Tevékenység lista'!A3)),MAX($I$1:I2)+1,0)","v":2},"Acélkereskedelem",null,{"$f":"IFERROR(VLOOKUP(ROWS($L$2:L3),I3:$J$302,2,FALSE),\"\")","v":"Acélkereskedelem"},null,null,null,null,{"$f":"IF(--ISNUMBER(SEARCH(Díjszámítás!$C$12,A3)),MAX($Q$1:Q2)+1,\"\")","v":2},{"$f":"IFERROR(INDEX($A$2:$A$302,MATCH(ROWS($Q$2:Q3),$Q$2:$Q$302,0)),\"\")","v":"1012 Baromfihús feldolgozása, tartósítása"},null,null,null,null,null,null,null,null,"4751 Textil-kiskereskedelem"]
["1013 Hús-, baromfihús-készítmény gyártása",3,3,1,3,2,2,null,{"$f":"IF(ISNUMBER(SEARCH($H$2,'Tevékenység lista'!A4)),MAX($I$1:I3)+1,0)","v":3},"Acélszerkezetépítés",null,{"$f":"IFERROR(VLOOKUP(ROWS($L$2:L4),I4:$J$302,2,FALSE),\"\")","v":"Acélszerkezetépítés"},null,null,null,null,{"$f":"IF(--ISNUMBER(SEARCH(Díjszámítás!$C$12,A4)),MAX($Q$1:Q3)+1,\"\")","v":3},{"$f":"IFERROR(INDEX($A$2:$A$302,MATCH(ROWS($Q$2:Q4),$Q$2:$Q$302,0)),\"\")","v":"1013 Hús-, baromfihús-készítmény gyártása"},null,null,null,null,null,null,null,null,"4754 Villamos háztartási készülék kiskereskedelme"]
["1020 Halfeldolgozás, -tartósítás",3,3,1,3,2,2,null,{"$f":"IF(ISNUMBER(SEARCH($H$2,'Tevékenység lista'!A5)),MAX($I$1:I4)+1,0)","v":4},"Ács, állványozó",null,{"$f":"IFERROR(VLOOKUP(ROWS($L$2:L5),I5:$J$302,2,FALSE),\"\")","v":"Ács, állványozó"},null,null,null,null,{"$f":"IF(--ISNUMBER(SEARCH(Díjszámítás!$C$12,A5)),MAX($Q$1:Q4)+1,\"\")","v":4},{"$f":"IFERROR(INDEX($A$2:$A$302,MATCH(ROWS($Q$2:Q5),$Q$2:$Q$302,0)),\"\")","v":"1020 Halfeldolgozás, -tartósítás"},null,null,null,null,null,null,null,null,"4759 Bútor, világítási eszköz, egyéb háztartási cikk kiskereskedelme"]
["1031 Burgonyafeldolgozás, -tartósítás",3,3,1,3,2,1,null,{"$f":"IF(ISNUMBER(SEARCH($H$2,'Tevékenység lista'!A6)),MAX($I$1:I5)+1,0)","v":5},"Ajándék, bizsu kereskedés",null,{"$f":"IFERROR(VLOOKUP(ROWS($L$2:L6),I6:$J$302,2,FALSE),\"\")","v":"Ajándék, bizsu kereskedés"},null,null,null,null,{"$f":"IF(--ISNUMBER(SEARCH(Díjszámítás!$C$12,A6)),MAX($Q$1:Q5)+1,\"\")","v":5},{"$f":"IFERROR(INDEX($A$2:$A$302,MATCH(ROWS($Q$2:Q6),$Q$2:$Q$302,0)),\"\")","v":"1031 Burgonyafeldolgozás, -tartósítás"},null,null,null,null,null,null,null,null,"4761 Könyv-kiskereskedelem"]
["1032 Gyümölcs-, zöldséglé gyártása",3,3,1,3,2,1,null,{"$f":"IF(ISNUMBER(SEARCH($H$2,'Tevékenység lista'!A7)),MAX($I$1:I6)+1,0)","v":6},"Akkumulátor kereskedelem",null,{"$f":"IFERROR(VLOOKUP(ROWS($L$2:L7),I7:$J$302,2,FALSE),\"\")","v":"Akkumulátor kereskedelem"},null,null,null,null,{"$f":"IF(--ISNUMBER(SEARCH(Díjszámítás!$C$12,A7)),MAX($Q$1:Q6)+1,\"\")","v":6},{"$f":"IFERROR(INDEX($A$2:$A$302,MATCH(ROWS($Q$2:Q7),$Q$2:$Q$302,0)),\"\")","v":"1032 Gyümölcs-, zöldséglé gyártása"},null,null,null,null,null,null,null,null,"4763 Zene-, videofelvétel kiskereskedelme"]
["1039 Egyéb gyümölcs-, zöldségfeldolgozás, -tartósítás",3,3,1,3,2,1,null,{"$f":"IF(ISNUMBER(SEARCH($H$2,'Tevékenység lista'!A8)),MAX($I$1:I7)+1,0)","v":7},"Akkumulátor, szárazelemgyártás",null,{"$f":"IFERROR(VLOOKUP(ROWS($L$2:L8),I8:$J$302,2,FALSE),\"\")","v":"Akkumulátor, szárazelemgyártás"},null,null,null,null,{"$f":"IF(--ISNUMBER(SEARCH(Díjszámítás!$C$12,A8)),MAX($Q$1:Q7)+1,\"\")","v":7},{"$f":"IFERROR(INDEX($A$2:$A$302,MATCH(ROWS($Q$2:Q8),$Q$2:$Q$302,0)),\"\")","v":"1039 Egyéb gyümölcs-, zöldségfeldolgozás, -tartósítás"},null,null,null,null,null,null,null,null,"4764 Sportszer-kiskereskedelem"]
{"$rows_left_out":295}
{"sheet":"Tarifa táblák","index":3,"n_rows":41,"n_cols":32,"rows_kept":41,"cut":false,"hidden":true,"merged":[[2,17,2,18],[15,17,15,19],[24,17,24,18],[31,17,31,21],[2,23,2,24],[1,0,1,1],[14,0,14,1],[19,0,19,2],[2,8,2,9],[15,8,15,9],[2,4,2,6],[37,0,37,1],[29,4,29,5],[37,8,37,9],[33,4,33,5],[2,29,2,30],[10,23,10,24],[16,23,16,27],[20,8,20,10],[29,8,29,9],[2,11,2,12],[16,11,16,13],[26,11,26,12],[28,0,28,1],[20,4,20,6],[21,23,21,24],[33,11,33,15]]}
[]
["Épület DÍJTÉTELEK ‰-ben"]
["Kockázati osztály","Tűz+elemi kár+ \nvezetékes víz+üveg",null,null,"Ingóság",null,null,null,"DÍJTÉTELEK ‰-ben",null,null,"DÍJTÉTELEK ‰-ben",null,null,null,null,null,"DÍJTÉTELEK ‰-ben",null,null,null,null,null,"DÍJTÉTELEK ‰-ben",null,null,null,null,null,"ÜVEG KIEGÉSZÍTŐ"]
[1,0.8,null,null,"Kockázati osztály","Tűz+elemi kár+ \nvezetékes víz+üveg","Betöréses lopás\nrablás",null,"Kockázati osztály","Üzemszünet",null,"Kockázati osztály","Géptörés",null,null,null,null,"Kockázati osztály","ELBER",null,null,null,null,"Kockázati osztály","Felelősség",null,null,null,null,"Éves limit eFt","Normál üveg díj Ft","Normál és speciális üveg díj Ft"]
[2,0.91,null,null,1,1.1200000000000001,1.5,null,1,0.53,null,1,3.71,null,null,null,null,1,3.41,null,null,null,null,1,0.24,null,null,null,null,50,6360,9540]
[3,1.07,null,null,2,1.27,1.92,null,2,0.63,null,2,4.6100000000000003,null,null,null,null,2,4.24,null,null,null,null,2,0.3,null,null,null,null,100,12720,19080]
[4,1.19,null,null,3,1.46,2.4700000000000002,null,3,0.77,null,3,6.39,null,null,null,null,3,5.88,null,null,null,null,3,0.33,null,null,null,null,150,18285,27425]
[5,1.51,null,null,4,1.59,3.02,null,4,0.89,null,4,9.8800000000000008,null,null,null,null,4,9.09,null,null,null,null,4,0.45,null,null,null,null,200,24380,34130]
{"$rows_left_out":34}
{"sheet":"Vagyonbiztosítási adatközlő","index":4,"n_rows":38,"n_cols":25,"rows_kept":38,"cut":false,"hidden":false,"merged":[[11,4,11,5],[31,7,31,9],[18,6,18,7],[19,6,19,7],[20,6,20,7],[21,6,21,7],[24,6,24,7],[25,6,25,7],[30,8,30,9],[23,6,23,7],[15,4,15,5],[16,6,16,7],[17,6,17,7],[16,4,16,5],[17,4,17,5],[24,4,24,5],[0,19,0,21],[1,10,1,17],[22,6,22,7],[14,6,14,7],[15,6,15,7],[12,6,12,7],[13,6,13,7],[2,10,2,17],[4,0,4,17],[10,4,10,5],[14,15,14,17],[15,15,15,17],[10,6,10,7],[11,6,11,7],[9,4,9,5],[22,4,22,5],[12,4,12,5],[23,4,23,5],[20,4,20,5],[21,4,21,5],[18,4,18,5],[19,4,19,5],[25,4,25,5],[14,4,14,5],[13,15,13,17],[6,15,8,17],[6,0,8,0],[8,6,8,7],[8,4,8,5],[6,3,8,3],[7,4,7,7],[7,8,7,9],[7,10,7,11],[7,12,7,13],[7,14,8,14],[6,4,6,14],[6,1,8,1],[9,6,9,7],[12,15,12,17],[13,4,13,5],[25,1,25,2],[9,15,9,17],[10,15,10,17],[11,15,11,17],[18,15,18,17],[19,15,19,17],[20,15,20,17],[21,15,21,17],[22,15,22,17],[23,15,23,17],[24,15,24,17],[25,15,25,17],[16,15,16,17],[17,15,17,17]]}
[]
[null,null,null,null,null,null,null,null,null,null,"UNION-Business Class"]
[null,null,null,null,null,null,null,null,null,null,"Biztosítási ajánlat "]
[]
["Vagyonbiztosítási adatközlő"]
[]
["Sorsz.","Telephely címe",null,"Telephelyen folytatott tevékenységek","BIZTOSÍTÁSI ÖSSZEG eFt",null,null,null,null,null,null,null,null,null,null,"Összesen eFt"]
[null,null,null,null,"Épületek/Építmények ",null,null,null,"Gépek, berendezések ",null,"Egyéb nevesített vagyontárgyak",null,"Készlet",null,"Készpénz, értékkészletek"]
{"$rows_left_out":31}
{"sheet":"Gép,berendezés","index":5,"n_rows":38,"n_cols":14,"rows_kept":38,"cut":false,"hidden":true,"merged":[[6,11,7,13],[8,11,8,13],[6,4,6,5],[6,8,6,9],[6,10,7,10],[12,1,12,2],[12,11,12,13],[37,1,37,3],[37,7,37,9],[1,0,1,2],[34,1,34,2],[34,3,34,4],[6,0,7,0],[6,1,7,2],[6,3,7,3],[6,6,6,7],[8,1,8,2],[2,9,2,12],[1,9,1,12],[4,0,4,12],[36,7,36,9],[9,11,9,13],[10,1,10,2],[10,11,10,13],[11,1,11,2],[11,11,11,13],[9,1,9,2],[13,1,13,2],[13,11,13,13],[14,1,14,2],[14,11,14,13],[15,1,15,2],[15,11,15,13],[16,1,16,2],[16,11,16,13],[17,1,17,2],[17,11,17,13],[18,1,18,2],[18,11,18,13],[19,1,19,2],[19,11,19,13],[20,1,20,2],[20,11,20,13],[21,1,21,2],[21,11,21,13],[22,1,22,2],[22,11,22,13],[23,1,23,2],[23,11,23,13],[24,1,24,2],[24,11,24,13],[25,1,25,2],[25,11,25,13],[26,1,26,2],[26,11,26,13],[27,1,27,2],[27,11,27,13],[28,1,28,2],[28,11,28,13],[29,1,29,2],[29,11,29,13],[32,1,32,2],[32,11,32,12],[30,1,30,2],[30,11,30,13],[31,1,31,2],[31,11,31,13]]}
[]
[null,null,null,null,null,null,null,null,null,"UNION - BC"]
[null,null,null,null,null,null,null,null,null,"Biztosítási ajánlat"]
[]
["Vagyonbiztosítási adatközlő gép, berendezés, készlet biztosításhoz"]
[]
["Sor-szám","Telephely címe",null,"Telephelyen folytatott tevékenységek","Gép berendezés eFt",null,"Egyéb nevesített eFt",null,"Készlet eFt",null,"Készpénz eFt","Összesen eFt"]
[null,null,null,null,"Saját","Idegen","Saját","Idegen","Saját","Idegen"]
{"$rows_left_out":31}
{"sheet":"Géplista","index":6,"n_rows":41,"n_cols":15,"rows_kept":41,"cut":false,"hidden":true,"merged":[[6,8,7,8],[6,0,7,0],[6,1,7,1],[6,2,7,2],[6,3,7,3],[40,4,40,5],[39,4,39,5],[1,5,1,7],[2,5,2,7],[4,0,4,7],[6,6,6,7],[6,4,7,4],[6,5,7,5],[36,3,36,7]]}
[]
[null,null,null,null,null,"UNION - BC"]
[null,null,null,null,null,"Biztosítási ajánlat"]
[]
["Géplista géptörés biztosításhoz"]
[]
["Sor szám","Gép neve","Típusa","Gyári száma","Gyártási éve","Értékelés módja","Gép értéke eFt ",null,"Gép kora",null,null,{"$f":"COUNTIF(E9:E35,\">0\")","v":0}]
[null,null,null,null,null,null,"saját","idegen"]
{"$rows_left_out":34}
{"sheet":"Munka10","index":7,"n_rows":0,"n_cols":0,"rows_kept":0,"cut":false,"hidden":true,"merged":[]}

{"sheet":"GéptörésELBER","index":8,"n_rows":47,"n_cols":18,"rows_kept":47,"cut":false,"hidden":false,"merged":[[1,4,1,7],[2,4,2,7],[4,0,4,7],[6,0,7,0],[6,1,7,3],[6,4,7,4],[44,4,44,5],[6,5,7,5],[6,6,6,7],[8,1,8,3],[40,3,40,7],[43,4,43,5],[9,6,9,7],[9,4,10,4],[9,5,10,5],[24,0,24,7],[9,0,10,0],[9,1,10,1],[9,2,10,2],[9,3,10,3],[39,0,39,5],[26,1,27,1],[22,0,22,5],[26,6,26,7],[26,8,27,8],[26,2,27,2],[26,3,27,3],[26,4,27,4],[26,5,27,5],[26,0,27,0]]}
[]
[null,null,null,null,"UNION-Business Class"]
[null,null,null,null,"Biztosítási ajánlat"]
[]
["Elektromos berendezések biztosítása"]
[]
["Sor szám","Informatikai eszközök",null,null,"Átlagélet-kora","Értékelés módja","Biztosítási összeg eFt",null,"Gép kora",null,null,{"$f":"COUNTIF(E9:E22,\">0\")","v":0},null,null,null,null,null,{"$f":"YEAR(TODAY())-10","v":2011}]
[null,null,null,null,null,null,"saját","idegen",null,null,null,null,null,null,null,null,null,{"$f":"YEAR(TODAY())-9","v":2012}]
{"$rows_left_out":40}
{"sheet":"Kiegészítők","index":9,"n_rows":73,"n_cols":17,"rows_kept":73,"cut":false,"hidden":true,"merged":[[2,7,2,10],[1,7,1,10],[5,0,5,10],[12,0,12,10],[32,0,32,1],[32,2,32,3],[32,9,32,10],[24,0,24,1],[17,0,17,1],[17,2,17,3],[17,9,17,10],[22,2,22,5],[18,0,18,10],[24,2,24,3],[24,9,24,10],[25,0,25,1],[27,0,27,10],[33,0,33,10],[39,0,39,1],[39,2,39,3],[35,0,35,1],[35,2,35,3],[35,9,35,10],[36,0,36,1],[36,2,36,3],[36,9,36,10],[34,0,34,1],[34,2,34,3],[31,2,31,3],[31,9,31,10],[37,0,37,1],[37,2,37,3],[50,1,50,3],[50,7,50,9],[49,7,49,9],[42,9,42,10],[39,9,39,10],[40,2,40,3],[40,9,40,10],[40,0,40,1],[41,0,41,1],[41,2,41,3],[49,1,49,3],[41,9,41,10],[37,9,37,10],[38,0,38,1],[38,2,38,3],[38,9,38,10],[46,1,46,2],[46,3,46,4],[42,0,42,8],[26,0,26,10],[43,0,43,10],[7,2,7,3],[9,0,9,1],[9,2,9,3],[9,9,9,10],[10,0,10,1],[10,2,10,3],[10,9,10,10],[20,0,20,10],[14,2,14,5],[11,0,11,10],[16,0,16,1],[34,9,34,10],[29,2,29,5],[31,0,31,1],[16,2,16,3],[16,9,16,10],[25,2,25,3],[25,9,25,10],[7,7,7,9]]}
[]
[null,null,null,null,null,null,null,"UNION - BC"]
[null,null,null,null,null,null,null,"Biztosítási ajánlat"]
[null,null,null,null,null,null,null,null,null,null,null,null,null,null,null,null,"Tevkor"]
[]
["Üzemszünetbiztosítás",null,null,null,null,null,null,null,null,null,null,null,null,null,"Épület","Gép, ber"]
[]
["Választott önrész",null,"3 nap",null,null,"Kártérítési limit",null,{"$f":"IF(A11=0,0,IF(A11=\"Small\",A71,IF(A11=\"Medium\",A72,IF(A11=\"Large\",A73))))","v":"12 hónap, max 100 MFt"},null,null,null,null,{"$f":"IF(C8=\"3 nap\",1,IF(C8=\"5 nap\",2,IF(C8=\"7 nap\",3)))","v":1},null,{"$f":"IF(Díjszámítás!M27=1,1,IF(Díjszámítás!M27=2,2,IF(Díjszámítás!M27=3,3,0)))","v":0},{"$f":"IF(Díjszámítás!M42=1,1,IF(Díjszámítás!M42=2,2,IF(Díjszámítás!M42=3,3,0)))","v":0}]
{"$rows_left_out":66}
{"sheet":"Összesítő","index":10,"n_rows":76,"n_cols":17,"rows_kept":76,"cut":false,"hidden":true,"merged":[[12,0,12,8],[12,9,12,10],[1,8,1,10],[2,8,2,10],[8,0,8,10],[11,0,11,8],[11,9,11,10],[13,0,13,8],[13,9,13,10],[14,0,14,8],[14,9,14,10],[15,0,15,8],[15,9,15,10],[16,0,16,8],[16,9,16,10],[17,0,17,8],[17,9,17,10],[18,0,18,8],[18,9,18,10],[20,0,20,8],[20,9,20,10],[23,0,23,4],[23,5,23,6],[23,9,23,10],[21,0,21,8],[21,9,21,10],[22,0,22,4],[22,5,22,8],[22,9,22,10],[24,0,24,4],[24,5,24,8],[24,9,24,10],[25,0,25,4],[25,5,25,8],[25,9,25,10],[26,0,26,8],[26,9,26,10],[27,0,27,4],[27,5,27,6],[27,7,27,8],[27,9,27,10],[28,0,28,8],[28,9,28,10],[29,2,29,3],[29,4,29,5],[29,9,29,10],[37,1,37,3],[37,7,37,9],[30,4,30,5],[34,1,34,2],[34,3,34,4],[36,1,36,3],[36,7,36,9]]}
[]
[null,null,null,null,null,null,null,null,"UNION - BC"]
[null,null,null,null,null,null,null,null,"Biztosítási ajánlat"]
[null,null,null,null,null,null,null,null,null,null,null,null,null,null,null,null,"Tevkor"]
[]
[]
[]
[]
{"$rows_left_out":69}
{"sheet":"Kockázatfelmérő","index":11,"n_rows":96,"n_cols":19,"rows_kept":96,"cut":false,"hidden":false,"merged":[[15,1,15,9],[15,11,15,12],[5,4,5,12],[7,1,7,12],[9,11,9,12],[11,1,11,12],[13,3,13,9],[17,1,17,9],[17,11,17,12],[19,1,19,9],[19,11,19,12],[21,1,21,9],[21,11,21,12],[23,11,23,12],[27,3,27,9],[29,1,29,9],[29,11,29,12],[31,1,31,9],[31,11,31,12],[50,11,50,12],[33,1,33,9],[33,11,33,12],[35,1,35,9],[35,11,35,12],[37,11,37,12],[39,1,39,11],[40,11,40,12],[42,11,42,12],[44,11,44,12],[46,11,46,12],[48,11,48,12],[52,11,52,12],[54,8,54,12],[56,8,56,10],[58,8,58,10],[62,1,62,3],[62,5,62,6],[62,8,62,9],[62,11,62,12],[64,1,64,3],[64,5,64,6],[64,8,64,9],[64,11,64,12],[66,1,66,3],[66,5,66,6],[66,8,66,9],[66,11,66,12],[68,1,68,3],[68,5,68,6],[68,8,68,9],[68,11,68,12],[70,1,70,3],[70,5,70,6],[70,8,70,9],[70,11,70,12],[79,8,79,10],[80,8,80,10],[72,3,72,12],[74,1,74,12],[78,1,78,12],[79,2,79,3],[77,4,77,5],[76,1,76,12]]}
[]
[null,null,null,null,null,null,null,null,null,null,null,null,"UNION-Business Class"]
[null,null,null,null,null,null,null,null,null,null,null,null,"Kockázatfelmérő adatlap"]
[]
[]
[null,"Szerződő/Biztosított neve:",null,null,{"$f":"Ajánlat1!E16","v":0}]
[]
[null,"Szerződő/biztosítottként nyilatkozom, hogy a jelen biztosítási ajánlatban részletezett telephelyek megfelelnek az alábbiaknak:"]
{"$rows_left_out":89}
{"sheet":"Díjszámítás","index":12,"n_rows":209,"n_cols":27,"rows_kept":209,"cut":false,"hidden":false,"merged":[[42,0,42,10],[47,0,47,1],[47,2,47,4],[49,0,49,10],[51,8,51,10],[53,2,53,3],[43,0,43,10],[51,2,51,3],[53,0,53,1],[50,0,50,10],[66,1,66,3],[78,0,78,3],[79,0,79,3],[80,0,80,3],[81,0,81,3],[48,2,48,3],[48,7,48,10],[80,8,80,10],[46,7,46,10],[4,0,4,10],[7,7,7,8],[101,7,101,10],[102,0,102,6],[102,7,102,10],[108,7,108,8],[98,0,98,6],[5,0,5,10],[15,0,15,10],[28,0,28,10],[106,9,106,10],[107,5,107,6],[107,9,107,10],[108,9,108,10],[107,0,107,1],[60,7,60,10],[58,9,58,10],[58,1,58,3],[62,0,62,10],[61,7,61,10],[64,0,64,10],[68,0,68,1],[68,2,68,3],[68,7,68,10],[7,9,7,10],[23,2,23,3],[7,4,7,6],[19,9,19,10],[19,6,19,8],[19,0,19,2],[12,0,12,10],[17,3,17,8],[17,0,18,2],[18,3,18,5],[21,6,21,8],[21,9,21,10],[21,3,21,5],[20,9,20,10],[18,6,18,8],[16,0,16,10],[17,9,18,10],[19,3,19,5],[21,0,21,2],[20,0,20,2],[20,3,20,5],[20,6,20,8],[25,2,25,3],[27,0,27,10],[29,0,29,10],[25,0,25,1],[25,7,25,10],[26,7,26,10],[30,0,31,2],[32,3,32,5],[32,9,32,10],[30,3,30,8],[31,3,31,5],[31,6,31,8],[30,9,31,10],[32,0,32,2],[32,6,32,8],[26,0,26,1],[26,2,26,3],[112,7,112,8],[112,9,112,10],[91,8,91,10],[125,2,125,3],[33,9,33,10],[40,7,40,10],[41,7,41,10],[34,6,34,8],[35,3,35,5],[82,0,82,3],[83,0,83,3],[84,0,84,3],[85,0,85,3],[58,7,58,8],[44,0,44,6],[53,7,53,10],[54,0,54,1],[44,7,44,10],[55,0,55,10],[54,7,54,10],[76,2,76,3],[61,2,61,3],[69,7,69,10],[66,9,66,10],[40,0,40,1],[34,3,34,5],[36,0,36,2],[36,3,36,5],[127,0,127,10],[95,0,95,10],[108,2,108,3],[100,0,100,6],[100,7,100,10],[89,8,89,10],[90,8,90,10],[111,7,111,8],[111,9,111,10],[110,0,110,8],[110,9,110,10],[109,9,109,10],[114,2,114,3],[114,4,114,5],[107,2,107,3],[106,2,106,3],[118,0,118,1],[98,7,98,10],[114,9,114,10],[113,9,113,10],[35,0,35,2],[34,9,34,10],[33,6,33,8],[48,0,48,1],[1,7,1,10],[105,7,105,8],[77,0,77,10],[76,8,76,10],[81,8,81,10],[79,8,79,10],[70,0,70,10],[73,1,73,3],[71,0,71,10],[75,0,75,1],[75,2,75,3],[45,0,45,10],[99,7,99,10],[94,0,94,7],[36,9,36,10],[33,3,33,5],[40,2,40,3],[38,2,38,3],[41,0,41,1],[41,2,41,3],[109,2,109,3],[94,8,94,10],[96,0,96,6],[113,2,113,8],[2,7,2,10],[99,0,99,6],[84,8,84,10],[85,8,85,10],[88,8,88,10],[47,7,47,10],[83,8,83,10],[86,8,86,10],[82,8,82,10],[78,8,78,10],[56,0,56,10],[60,0,60,1],[60,2,60,3],[54,2,54,3],[36,6,36,8],[92,8,92,10],[93,8,93,10],[34,0,34,2],[35,6,35,8],[35,9,35,10],[118,8,118,9],[116,4,116,5],[104,1,104,8],[69,0,69,1],[69,2,69,3],[61,0,61,1],[75,8,75,10],[76,0,76,1],[86,0,86,3],[87,0,87,3],[88,0,88,3],[89,0,89,3],[90,0,90,3],[91,0,91,3],[92,0,92,3],[93,0,93,3],[96,7,96,10],[97,0,97,6],[97,7,97,10],[87,8,87,10],[101,0,101,6],[104,9,104,10],[105,9,105,10],[115,9,115,10]]}
[]
[null,null,null,null,null,null,null,"UNION-Business Class"]
[null,null,null,null,null,null,null,"Biztosítási ajánlat"]
[]
["UNION-Business Class"]
["DÍJKALKULÁCIÓS PROGRAM, NEM MINŐSÜL BIZTOSÍTÁSI AJÁNLATNAK!!"]
[]
["Kockázatviselés helye:",null,null,{"$f":"Ajánlat1!B33","v":0},{"$f":"Ajánlat1!D33","v":0},null,null,{"$f":"Ajánlat1!G33","v":0},null,{"$f":"Ajánlat1!J33","v":0}]
{"$rows_left_out":202}
{"sheet":"Nyilatkozat","index":13,"n_rows":145,"n_cols":8,"rows_kept":145,"cut":false,"hidden":false,"merged":[[1,5,1,10],[2,6,2,10],[32,1,32,10],[33,1,33,10],[4,3,4,9],[5,3,5,9],[6,3,6,9],[7,3,7,9],[21,1,21,10],[23,4,23,9],[24,4,24,9],[29,4,29,9],[30,4,30,9],[25,4,25,9],[26,4,26,9],[27,4,27,9],[35,1,35,10],[79,1,79,10],[80,1,80,10],[51,2,51,10],[28,4,28,9],[72,7,72,8],[102,1,102,10],[96,1,96,10],[97,1,97,10],[49,2,49,9],[50,2,50,9],[81,1,81,10],[53,2,53,9],[65,7,65,8],[77,1,77,10],[78,1,78,10],[61,2,61,10],[60,2,60,9],[68,0,68,16383],[70,1,70,10],[144,0,144,16383],[34,1,34,10],[98,1,98,10],[109,1,115,10],[117,1,124,10],[128,7,128,8],[82,1,82,10],[95,1,95,10],[103,1,103,10],[83,1,83,10],[85,1,85,10],[88,7,88,8],[105,7,105,8],[99,1,99,10],[100,1,100,10],[101,1,101,10]]}
[]
[null,null,null,null,null,"UNION-Business Class"]
[null,null,null,null,null,null,"Nyilatkozat"]
[]
[null,"Szerződő neve:",null,{"$f":"Ajánlat1!E16","v":0}]
[null,"Adószáma:",null,{"$f":"Ajánlat1!D18","v":0}]
[null,"Biztosított neve:",null,{"$f":"Ajánlat1!E16","v":0}]
[null,"Adószáma:",null,{"$f":"Ajánlat1!D18","v":0}]
{"$rows_left_out":138}
{"sheet":"Zálogkötelezetti nyilatkozat","index":14,"n_rows":75,"n_cols":9,"rows_kept":75,"cut":false,"hidden":true,"merged":[[54,7,54,8],[56,8,56,9],[61,2,61,9],[62,2,62,9],[47,4,47,5],[47,8,47,9],[48,4,48,5],[48,8,48,9],[51,2,51,3],[53,7,53,8],[33,2,33,9],[41,1,41,9],[44,5,44,9],[45,5,45,9],[46,5,46,9],[34,6,34,8],[25,1,25,9],[27,2,27,9],[28,2,28,9],[29,2,29,9],[32,4,32,9],[19,1,19,2],[19,3,19,9],[20,1,20,9],[24,1,24,9],[18,7,18,9],[18,1,18,4],[8,1,8,9],[11,1,11,9],[16,1,16,9],[17,1,17,9],[14,1,14,2],[1,1,1,9],[4,3,4,9],[5,3,5,9],[6,3,6,9],[7,4,7,5]]}
[]
[null,"ZÁLOGKÖTELEZETTI NYILATKOZAT"]
[]
[null,"Szerződő/Biztosított adatai"]
[null,"Név:",null,{"$f":"Ajánlat1!E16","v":0}]
[null,"Adószáma:",null,{"$f":"Ajánlat1!D18","v":0}]
[null,"Székhelye",null,{"$f":"CONCATENATE(Ajánlat1!B20,\" \",Ajánlat1!D20,\", \",Ajánlat1!G20,\" \",Ajánlat1!J20)","v":" ,  "}]
[null,"Ir.sz.",null,"helység",null,null,"utca",null,"házsz.em.ajtó"]
{"$rows_left_out":68}
{"sheet":"Munka8","index":15,"n_rows":20,"n_cols":5,"rows_kept":20,"cut":false,"hidden":true,"merged":[[17,0,17,9],[5,0,5,9],[8,0,8,9],[11,0,11,9],[14,0,14,9]]}
[]
["Épület","Ingóság","Felelősség","Géptörés","Üveg"]
[{"$f":"Díjszámítás!M27","v":false},{"$f":"IF(Díjszámítás!M42<5,Díjszámítás!M42,Díjszámítás!M42-4)","v":-4},{"$f":"Díjszámítás!M77","v":false},{"$f":"Díjszámítás!H62+Díjszámítás!H70","v":0},{"$f":"Díjszámítás!H49","v":0}]
["Az Limit (ÉpLimit; IngóLimit; FelLimit) munkalapokat mindig csak az első példányhoz kell kinyomtatni."]
["Ha az Épület (A3 cella) 0, akkor nem kell kinyomtatni az Épület, és az ÉpLimit munkalapokat"]
["Ha az Épület (A3 cella) értéke 1-es, akkor ki kell kinyomtatni az Épület munkalapot, és az ÉpLimit munkap 1. Oldalát, ha a cella értéke 2-es, akkor az Épület munkalapot és az ÉpLimit munkalap 2. Oldalát, ha az érték 3-as, akkor az Épület munkalapot és az ÉpLimit munkap 3. oldalát."]
[]
["Ha az Ingóság (B3 cella) 0, akkor nem kell kinyomtatni az IngóLimit munkalapokat"]
{"$rows_left_out":13}
{"sheet":"Társbiztosítotti nyilatkozat","index":16,"n_rows":43,"n_cols":14,"rows_kept":43,"cut":false,"hidden":true,"merged":[[41,9,41,12],[42,9,42,12],[38,1,38,3],[38,5,38,6],[26,6,26,9],[27,3,27,5],[28,3,28,5],[31,2,31,4],[31,7,31,9],[33,0,33,13],[23,2,23,5],[23,8,23,12],[0,0,0,13],[1,2,1,3],[12,0,12,13],[13,1,13,5],[14,0,14,2],[14,6,14,8],[16,0,16,3],[16,5,16,12],[19,0,19,13],[21,4,21,7],[22,8,22,9]]}
["NYILATKOZAT TÁRSBIZTOSÍTOTT BEJEGYZÉSÉHEZ"]
[null,"Értesítés a",null,null,"ajánlat- vagy kötvényszámú biztosítási szerződéshez kapcsolódó"]
[null,null,null,null,null,null,"változásról"]
[]
["Union Vienna Insurance Group Biztosító Zrt."]
["Vezérigazgatóság"]
[]
["Budapest"]
{"$rows_left_out":36}
{"sheet":"Fedezeti limittábla","index":17,"n_rows":0,"n_cols":0,"rows_kept":0,"cut":false,"hidden":false,"merged":[]}