{"text_format":"1","workbook":"xlsx","n_sheets":8,"sheets":["Ker","Tomb","Haz","VIG","Resz","Ugyf","Da","Resz (2)"],"not_rendered":{"charts":0,"images":5,"macros":1,"external_links":0,"defined_names":6,"comments":4,"pivot_tables":0},"unopened":[],"bounds":{"document_bytes":16777216,"sheet_cells":100000,"rows_first":2000,"rows_last":500,"rows_between":2000,"halvings":0,"cell_chars":16384,"cell_head_chars":4096},"cells_cut":0,"cells_raw":0,"read":"whole","date_system":"1900"}

{"sheet":"Ker","index":0,"n_rows":159,"n_cols":11,"rows_kept":159,"cut":false,"hidden":false,"merged":[[151,8,151,9]]}
["Sor szám.","Neve","Neme","Címe","Cég név","Tel. Szám","Fax szám","Mobil szám","E-mail","Képviselő kódja","Fiók neve"]
[1,"Nagy Gabriella",2,null,"Prezervál Biztosítási Alkusz Kft ",null,"0613810204","06309342756","n.gabriella@prezerval.hu",20042008,2]
[2]
[3]
[4]
[5]
[6]
[7]
{"$rows_left_out":152}
{"sheet":"Tomb","index":1,"n_rows":309,"n_cols":32,"rows_kept":309,"cut":false,"hidden":true,"merged":[[43,12,50,12],[232,27,250,27],[13,0,16,7],[8,0,12,7],[167,29,169,29],[167,27,169,27],[43,7,43,8],[1,27,162,27],[1,29,162,29],[19,12,26,12],[27,12,34,12],[35,12,42,12],[251,27,252,27],[253,27,266,27],[216,27,231,27],[177,29,198,29],[199,29,215,29],[177,27,198,27],[199,27,215,27]]}
[null,null,null,{"$f":"G65","v":2},1,2,3,4,null,"Épület kora",null,"‰",null,null,{"$f":"NOW()","v":"2014-09-28T14:55:02.800"},"2016-01-30",{"$f":"IF(P1<O1,1,0)","v":0},null,null,null,null,null,1,2,3,null,"Terület M",{"$f":"IF(ISERROR($AB$268),0,$AB$268)","v":1},"Terület K",{"$f":"IF(ISERROR($AD$217),0,$AD$217)","v":1},"Árvíz",{"$f":"IF(ISERROR($AF$309),0,$AF$309)","v":0}]
[{"$f":"IF(AND(C65=1,OR(G55=1,G55=3,G55=4)),1,IF(AND(C65=2,OR(G55=1,G55=3,G55=4)),2,IF(AND(C65=1,G55=2),3,IF(AND(C65=2,G55=2),4,IF(AND(G55=5,OR(C65=1,C65=3)),3,0)))))","v":1},"Típusa",null,"Kategória","I","II","III","IV",null,0,0,0.45,"0 év",null,null,null,null,null,null,null,"Felület",null,"Egy rtg.","Hőszig.","Fóliázás",null,1011,"Budapest",1011,"Budapest",3042,"Palotás                            "]
[1,"Hagyományos tech. lakóép.",null,"A",160000,190000,241000,260000,null,1,2,0.55000000000000004,"1-2 év",null,null,null,null,null,null,null,null,0,0,0,0,null,1012,null,1012,null,3381,"Pély                               "]
[2,"Modern tech. lakóép.",null,"B",170000,170000,221000,235000,null,3,25,0.65,"3-25 év",null,null,null,null,null,null,null,1,5,1600,3200,800,null,1013,null,1013,null,3382,"Tarnaszentmiklós                   "]
[3,"Hagyományos tech. nyaraló",null,"C",130000,165000,201000,215000,null,26,50,0.75,"26-50 év",null,null,null,null,null,null,null,6,10,3000,6000,1400,null,1014,null,1014,null,3384,"Kisköre"]
[4,"Modern tech. nyaraló",null,"D",160000,160000,201000,215000,null,51,100,0.9,"51-100 év",null,null,null,null,null,null,null,11,15,4300,9000,2000,null,1015,null,1015,null,3385,"Tiszanána                          "]
[5,"Melléképület",null,"F",100000,131000,145000,160000,null,101,null,1.25,"100 évnél idősebb",null,null,null,null,null,null,null,16,20,5500,11500,2600,null,1016,null,1016,null,3386,"Sarud                              "]
[null,null,null,null,null,null,null,null,null,null,null,null,null,null,null,null,null,null,null,null,21,25,6900,14100,3300,null,1021,null,1021,null,3418,"Szentistván                        "]
{"$rows_left_out":302}
{"sheet":"Haz","index":2,"n_rows":71,"n_cols":28,"rows_kept":71,"cut":false,"hidden":false,"merged":[[3,1,6,1],[5,20,5,21],[17,7,17,8],[17,10,17,11],[17,12,17,13],[53,23,53,25],[55,23,55,25],[29,10,29,12],[35,17,35,18],[35,23,35,25],[47,23,47,25],[32,17,32,18],[28,5,28,7],[26,5,26,7],[26,10,26,12],[26,14,26,17],[28,14,28,17],[27,10,27,12],[37,1,44,1],[48,23,48,25],[42,23,42,25],[41,23,41,25],[49,23,49,25],[3,2,3,3],[3,4,3,8],[3,9,3,14],[4,2,4,14],[5,11,5,13],[5,17,5,19],[5,2,5,6],[5,7,5,10],[17,14,17,17],[4,18,4,24],[5,22,5,24],[6,2,6,3],[6,4,6,8],[6,9,6,13],[6,20,6,21],[11,15,11,18],[14,15,14,18],[13,23,13,24],[6,22,6,24],[27,5,27,7],[25,5,25,7],[25,10,25,12],[56,8,56,9],[29,14,29,17],[47,5,47,7],[52,12,52,14],[53,12,53,14],[14,23,14,24],[20,10,20,11],[20,12,20,13],[24,10,24,12],[21,5,21,7],[22,5,22,7],[22,10,22,12],[24,5,24,7],[22,14,22,17],[23,5,23,7],[23,10,23,12],[23,14,23,17],[46,23,46,25],[43,23,43,25],[51,23,51,25],[19,14,19,17],[70,1,70,7],[53,9,53,10],[55,9,55,10],[58,23,58,25],[59,23,59,25],[63,12,63,14],[61,6,61,7],[56,12,56,14],[60,5,60,7],[61,12,61,14],[54,9,54,10],[63,16,65,25],[62,12,62,14],[57,23,57,25],[56,23,56,25],[47,12,47,14],[51,9,51,10],[52,9,52,10],[51,12,51,14],[61,19,61,20],[11,10,11,11],[14,10,14,11],[18,14,18,17],[19,8,19,9],[19,10,19,13],[18,10,18,11],[18,12,18,13],[20,14,20,17],[28,10,28,12],[21,10,21,12],[21,14,21,17],[27,14,27,17],[60,12,60,14],[25,14,25,17],[24,14,24,17],[55,12,55,14],[37,23,37,25],[44,16,45,21],[44,22,45,22],[44,23,45,25],[49,16,55,16],[52,23,52,25],[1,20,1,24],[1,16,1,17],[32,23,32,25]]}
[]
[{"$f":"Tomb!$Q$1","v":0}," Mi-Házunk 2013",null,null,null,null,"Tömbházbiztosítás",null,null,null,null,null,null,null,"Kötvényszáma;",502,null,null,null,null,{"$f":"NOW()","v":"2014-09-28T14:55:02.800"},null,null,null,null,"G 5.2",true]
[]
[null,"Szerz. / Bizt.",1075,null,"Budapest",null,null,null,null,"Rumbach Sebestyén u. 12."]
[null,null,{"$f":"IF(AND(C4>0,E4>\"\",J4>\"\"),C4&\"  \"&E4&\"  \"&J4&IF(Tomb!C55=1,\"   (Társasház)\",IF(Tomb!C55=2,\"   (Lakásszövetkezet)\",\"\")),\"\")","v":"1075  Budapest  Rumbach Sebestyén u. 12.   (Társasház)"},null,null,null,null,null,null,null,null,null,null,null,null,null,"Közvetítő;",null,{"$f":"IF(Tomb!R42=0,\"\",IF(Tomb!R42>0,VLOOKUP(Tomb!R42,Ker!A2:K150,5,0)))","v":0}]
[null,null,"kk",null,null,null,null,null,null,null,null,null,null,null,0,null,0,"50200390-8",null,null,"Kezdete;",null,"2014-12-01"]
[null,null,null,null,null,null,null,null,null,null,null,null,null,null,null,null,0,null,null,null,"Lejárata;"]
[]
{"$rows_left_out":64}
{"sheet":"VIG","index":3,"n_rows":69,"n_cols":208,"rows_kept":69,"cut":false,"hidden":false,"merged":[[58,12,58,13],[66,19,66,20],[58,22,58,24],[58,19,58,21],[60,19,60,20],[66,21,66,24],[64,21,64,24],[64,15,64,18],[58,14,58,15],[60,21,60,24],[64,19,64,20],[60,15,60,18],[62,21,62,24],[62,14,62,15],[62,19,62,20],[16,22,16,25],[17,22,17,25],[39,4,39,10],[43,21,43,24],[43,17,43,20],[19,19,21,21],[19,22,21,24],[40,11,40,15],[39,21,39,24],[40,21,40,24],[50,21,50,24],[41,11,41,15],[41,21,41,24],[39,11,39,15],[45,11,45,15],[45,21,45,24],[45,17,45,20],[47,17,47,20],[47,21,47,24],[48,17,48,20],[48,21,48,24],[49,21,49,24],[52,21,52,24],[54,21,54,24],[55,21,55,24],[57,21,57,24],[54,14,54,15],[55,14,55,15],[57,14,57,15],[56,21,56,24],[56,14,56,15]]}
[]
["Szerződésre vonatkozó adatok;"]
[]
[null,"Szerződő/Biztisított:",null,null,null,null,{"$f":"Haz!C5","v":"1075  Budapest  Rumbach Sebestyén u. 12.   (Társasház)"}]
[null,"Eljáró személy:",null,null,null,null,{"$f":"IF(Haz!O7=0,Haz!C6&\" (azonos címen)\",IF(Haz!O7=1,CONCATENATE(Haz!C6&\" \"&Haz!E7&\" \"&Haz!J7),\"\"))&IF(OR(Haz!L6=\"\",Haz!L6=0),\"\",\" e-mail: \"&Haz!L6)","v":"kk (azonos címen)"}]
[null,"Biztosításközvetítő:",null,null,null,null,{"$f":"IF(Tomb!R42=0,\"\",IF(Tomb!R42>0,VLOOKUP(Tomb!R42,Ker!A2:K150,5,0)))&\"   (\"&IF(Tomb!R42=0,\"\",IF(Tomb!R42>0,VLOOKUP(Tomb!T42,Tomb!R43:S50,2,0)))&\")\"","v":{"$error":"#N/A"}}]
[]
[]
{"$rows_left_out":62}
{"sheet":"Resz","index":4,"n_rows":142,"n_cols":26,"rows_kept":142,"cut":false,"hidden":false,"merged":[[17,23,17,24],[27,12,27,19],[74,8,74,10],[74,5,74,7],[73,23,73,25],[71,7,71,8],[71,11,71,13],[48,24,48,25],[48,19,48,20],[48,21,48,22],[31,23,31,25],[31,21,31,22],[31,18,31,20],[31,16,31,17],[34,19,34,21],[35,19,35,21],[35,16,35,18],[40,16,40,17],[40,18,40,21],[40,22,40,24],[39,22,39,24],[39,16,39,18],[39,19,39,21],[38,22,38,24],[63,8,63,9],[0,0,0,2],[0,3,0,12],[68,0,68,5],[69,0,69,5],[69,6,69,7],[69,10,69,11],[69,12,69,13],[34,9,34,11],[35,9,35,11],[63,4,63,6],[40,13,40,15],[31,0,31,5],[31,13,31,15],[31,6,31,12],[36,9,36,11],[36,12,36,15],[34,12,34,15],[35,12,35,15],[39,9,39,11],[39,13,39,15],[38,8,38,10],[30,2,30,11],[36,7,36,8],[68,8,68,9],[70,23,70,25],[68,10,68,11],[68,12,68,13],[69,8,69,9],[67,6,67,7],[67,8,67,9],[70,6,70,7],[67,10,67,11],[70,19,70,20],[70,10,70,11],[18,23,18,25],[20,18,20,22],[21,16,22,17],[21,14,22,15],[21,21,22,22],[21,23,22,24],[36,22,36,24],[28,12,28,25],[34,22,34,25],[35,22,35,24],[34,16,34,18],[29,19,29,25],[29,14,29,17],[36,16,36,18],[36,19,36,21],[30,14,30,25],[53,15,53,21],[63,19,63,20],[68,19,68,20],[67,19,67,20],[67,12,67,13],[77,5,77,7],[77,0,77,1],[49,21,49,22],[49,23,49,25],[50,24,50,25],[49,15,49,16],[49,18,49,20],[74,0,74,4],[70,0,70,5],[67,0,67,5],[67,23,67,25],[63,23,63,25],[65,23,65,25],[65,19,65,20],[66,8,66,9],[66,12,66,13],[71,23,71,25],[68,6,68,7],[69,23,69,25],[41,17,41,18],[41,19,41,21],[43,13,43,15],[50,20,50,22],[50,18,50,19],[43,16,43,17],[43,18,43,21],[43,22,43,24],[41,8,41,9],[41,10,41,11],[41,22,41,24],[42,16,42,17],[42,18,42,21],[42,22,42,24],[11,23,11,25],[0,22,0,25],[11,14,11,19],[6,22,7,25],[6,16,7,21],[5,7,6,14],[2,22,2,25],[3,16,4,25],[7,7,7,14],[3,0,3,5],[4,6,4,10],[3,6,3,10],[11,20,11,22],[11,2,11,6],[7,0,7,1],[7,2,7,6],[10,0,10,1],[11,0,11,1],[11,7,11,12],[4,11,4,14],[5,0,6,1],[5,2,6,6],[4,0,4,5],[43,4,43,6],[39,6,39,8],[21,0,22,11],[40,4,40,6],[40,7,40,8],[40,9,40,12],[43,7,43,8],[43,9,43,12],[42,2,42,5],[42,6,42,7],[27,0,28,4],[27,5,28,11],[29,7,29,11],[41,12,41,14],[42,12,42,15],[42,8,42,11],[41,15,41,16],[29,2,29,5],[95,0,95,25],[51,24,51,25],[59,23,59,25],[58,23,58,25],[77,11,77,13],[76,10,76,13],[63,15,68,15],[66,19,66,20],[66,23,66,25],[77,16,77,20],[74,11,74,13],[70,12,70,13],[53,0,60,0],[77,2,77,4],[53,23,53,25],[55,23,55,25],[56,23,56,25],[57,23,57,25],[63,11,63,13],[68,23,68,25],[60,23,60,25],[62,23,62,25],[70,8,70,9],[62,12,62,13],[82,3,82,4],[82,5,82,8],[84,0,84,25],[86,13,87,25],[88,0,88,12],[89,0,89,12],[92,0,92,12],[93,0,93,12],[90,0,91,12],[88,13,89,25],[90,13,90,25],[93,13,93,25],[91,13,92,25],[86,0,87,12],[97,0,97,25],[98,1,98,25],[99,1,99,25],[100,1,100,25],[101,1,101,25],[102,1,102,25],[104,0,104,25],[105,1,105,12],[105,14,107,25],[106,1,106,12],[107,1,107,12],[126,0,131,25],[134,2,134,10],[140,3,140,11],[137,4,137,10],[117,3,125,25],[108,1,109,12],[110,1,111,12],[112,1,112,12],[113,1,113,12],[114,1,114,12],[115,1,115,12],[108,14,108,25],[109,14,111,26],[112,14,113,25],[114,14,115,25]]}
["SZERZŐDŐ",null,null,{"$f":"IF(Haz!C5>\"\",Haz!C5,0)","v":"1075  Budapest  Rumbach Sebestyén u. 12.   (Társasház)"},null,null,null,null,null,null,null,null,null,{"$f":"Tomb!Q1","v":0},"Ajánlat száma:",null,null,null,null,null,null,{"$f":"IF(AND(Haz!Q6=0),\"Új szerződés:\",IF(AND(Haz!Q6=1,Haz!R6>\"\"),\"Átdolgozás:\",0))","v":"Új szerződés:"},{"$f":"IF(AND(Haz!Q6=0,Haz!Q2>\"\"),502&Haz!Q2,IF(AND(Haz!Q6=1,Haz!R6>\"\"),Haz!R6,0))","v":0}]
[]
["SZERZŐDŐ KÉPVISELÉTÉBEN ELJÁRÓ SZEMÉLY",null,null,null,null,null,null,null,null,null,null,null,null,null,null,null,"Képviselőj:",null,null,null,null,"Kódja:",{"$f":"IF(Tomb!R42>0,VLOOKUP(Tomb!R42,Ker!A2:K150,10,0))","v":0}]
["Név:",null,null,null,null,null,"Vállalkozás:",null,null,null,null,"E-mail címe:",null,null,null,null,{"$f":"IF(Haz!S5>\"\",Haz!S5,0)","v":0}]
[{"$f":"IF(Haz!C6>\"\",Haz!C6,0)","v":"kk"},null,null,null,null,null,{"$f":"IF(Haz!H6>\"\",Haz!H6,0)","v":0},null,null,null,null,{"$f":"IF(Haz!L6>\"\",Haz!L6,0)","v":0}]
["Irányítószám:",null,"Helység:",null,null,null,null,"Út, utca, tér:"]
[null,null,null,null,null,null,null,null,null,null,null,null,null,null,null,null,"Biztosítás igényelt kezdete:",null,null,null,null,null,{"$f":"IF(Haz!W6>0,Haz!W6,0)","v":"2014-12-01"}]
[{"$f":"IF(AND(Haz!$O$7=1,OR(Haz!C6>\"\",Haz!H6>\"\"),Haz!C7>0),Haz!C7,IF(AND(Haz!$O$7=0,OR(Haz!C6>\"\",Haz!H6>\"\"),Haz!C7>=0),Haz!C4,0))","v":1075},null,{"$f":"IF(AND(Haz!$O$7=1,OR(Haz!C6>\"\",Haz!H6>\"\"),Haz!E7>0),Haz!E7,IF(AND(Haz!$O$7=0,OR(Haz!C6>\"\",Haz!H6>\"\"),Haz!E7>=0),Haz!E4,0))","v":"Budapest"},null,null,null,null,{"$f":"IF(AND(Haz!$O$7=1,OR(Haz!C6>\"\",Haz!H6>\"\"),Haz!J7>0),Haz!J7,IF(AND(Haz!$O$7=0,OR(Haz!C6>\"\",Haz!H6>\"\"),Haz!J7>=0),Haz!J4,0))","v":"Rumbach Sebestyén u. 12."}]
{"$rows_left_out":135}
{"sheet":"Ugyf","index":5,"n_rows":208,"n_cols":27,"rows_kept":208,"cut":false,"hidden":false,"merged":[[6,19,6,25],[7,20,7,25],[37,2,37,25],[51,4,51,25],[38,2,38,25],[9,20,9,25],[8,20,8,25],[10,22,10,25],[9,3,9,10],[8,1,8,10],[19,11,19,25],[35,2,35,25],[36,2,36,25],[40,2,40,25],[43,2,43,25],[39,2,39,25],[49,4,49,25],[50,4,50,25],[53,4,53,25],[54,4,54,25],[68,16,68,19],[56,4,56,25],[58,4,58,25],[60,22,60,24],[74,16,74,19],[67,16,67,19],[111,2,111,25],[112,2,112,25],[113,2,113,25],[96,2,96,25],[93,2,93,25],[89,22,89,24],[88,22,88,24],[87,22,87,24],[86,17,86,18],[78,22,78,24],[72,16,72,19],[70,16,70,19],[71,16,71,19],[69,16,69,19],[117,1,117,25],[101,2,101,25],[102,2,102,25],[103,2,103,25],[104,2,104,25],[105,2,105,25],[106,2,106,25],[107,2,107,25],[108,2,108,25],[109,2,109,25],[116,1,116,25],[110,2,110,25],[114,2,114,25],[73,16,73,19],[1,1,1,10],[2,1,2,25],[5,1,5,13],[4,21,4,25],[5,19,5,25],[4,1,4,13],[41,2,41,25],[66,16,66,19],[23,1,23,25],[45,2,45,25],[44,2,44,25],[42,2,42,25],[52,4,52,25],[63,9,63,12],[65,16,65,19],[123,17,123,22],[57,4,57,25],[55,4,55,25],[95,2,95,25],[94,2,94,25],[84,22,84,24],[77,16,77,19],[81,22,81,24],[85,17,85,18],[85,22,85,24],[79,22,79,24],[79,7,79,21],[80,22,80,24],[78,16,78,19],[77,22,77,24],[86,22,86,24]]}
[]
[null,null,null,null,null,null,null,null,null,null,null,null,null,null,null,null,null,null,null,null,null,null,null,null,null,null,27]
[null,"SIGNAL Biztosító Zrt. 1123 BUDAPEST, Alkotás u. 50. Tel: 458-4222, Fax: 458-4151 E-mail: info@signal.hu, Internet: http://www.signal.hu",null,null,null,null,null,null,null,null,null,null,null,null,null,null,null,null,null,null,null,null,null,null,null,null,{"$f":"SUM(AA64:AA75)+SUM(AA78:AA82)+SUM(AA85:AA89)+SUM(AA92:AA98)+SUM(AA102:AA110)","v":23}]
[null,null,null,null,null,null,null,null,null,null,null,null,null,null,null,null,null,null,null,null,null,null,null,null,null,null,{"$f":"SUM(AA35:AA44)+SUM(AA49:AA59)","v":4}]
[null,{"$f":"IF(Haz!AA2,Haz!C5,\"\")","v":"1075  Budapest  Rumbach Sebestyén u. 12.   (Társasház)"},null,null,null,null,null,null,null,null,null,null,null,null,null,null,null,null,"ügyintéző:",null,null,{"$f":"IF(Tomb!R42=0,\"\",IF(Tomb!R42>0,VLOOKUP(Tomb!R42,Ker!A2:K150,2,0)))","v":0},null,null,null,null,{"$f":"SUM(AA20:AA59)","v":5}]
[null,{"$f":"IF(Haz!AA2,Haz!C6,IF(Tomb!R42=0,\"\",IF(Tomb!R42>0,VLOOKUP(Tomb!R42,Ker!A2:K125,2,0))))","v":"kk"},null,null,null,null,null,null,null,null,null,null,null,null,null,null,null,null,"tel:","06309342756"]
[null,"részére",null,null,null,null,null,null,null,null,null,null,null,null,null,null,null,null,"fax:","0613810204"]
[null,null,null,null,null,null,null,null,null,null,null,null,null,null,null,null,null,null,"e-mail:",null,"n.gabriella@prezerval.hu"]
{"$rows_left_out":201}
{"sheet":"Da","index":6,"n_rows":208,"n_cols":27,"rows_kept":208,"cut":false,"hidden":false,"merged":[[169,1,169,25],[94,2,94,25],[90,2,90,25],[201,1,201,8],[201,17,201,24],[201,9,201,16],[99,2,99,25],[96,2,96,25],[97,2,97,25],[142,3,142,12],[142,15,142,24],[138,8,138,16],[138,20,138,24],[200,1,200,24],[170,1,170,25],[193,6,193,16],[192,8,192,14],[192,18,192,23],[182,3,182,9],[184,1,184,4],[184,5,184,7],[184,8,184,17],[164,1,164,25],[166,1,166,25],[167,1,167,25],[20,11,20,25],[98,2,98,25],[78,2,78,25],[76,2,76,25],[88,2,88,25],[89,2,89,25],[92,2,92,25],[95,2,95,25],[70,14,70,17],[41,4,41,25],[44,4,44,25],[48,4,48,25],[91,2,91,25],[93,2,93,25],[84,10,84,13],[84,17,84,19],[82,22,82,24],[84,22,84,24],[45,4,45,25],[46,4,46,25],[49,4,49,25],[79,2,79,25],[75,2,75,25],[77,2,77,25],[4,1,4,13],[17,3,17,24],[1,1,1,10],[2,1,2,25],[5,1,5,13],[8,1,8,8],[9,1,9,8],[9,20,9,25],[10,1,10,2],[8,20,8,25],[10,22,10,25],[11,21,11,24],[73,2,73,25],[74,2,74,25],[26,7,26,25],[66,14,66,17],[40,4,40,25],[52,14,52,17],[58,14,58,17],[59,14,59,17],[28,12,28,18],[30,9,30,25],[67,14,67,17],[60,14,60,17],[61,14,61,17],[62,14,62,17],[63,14,63,17],[64,14,64,17],[65,14,65,17],[43,4,43,25],[47,4,47,25],[50,4,50,25],[42,4,42,25],[27,4,27,5],[148,3,148,12],[148,15,148,24],[150,6,150,14],[150,20,150,24],[152,19,152,24],[163,1,163,25],[111,2,111,25],[112,2,112,25],[113,2,113,25],[114,2,114,25],[144,6,144,14],[144,20,144,24],[104,14,104,16],[106,14,106,16],[132,1,132,25],[134,8,134,17],[134,20,134,24],[136,8,136,24],[115,2,115,25],[116,2,116,25],[117,2,117,25],[130,1,130,25]]}
[]
[null,null,null,null,null,null,null,null,null,null,null,null,null,null,null,null,null,null,null,null,null,null,null,null,null,null,27]
[null,"SIGNAL Biztosító Zrt. 1123 BUDAPEST, Alkotás u. 50. Tel: 458-4222, Fax: 458-4151 E-mail: info@signal.hu, Internet: http://www.signal.hu",null,null,null,null,null,null,null,null,null,null,null,null,null,null,null,null,null,null,null,null,null,null,null,null,{"$f":"SUM(AA41:AA54)+SUM(AA57:AA68)","v":13}]
[null,null,null,null,null,null,null,null,null,null,null,null,null,null,null,null,null,null,null,null,null,null,null,null,null,null,{"$f":"SUM(AA73:AA80)+SUM(AA82:AA86)+SUM(AA88:AA100)+SUM(AA103:AA108)","v":6}]
[null,{"$f":"IF(OR(Haz!H6=\"\",Haz!H6=0),Haz!C5,Haz!H6)","v":"1075  Budapest  Rumbach Sebestyén u. 12.   (Társasház)"},null,null,null,null,null,null,null,null,null,null,null,null,null,null,null,null,"ügyintéző:",null,null,null,null,null,null,{"$f":"Ugyf!V5","v":0}]
[null,{"$f":"IF(OR(Haz!C6=\"\",Haz!C6=0),0,Haz!C6)","v":"kk"},null,null,null,null,null,null,null,null,null,null,null,null,null,null,null,null,"tel:",null,null,null,null,null,null,{"$f":"Ugyf!T6","v":"06309342756"}]
[null,"részére",null,null,null,null,null,null,null,null,null,null,null,null,null,null,null,null,"fax:",null,null,null,null,null,null,{"$f":"Ugyf!T7","v":"0613810204"}]
[null,null,null,null,null,null,null,null,null,null,null,null,null,null,null,null,null,null,"e-mail:",null,null,null,null,null,null,{"$f":"Ugyf!U8","v":"n.gabriella@prezerval.hu"}]
{"$rows_left_out":201}
{"sheet":"Resz (2)","index":7,"n_rows":157,"n_cols":26,"rows_kept":157,"cut":false,"hidden":true,"merged":[[142,4,142,6],[129,18,129,19],[129,20,129,22],[121,22,121,24],[122,4,122,6],[122,7,122,8],[122,9,122,12],[155,10,155,13],[156,0,156,1],[156,2,156,4],[156,5,156,7],[156,11,156,13],[156,16,156,20],[148,0,148,5],[148,6,148,7],[148,8,148,9],[148,10,148,11],[148,12,148,13],[149,23,149,25],[150,7,150,8],[150,11,150,13],[150,23,150,25],[152,23,152,25],[153,0,153,4],[153,5,153,7],[153,8,153,10],[153,11,153,13],[149,0,149,5],[149,6,149,7],[149,8,149,9],[149,10,149,11],[149,12,149,13],[149,19,149,20],[148,23,148,25],[146,23,146,25],[147,0,147,5],[147,6,147,7],[147,8,147,9],[147,10,147,11],[147,12,147,13],[147,19,147,20],[147,23,147,25],[146,0,146,5],[146,6,146,7],[146,8,146,9],[146,10,146,11],[146,12,146,13],[146,19,146,20],[142,23,142,25],[144,19,144,20],[144,23,144,25],[145,8,145,9],[145,12,145,13],[145,19,145,20],[145,23,145,25],[137,23,137,25],[138,23,138,25],[139,23,139,25],[141,12,141,13],[141,23,141,25],[142,8,142,9],[142,11,142,13],[142,15,147,15],[142,19,142,20],[129,24,129,25],[130,24,130,25],[132,0,139,0],[132,15,132,21],[132,23,132,25],[134,23,134,25],[135,23,135,25],[136,23,136,25],[127,19,127,20],[127,21,127,22],[127,24,127,25],[128,15,128,16],[128,18,128,20],[128,21,128,22],[128,23,128,25],[122,13,122,15],[122,16,122,17],[122,18,122,21],[122,22,122,24],[121,2,121,5],[121,6,121,7],[121,8,121,11],[121,12,121,15],[121,16,121,17],[121,18,121,21],[119,22,119,24],[120,8,120,9],[120,10,120,11],[120,12,120,14],[120,15,120,16],[120,17,120,18],[120,19,120,21],[120,22,120,24],[119,4,119,6],[119,7,119,8],[119,9,119,12],[119,13,119,15],[119,16,119,17],[119,18,119,21],[115,19,115,21],[115,22,115,24],[117,8,117,10],[117,22,117,24],[118,6,118,8],[118,9,118,11],[118,13,118,15],[118,16,118,18],[118,19,118,21],[118,22,118,24],[115,7,115,8],[115,9,115,11],[115,12,115,15],[115,16,115,18],[113,9,113,11],[113,12,113,15],[113,16,113,18],[113,19,113,21],[113,22,113,25],[114,9,114,11],[114,12,114,15],[114,16,114,18],[114,19,114,21],[114,22,114,24],[108,19,108,25],[109,2,109,11],[109,14,109,25],[110,0,110,5],[110,6,110,12],[110,13,110,15],[110,16,110,17],[110,18,110,20],[110,21,110,22],[110,23,110,25],[108,2,108,5],[108,7,108,11],[108,14,108,17],[100,14,101,15],[100,16,101,17],[100,21,101,22],[100,23,101,24],[106,0,107,4],[106,5,107,11],[106,12,106,19],[107,12,107,25],[89,0,89,1],[90,0,90,1],[90,2,90,6],[90,7,90,12],[90,14,90,19],[90,20,90,22],[96,23,96,24],[97,23,97,25],[99,18,99,22],[100,0,101,11],[90,23,90,25],[84,0,85,1],[84,2,85,6],[84,7,85,14],[85,16,86,21],[85,22,86,25],[86,0,86,1],[86,2,86,6],[86,7,86,14],[79,0,79,2],[79,3,79,12],[79,22,79,25],[81,22,81,25],[82,0,82,5],[82,6,82,10],[82,16,83,25],[83,0,83,5],[83,6,83,10],[83,11,83,14],[76,10,76,13],[77,0,77,1],[77,2,77,4],[77,5,77,7],[77,11,77,13],[77,16,77,20],[70,23,70,25],[71,7,71,8],[71,11,71,13],[71,23,71,25],[73,23,73,25],[74,0,74,4],[74,5,74,7],[74,8,74,10],[74,11,74,13],[70,0,70,5],[70,6,70,7],[70,8,70,9],[70,10,70,11],[70,12,70,13],[70,19,70,20],[69,0,69,5],[69,6,69,7],[69,8,69,9],[69,10,69,11],[69,12,69,13],[69,23,69,25],[67,23,67,25],[68,0,68,5],[68,6,68,7],[68,8,68,9],[68,10,68,11],[68,12,68,13],[68,19,68,20],[68,23,68,25],[67,0,67,5],[67,6,67,7],[67,8,67,9],[67,10,67,11],[67,12,67,13],[67,19,67,20],[63,4,63,6],[63,8,63,9],[63,11,63,13],[63,15,68,15],[63,19,63,20],[50,18,50,19],[50,20,50,22],[50,24,50,25],[51,24,51,25],[63,23,63,25],[65,19,65,20],[65,23,65,25],[66,8,66,9],[66,12,66,13],[66,19,66,20],[66,23,66,25],[58,23,58,25],[59,23,59,25],[60,23,60,25],[62,12,62,13],[62,23,62,25],[53,0,60,0],[53,15,53,21],[53,23,53,25],[55,23,55,25],[56,23,56,25],[57,23,57,25],[48,19,48,20],[48,21,48,22],[48,24,48,25],[49,15,49,16],[49,18,49,20],[49,21,49,22],[49,23,49,25],[42,22,42,24],[43,4,43,6],[43,7,43,8],[43,9,43,12],[43,13,43,15],[43,16,43,17],[43,18,43,21],[43,22,43,24],[42,2,42,5],[42,6,42,7],[42,8,42,11],[42,12,42,15],[42,16,42,17],[42,18,42,21],[40,22,40,24],[41,8,41,9],[41,10,41,11],[41,12,41,14],[41,15,41,16],[41,17,41,18],[41,19,41,21],[41,22,41,24],[40,4,40,6],[40,13,40,15],[40,9,40,10],[40,11,40,12],[40,18,40,19],[40,20,40,21],[38,8,38,10],[38,22,38,24],[39,6,39,8],[39,9,39,11],[39,16,39,18],[39,19,39,21],[39,22,39,24],[36,7,36,8],[36,9,36,11],[36,12,36,15],[36,16,36,18],[36,19,36,21],[36,22,36,24],[39,13,39,14],[34,9,34,11],[34,12,34,15],[34,16,34,18],[34,19,34,21],[34,22,34,25],[35,9,35,11],[35,16,35,18],[35,19,35,21],[35,22,35,24],[35,12,35,14],[30,2,30,11],[30,14,30,25],[31,0,31,5],[31,6,31,12],[31,13,31,15],[31,16,31,17],[31,18,31,20],[31,21,31,22],[31,23,31,25],[27,0,28,4],[27,5,28,11],[27,12,27,19],[28,12,28,25],[29,2,29,5],[29,7,29,11],[29,14,29,17],[29,19,29,25],[11,23,11,25],[17,23,17,24],[18,23,18,25],[20,18,20,22],[21,0,22,11],[21,14,22,15],[21,16,22,17],[21,21,22,22],[21,23,22,24],[10,0,10,1],[11,0,11,1],[11,2,11,6],[11,7,11,12],[11,14,11,19],[11,20,11,22],[5,0,6,1],[5,2,6,6],[5,7,6,14],[6,16,7,21],[6,22,7,25],[7,0,7,1],[7,2,7,6],[7,7,7,14],[0,0,0,2],[0,3,0,12],[0,22,0,25],[2,22,2,25],[3,0,3,5],[3,6,3,10],[3,16,4,25],[4,0,4,5],[4,6,4,10],[4,11,4,14]]}
["SZERZŐDŐ",null,null,{"$f":"IF(Haz!C5>\"\",Haz!C5,0)","v":"1075  Budapest  Rumbach Sebestyén u. 12.   (Társasház)"},null,null,null,null,null,null,null,null,null,{"$f":"Tomb!Q1","v":0},"Ajánlat száma:",null,null,null,null,null,null,{"$f":"IF(AND(Haz!Q6=0),\"Új szerződés:\",IF(AND(Haz!Q6=1,Haz!R6>\"\"),\"Átdolgozás:\",0))","v":"Új szerződés:"},{"$f":"IF(AND(Haz!Q6=0,Haz!Q2>\"\"),502&Haz!Q2,IF(AND(Haz!Q6=1,Haz!R6>\"\"),Haz!R6,0))","v":0}]
[]
["SZERZŐDŐ KÉPVISELÉTÉBEN ELJÁRÓ SZEMÉLY",null,null,null,null,null,null,null,null,null,null,null,null,null,null,null,"Képviselőj:",null,null,null,null,"Kódja:",{"$f":"IF(Tomb!R42>0,VLOOKUP(Tomb!R42,Ker!A2:K150,10,0))","v":0}]
["Név:",null,null,null,null,null,"Vállalkozás:",null,null,null,null,"E-mail címe:",null,null,null,null,{"$f":"IF(Haz!S5>\"\",Haz!S5,0)","v":0}]
[{"$f":"IF(Haz!C6>\"\",Haz!C6,0)","v":"kk"},null,null,null,null,null,{"$f":"IF(Haz!H6>\"\",Haz!H6,0)","v":0},null,null,null,null,{"$f":"IF(Haz!L6>\"\",Haz!L6,0)","v":0}]
["Irányítószám:",null,"Helység:",null,null,null,null,"Út, utca, tér:"]
[null,null,null,null,null,null,null,null,null,null,null,null,null,null,null,null,"Biztosítás igényelt kezdete:",null,null,null,null,null,{"$f":"IF(Haz!W6>0,Haz!W6,0)","v":"2014-12-01"}]
[{"$f":"IF(AND(Haz!$O$7=1,OR(Haz!C6>\"\",Haz!H6>\"\"),Haz!C7>0),Haz!C7,IF(AND(Haz!$O$7=0,OR(Haz!C6>\"\",Haz!H6>\"\"),Haz!C7>=0),Haz!C4,0))","v":1075},null,{"$f":"IF(AND(Haz!$O$7=1,OR(Haz!C6>\"\",Haz!H6>\"\"),Haz!E7>0),Haz!E7,IF(AND(Haz!$O$7=0,OR(Haz!C6>\"\",Haz!H6>\"\"),Haz!E7>=0),Haz!E4,0))","v":"Budapest"},null,null,null,null,{"$f":"IF(AND(Haz!$O$7=1,OR(Haz!C6>\"\",Haz!H6>\"\"),Haz!J7>0),Haz!J7,IF(AND(Haz!$O$7=0,OR(Haz!C6>\"\",Haz!H6>\"\"),Haz!J7>=0),Haz!J4,0))","v":"Rumbach Sebestyén u. 12."}]
{"$rows_left_out":149}