{"text_format":"1","workbook":"xlsx","n_sheets":7,"sheets":["UL001","G1","G2","iPar","oData","oPool","oRes"],"not_rendered":{"charts":2,"images":1,"macros":1,"external_links":0,"defined_names":40,"comments":1,"pivot_tables":0},"unopened":[],"bounds":{"document_bytes":16777216,"sheet_cells":100000,"rows_first":2000,"rows_last":500,"rows_between":2000,"halvings":0,"cell_chars":16384,"cell_head_chars":4096},"cells_cut":0,"cells_raw":0,"read":"whole","date_system":"1900"}

{"sheet":"UL001","index":0,"n_rows":54,"n_cols":10,"rows_kept":54,"cut":false,"hidden":false,"merged":[[39,0,51,2],[53,0,53,9],[0,0,5,9],[6,3,7,3],[6,4,7,4],[6,5,7,5],[6,6,7,6],[6,7,7,7],[6,8,7,8],[18,0,19,1],[6,0,6,1]]}
[]
[]
[]
[]
[]
[]
["ügyfél név",null,null,"eltelt évek","aktuális érték ","Lojalitási \nszámla \nértéke","Jóváírt bónusz  \nértéke","Felvehető összeg (rendszeres díjból)","Felvehető összeg (eseti díjból)","Eseti \nbefizetés"]
["technikai kezdet",{"$f":"PolBeg","v":"2017-06-01"}]
["tartam",25,null,1,{"$f":"oRes!B7+oRes!D7+oRes!E7","v":52339},{"$f":"oRes!D7","v":2464},null,{"$f":"oRes!B7+IF(D9=ROUNDUP(Term/12,0),oRes!D7,0)","v":49875},{"$f":"oRes!E7","v":0},0]
["díjfizetési mód","átutalás",null,2,{"$f":"oRes!B8+oRes!D8+oRes!E8","v":189840},{"$f":"oRes!D8","v":5171},null,{"$f":"oRes!B8+IF(D10=ROUNDUP(Term/12,0),oRes!D8,0)","v":184669},{"$f":"oRes!E8","v":0},0]
["díjfizetési gyakoriság","havi",null,3,{"$f":"oRes!B9+oRes!D9+oRes!E9","v":427090},{"$f":"oRes!D9","v":8133},null,{"$f":"oRes!B9+IF(D11=ROUNDUP(Term/12,0),oRes!D9,0)","v":418957},{"$f":"oRes!E9","v":0},0]
["gyakoriság szerinti díj",20000,null,4,{"$f":"oRes!B10+oRes!D10+oRes!E10","v":739097},{"$f":"oRes!D10","v":28086},null,{"$f":"oRes!B10+IF(D12=ROUNDUP(Term/12,0),oRes!D10,0)","v":711011},{"$f":"oRes!E10","v":0},0]
["biztosítási összeg",{"$f":"MIN(DPrm*PayPa*2,1000000)","v":480000},null,5,{"$f":"oRes!B11+oRes!D11+oRes!E11","v":1082257},{"$f":"oRes!D11","v":49151},null,{"$f":"oRes!B11+IF(D13=ROUNDUP(Term/12,0),oRes!D11,0)","v":1033106},{"$f":"oRes!E11","v":0},0]
["üzleti kedvezmény",0,null,6,{"$f":"oRes!B12+oRes!D12+oRes!E12","v":1462191},{"$f":"oRes!D12","v":74528},null,{"$f":"oRes!B12+IF(D14=ROUNDUP(Term/12,0),oRes!D12,0)","v":1387663},{"$f":"oRes!E12","v":0},0]
["portfolió","Mérsékelt",null,7,{"$f":"oRes!B13+oRes!D13+oRes!E13","v":1878711},{"$f":"oRes!D13","v":101465},null,{"$f":"oRes!B13+IF(D15=ROUNDUP(Term/12,0),oRes!D13,0)","v":1777246},{"$f":"oRes!E13","v":0},0]
["éves várható hozam",7.0000000000000007E-2,null,8,{"$f":"oRes!B14+oRes!D14+oRes!E14","v":2334650},{"$f":"oRes!D14","v":130037},null,{"$f":"oRes!B14+IF(D16=ROUNDUP(Term/12,0),oRes!D14,0)","v":2204613},{"$f":"oRes!E14","v":0},0]
["index",0.05,null,9,{"$f":"oRes!B15+oRes!D15+oRes!E15","v":2832967},{"$f":"oRes!D15","v":160345},null,{"$f":"oRes!B15+IF(D17=ROUNDUP(Term/12,0),oRes!D15,0)","v":2672622},{"$f":"oRes!E15","v":0},0]
[null,null,null,10,{"$f":"oRes!B16+oRes!D16+oRes!E16","v":3376931},{"$f":"IF(D18=ROUNDUP(Term/12,0),0,oRes!D16)","v":96251},{"$f":"IF(D18=ROUNDUP(Term/12,0),oRes!D16,0)+IF(MOD(D18,5)=0,oRes!H16,0)","v":96252},{"$f":"oRes!B16+IF(D18=ROUNDUP(Term/12,0),oRes!D16,0)","v":3280680},{"$f":"oRes!E16","v":0},0]
[{"$f":"ErrMsg","v":""},null,null,11,{"$f":"oRes!B17+oRes!D17+oRes!E17","v":3970005},{"$f":"IF(D19=ROUNDUP(Term/12,0),0,oRes!D17)","v":125677},{"$f":"IF(D19=ROUNDUP(Term/12,0),oRes!D17,0)+IF(MOD(D19,5)=0,oRes!H17,0)","v":0},{"$f":"oRes!B17+IF(D19=ROUNDUP(Term/12,0),oRes!D17,0)","v":3844328},{"$f":"oRes!E17","v":0},0]
[null,null,null,12,{"$f":"oRes!B18+oRes!D18+oRes!E18","v":4615955},{"$f":"IF(D20=ROUNDUP(Term/12,0),0,oRes!D18)","v":156932},{"$f":"IF(D20=ROUNDUP(Term/12,0),oRes!D18,0)+IF(MOD(D20,5)=0,oRes!H18,0)","v":0},{"$f":"oRes!B18+IF(D20=ROUNDUP(Term/12,0),oRes!D18,0)","v":4459023},{"$f":"oRes!E18","v":0},0]
{"$rows_left_out":35}
{"sheet":"G1","index":1,"n_rows":49,"n_cols":4,"rows_kept":49,"cut":false,"hidden":false,"merged":[[0,0,1,0],[0,1,1,1],[0,2,1,2],[0,3,1,3]]}
["eltelt évek","főszámla értéke","ebből jóváírt bónusz","adójóváírás számla értéke"]
[]
[1,{"$f":"'UL001'!E9-oRes!E7-C3","v":52339},{"$f":"+'UL001'!G9","v":0}]
[2,{"$f":"'UL001'!E10-oRes!E8-C4","v":189840},{"$f":"+'UL001'!G10","v":0}]
[3,{"$f":"'UL001'!E11-oRes!E9-C5","v":427090},{"$f":"+'UL001'!G11","v":0}]
[4,{"$f":"'UL001'!E12-oRes!E10-C6","v":739097},{"$f":"+'UL001'!G12","v":0}]
[5,{"$f":"'UL001'!E13-oRes!E11-C7","v":1082257},{"$f":"+'UL001'!G13","v":0}]
[6,{"$f":"'UL001'!E14-oRes!E12-C8","v":1462191},{"$f":"+'UL001'!G14","v":0}]
[7,{"$f":"'UL001'!E15-oRes!E13-C9","v":1878711},{"$f":"+'UL001'!G15","v":0}]
[8,{"$f":"'UL001'!E16-oRes!E14-C10","v":2334650},{"$f":"+'UL001'!G16","v":0}]
[9,{"$f":"'UL001'!E17-oRes!E15-C11","v":2832967},{"$f":"+'UL001'!G17","v":0}]
[10,{"$f":"'UL001'!E18-oRes!E16-C12","v":3280679},{"$f":"+'UL001'!G18","v":96252}]
[11,{"$f":"'UL001'!E19-oRes!E17-C13","v":3970005},{"$f":"+'UL001'!G19","v":0}]
[12,{"$f":"'UL001'!E20-oRes!E18-C14","v":4615955},{"$f":"+'UL001'!G20","v":0}]
[13,{"$f":"'UL001'!E21-oRes!E19-C15","v":5318554},{"$f":"+'UL001'!G21","v":0}]
[14,{"$f":"'UL001'!E22-oRes!E20-C16","v":6082114},{"$f":"+'UL001'!G22","v":0}]
[15,{"$f":"'UL001'!E23-oRes!E21-C17","v":6779730},{"$f":"+'UL001'!G23","v":131422}]
[16,{"$f":"'UL001'!E24-oRes!E22-C18","v":7820663},{"$f":"+'UL001'!G24","v":0}]
[17,{"$f":"'UL001'!E25-oRes!E23-C19","v":8806043},{"$f":"+'UL001'!G25","v":0}]
[18,{"$f":"'UL001'!E26-oRes!E24-C20","v":9872917},{"$f":"+'UL001'!G26","v":0}]
{"$rows_left_out":30}
{"sheet":"G2","index":2,"n_rows":47,"n_cols":4,"rows_kept":47,"cut":false,"hidden":false,"merged":[[0,0,1,0],[0,1,1,1],[0,2,1,2]]}
["eltelt évek","Lojalitási számla értéke","Jóváírt bónusz értéke"]
[]
[1,{"$f":"+'UL001'!F9","v":2464},{"$f":"+'UL001'!G9","v":0},{"$f":"+B3+C3","v":2464}]
[2,{"$f":"+'UL001'!F10","v":5171},{"$f":"+'UL001'!G10","v":0},{"$f":"+B4+C4","v":5171}]
[3,{"$f":"+'UL001'!F11","v":8133},{"$f":"+'UL001'!G11","v":0},8133]
[4,{"$f":"+'UL001'!F12","v":28086},{"$f":"+'UL001'!G12","v":0},28086]
[5,{"$f":"+'UL001'!F13","v":49151},{"$f":"+'UL001'!G13","v":0},49151]
[6,{"$f":"+'UL001'!F14","v":74528},{"$f":"+'UL001'!G14","v":0},74528]
[7,{"$f":"+'UL001'!F15","v":101465},{"$f":"+'UL001'!G15","v":0},101465]
[8,{"$f":"+'UL001'!F16","v":130037},{"$f":"+'UL001'!G16","v":0},130037]
[9,{"$f":"+'UL001'!F17","v":160345},{"$f":"+'UL001'!G17","v":0},160345]
[10,{"$f":"+'UL001'!F18","v":96251},{"$f":"+'UL001'!G18","v":96252},192503]
[11,{"$f":"+'UL001'!F19","v":125677},{"$f":"+'UL001'!G19","v":0},125677]
[12,{"$f":"+'UL001'!F20","v":156932},{"$f":"+'UL001'!G20","v":0},156932]
[13,{"$f":"+'UL001'!F21","v":190130},{"$f":"+'UL001'!G21","v":0},190130]
[14,{"$f":"+'UL001'!F22","v":225393},{"$f":"+'UL001'!G22","v":0},225393]
[15,{"$f":"+'UL001'!F23","v":131423},{"$f":"+'UL001'!G23","v":131422},262845]
[16,{"$f":"+'UL001'!F24","v":174806},{"$f":"+'UL001'!G24","v":0},174806]
[17,{"$f":"+'UL001'!F25","v":220823},{"$f":"+'UL001'!G25","v":0},220823]
[18,{"$f":"+'UL001'!F26","v":269601},{"$f":"+'UL001'!G26","v":0},269601]
{"$rows_left_out":28}
{"sheet":"iPar","index":3,"n_rows":86,"n_cols":40,"rows_kept":86,"cut":false,"hidden":true,"merged":[]}
["PolBeg",{"$f":"DATE(YEAR(NOW()),MONTH(NOW())+1,1)","v":"2017-06-01"},null,null,null,null,null,null,null,null,"PayMethod",null,"PayPa","Portfolios","Term",null,"Yields","Prm",null,"Disc"]
["PolEnd",{"$f":"DATE(YEAR(PolBeg),MONTH(PolBeg)+Term,1)","v":"2042-06-01"},null,null,null,null,null,null,null,null,"átutalás",1,"havi","Lendületes","min",10,0,"min",144000,"min",0]
["Term",{"$f":"'UL001'!B9*12","v":300},null,null,null,null,null,null,null,null,"csekk",3,"negyedéves","Mérsékelt","max",45,0.01,"min topup",35000,"max",1]
["EntryAge",50,null,null,null,null,null,null,null,null,"csoportos",2,"féléves","Óvatos","check",{"$f":"IF(T<P2, \"Minimálisnál kisebb tartam.\",\"\")","v":""},0.02,"check",{"$f":"IF(DPrm*PayPa<S2, \"Minimálisnál kisebb díj.\",\"\")","v":""}]
[null,null,null,null,null,null,null,null,null,null,null,null,"éves","Nincs",null,{"$f":"IF(T>P3, \"Maximálisnál nagyobb tartam.\",\"\")","v":""},0.03,null,{"$f":"IF(OR(DiscFEL<U2,DiscFEL>U3), \"Hibás üzleti kedvezmény.\",\"\")","v":""}]
["PayPa",{"$f":"IF(PP=\"havi\",12,IF(PP=\"negyedéves\",4,IF(PP=\"féléves\",2,1)))","v":12},null,null,null,null,null,null,null,null,null,null,null,null,null,null,0.04]
["PayMod",{"$f":"VLOOKUP(PM,K2:L4,2)","v":1},null,null,null,null,null,null,null,null,null,null,"ErrMsg",{"$f":"IF(hiba1=\"\",IF(hiba2=\"\",IF(hiba3=\"\",IF(hiba4=\"\",IF(ErrFromVB=\"\",\"\",ErrFromVB),hiba4),hiba3),hiba2),hiba1)","v":""},null,null,0.05]
["DuePrm",{"$f":"P","v":20000},null,null,null,null,null,null,null,null,null,null,"ErrMsg",null,null,null,0.06]
["PensionPart",1,null,null,"portfolio","ann.KBF","dailyKBF",null,null,null,null,null,null,null,null,null,7.0000000000000007E-2]
["DiscFEL",{"$f":"+D","v":0},null,"Lendületes",1,8.3000000000000001E-3,{"$f":"ROUND(F10/365,8)","v":2.2739999999999999E-5},null,null,null,null,null,"MaxG2",{"$f":"+MAX('G2'!D3:D47)","v":376170},null,null,0.08]
["Portfolio",{"$f":"MATCH(PO,iPar!N2:N5,0)","v":2},null,"Mérsékelt",2,7.4999999999999997E-3,2.0550000000000001E-5,null,null,null,null,null,null,null,null,null,0.09]
["Yield",{"$f":"YI","v":7.0000000000000007E-2},null,"Óvatos",3,6.4500000000000009E-3,1.7669999999999999E-5,null,null,null,null,null,null,null,null,null,0.1]
["Index",0.05,null,"Üres",4,0,{"$f":"ROUND(F13/365,8)","v":0},null,null,null,null,null,null,null,null,null,0.11]
[null,null,null,null,null,null,null,null,null,null,null,null,null,null,null,null,0.12]
["fPolBeg","fPolEnd","fTermType","fTerm","fInsPers","fSex","fEntAge","fFirstIndex","fLastIndex","fLapsePeriod","fKBFperiod","fKBFshift","fMinTopUp",null,null,null,0.13,null,null,null,null,null,null,null,null,null,null,null,null,"fPremTabID","fMinSex","fMaxSex","fMinAge","fMaxAge","fNetPrm",null,"fDur","fTopUpPen","fTopUpNon","fPartSurr"]
[{"$f":"+PolBeg","v":"2017-06-01"},{"$f":"+PolEnd","v":"2042-06-01"},0,{"$f":"+Term","v":300},111,1,{"$f":"+Age","v":50},1,0,0,3,3,{"$f":"+MinTopUp","v":35000},null,null,null,0.14000000000000001,null,null,null,null,null,null,null,null,null,null,null,null,null,null,null,null,null,null,null,1,{"$f":"'UL001'!J9","v":0}]
[null,null,null,null,null,null,null,null,null,null,null,null,null,null,null,null,0.15,null,null,null,null,null,null,null,null,null,null,null,null,null,null,null,null,null,null,null,2,{"$f":"'UL001'!J10","v":0}]
["fAccountNr","fTarOption","fTarifNr","fRisk","fIndexType","fIndex","fRiskBeg","fRiskEnd","fPayEnd","fPayReg","fPayPa","fPayMethod","fGrossPrm","fFirstPrm","fPensionPart","fMinPool",null,null,null,null,null,null,null,null,null,null,null,null,null,null,null,null,null,null,null,null,3,{"$f":"'UL001'!J11","v":0}]
[1,0,11,5,101,{"$f":"Index","v":0.05},{"$f":"+PolBeg","v":"2017-06-01"},{"$f":"+PolEnd","v":"2042-06-01"},{"$f":"+H19","v":"2042-06-01"},1,{"$f":"+PayPa","v":12},{"$f":"+PayMod","v":1},{"$f":"+DPrm*PayPa","v":240000},{"$f":"+M19","v":240000},{"$f":"PensionPart","v":1},100000,"UL001","alap",null,null,null,null,null,null,null,null,null,null,null,null,null,null,null,null,null,null,4,{"$f":"'UL001'!J12","v":0}]
[2,3,12,5,0,0,{"$f":"+G19","v":"2017-06-01"},"2042-06-01","2042-06-01",2,1,1,0,0,1,0,"UL001","eseti",null,null,null,null,null,null,null,null,null,null,null,null,null,null,null,null,null,null,5,{"$f":"'UL001'!J13","v":0}]
{"$rows_left_out":67}
{"sheet":"oData","index":4,"n_rows":301,"n_cols":25,"rows_kept":301,"cut":false,"hidden":true,"merged":[]}
["fAccountNr","fPremiumType","fPrmStatus","fPremiumSum","fPremiumFrom","fPremiumTo","fInvestDate",null,"fID","fAccountID","fPolBodyNr","fUnitType","fInsPers","fFromID","fFundID","fTransType","fFormula","fValue1","fValue2","fValue3","fValue4","fValue5","fValue6","fValidFrom","fValidTo"]
[1,101,3,20000,"2017-06-01","2017-07-01","2017-06-01",null,1,1,1,1,0,30,0,202,6,0.3,0,72000,12,72000,0,"2017-05-01","2042-05-31"]
[1,101,3,20000,"2017-07-01","2017-08-01","2017-07-01",null,2,1,1,1,0,30,0,202,6,0.3,0,147600,24,147600,0,"2017-05-01","2042-05-31"]
[1,101,3,20000,"2017-08-01","2017-09-01","2017-08-01",null,3,1,1,1,0,30,0,202,6,0.14000000000000001,0,105924,36,105924,0,"2017-05-01","2042-05-31"]
[1,101,3,20000,"2017-09-01","2017-10-01","2017-09-01",null,4,1,1,1,0,22,0,203,11,0.06,2000000000,0,0,0,0,"2017-05-01","2042-05-31"]
[1,101,3,20000,"2017-10-01","2017-11-01","2017-10-01",null,5,1,1,3,0,28,2690,225,9,1.6666700000000001E-3,0,1200,0,0,0,"2017-06-01","2042-05-31"]
[1,101,3,20000,"2017-11-01","2017-12-01","2017-11-01",null,6,1,1,1,0,15,0,260,7,3.0000000000000001E-3,300,1500,0,0,0,"2017-06-01","2042-05-31"]
[1,101,3,20000,"2017-12-01","2018-01-01","2017-12-01",null,7,1,1,3,0,17,0,262,5,1,0,0,0,0,0,"2017-06-01","2042-05-31"]
[1,101,3,20000,"2018-01-01","2018-02-01","2018-01-01",null,8,1,1,1,0,32,0,804,5,-0.01,0,0,0,0,3,"2017-05-01","2042-05-31"]
[1,101,3,20000,"2018-02-01","2018-03-01","2018-02-01",null,9,1,1,3,0,111,0,850,10,1000000,0,1200,0,0,0,"2017-06-01","2042-05-31"]
[1,101,3,20000,"2018-03-01","2018-04-01","2018-03-01",null,10,1,1,1,0,112,1,899,5,-2.0550000000000001E-5,0,0,0,0,1,"2017-06-01","2042-05-31"]
[1,101,3,20000,"2018-04-01","2018-05-01","2018-04-01",null,11,1,1,3,0,112,1,899,5,-2.0550000000000001E-5,0,0,0,0,1,"2017-06-01","2042-05-31"]
[1,101,3,20000,"2018-05-01","2018-06-01","2018-05-01",null,12,1,1,1,0,27,2690,225,9,1.6666700000000001E-3,37,1200,0,0,0,"2020-06-01","2042-05-31"]
[1,101,3,21000,"2018-06-01","2018-07-01","2018-06-01",null,13,1,1,3,0,26,0,803,4,-0.05,325524,1,0,0,3,"2020-06-01","2032-05-31"]
[1,101,3,21000,"2018-07-01","2018-08-01","2018-07-01",null,14,1,1,1,0,33,0,801,5,-0.01,0,0,0,0,3,"2022-06-01","2042-05-31"]
[1,101,3,21000,"2018-08-01","2018-09-01","2018-08-01",null,15,1,1,3,0,36,0,950,5,0.5,0,0,0,0,1,"2027-06-01","2027-06-30"]
[1,101,3,21000,"2018-09-01","2018-10-01","2018-09-01",null,16,1,1,3,0,36,0,950,5,0.5,0,0,0,0,1,"2032-06-01","2032-06-30"]
[1,101,3,21000,"2018-10-01","2018-11-01","2018-10-01",null,17,1,1,3,0,26,0,803,4,-0.08,325524,1,0,0,3,"2032-06-01","2037-05-31"]
[1,101,3,21000,"2018-11-01","2018-12-01","2018-11-01",null,18,1,1,3,0,36,0,950,5,0.5,0,0,0,0,1,"2037-06-01","2037-06-30"]
[1,101,3,21000,"2018-12-01","2019-01-01","2018-12-01",null,19,1,1,3,0,36,0,950,5,0.5,0,0,0,0,1,"2042-06-01","2042-06-01"]
{"$rows_left_out":282}
{"sheet":"oPool","index":5,"n_rows":305,"n_cols":93,"rows_kept":305,"cut":false,"hidden":true,"merged":[]}
[null,"ID",3,4,5,6,7,8,9,10,11,12,13,14,15,16,17,18,19,20,21,22,23,24,25,26,27,28,29,30,31,32,33,34,35,36,37,38,39,40,41,42,43,44,45,46,47,48,49,50,51,52,53,54,55,56,57,58,59,60,61,62,63,64,65,66,67,68,69,70,71,72,73,74,75,76,77,78,79]
[null,"Account",1,1,1,1,1,1,1,1,1,1,1,1,1,1,1,1,1,1,1,1,1,1,1,1,1,1,1,1,1,1,1,1,1,1,1,1,1,1,1,1,1,1,1,1,1,1,1,1,1,1,2,2,2,2,2,2,2,2,2,2,3,3,3,3,3,3,3,3,3,3,4,4,4,4,4,4,4,null,{"$f":"MIN(CC$6:CC$1048576)","v":0},{"$f":"MIN(CD$6:CD$1048576)","v":0},0,0,0,0,null,{"$f":"MIN(CJ$6:CJ$1048576)","v":0},0,0,0,0,0]
[null,"UnitType",1,1,1,1,1,1,1,1,1,1,1,1,1,1,1,1,1,1,2,2,2,2,2,2,2,2,2,2,2,2,2,2,2,2,3,3,3,3,3,3,3,3,3,3,3,3,3,3,3,3,4,4,4,4,4,4,4,4,4,3,4,4,4,4,4,4,4,4,4,3,5,5,5,5,5,5,3,null,{"$f":"MAX(CC$6:CC$1048576)","v":0},{"$f":"MAX(CD$6:CD$1048576)","v":0},0,0,0,0,null,{"$f":"MAX(CJ$6:CJ$1048576)","v":0},0,0,0,0,0]
[null,"TransType",null,0,100,202,203,204,225,800,801,803,804,805,825,899,950,260,400,1000,0,100,202,203,204,225,800,801,803,804,805,825,899,260,400,1000,0,100,202,203,204,225,800,801,803,804,805,825,950,850,1000,262,0,100,203,225,800,260,400,899,1000,262,0,100,203,225,800,260,400,899,1000,262,0,100,225,800,899,1000,262,null,"open + CF = close",null,null,null,null,null,null,"open = close-1"]
["Date","PolMo","Prm w/o index","OpPool","Prm","Exp202","Exp203","Exp204","Exp225","Yield","Bon801","Bon803","Bon804","Bon805","Bon825","Bon899","Tr950","Exp260","PartSurr","ClPool","OpPool","Prm","Exp202","Exp203","Exp204","Exp225","Yield","Bon801","Bon803","Bon804","Bon805","Bon825","Bon899","Exp260","PartSurr","ClPool","OpPool","Prm","Exp202","Exp203","Exp204","Exp225","Yield","Bon801","Bon803","Bon804","Bon805","Bon825","Bon950","BonOUT","ClPool","SurrFee","OpPool","Prm","Exp203","Exp225","Yield","Exp260","PartSurr","Bon899","ClPool","SurrFee","OpPool","Prm","Exp203","Exp225","Yield","Exp260","PartSurr","Bon899","ClPool","SurrFee","OpPool","Prm","Exp225","Yield","Bon899","ClPool","SurrFee"]
["2017-06-01",1,20000,0,20000,-14800,-1200,0,0,23,0,0,0,0,0,0,0,0,0,4023,0,0,0,0,0,0,0,0,0,0,0,0,0,0,0,0,0,0,0,0,0,0,1,0,0,200,0,0,0,0,201,0,0,0,0,0,0,0,0,0,0,0,0,0,0,0,0,0,0,0,0,0,0,0,0,0,0,0,0,null,{"$f":"SUM(D6:S6)-T6","v":0},{"$f":"SUM(U6:AI6)-AJ6","v":0},{"$f":"SUM(AK6:AX6)-AY6","v":0},{"$f":"SUM(BA6:BH6)-BI6","v":0},{"$f":"SUM(BK6:BR6)-BS6","v":0},{"$f":"SUM(BU6:BY6)-BZ6","v":0}]
["2017-07-01",2,20000,4023,20000,-14800,-1200,0,0,45,0,0,0,0,0,0,0,0,0,8068,0,0,0,0,0,0,0,0,0,0,0,0,0,0,0,0,201,0,0,0,0,-1,2,0,0,200,0,0,0,0,402,0,0,0,0,0,0,0,0,0,0,0,0,0,0,0,0,0,0,0,0,0,0,0,0,0,0,0,0,null,0,0,0,0,0,0,null,{"$f":"+T6-D7","v":0},{"$f":"+AJ6-U7","v":0},{"$f":"+AY6-AK7","v":0},{"$f":"+BI6-BA7","v":0},{"$f":"+BS6-BK7","v":0},{"$f":"+BZ6-BU7","v":0}]
["2017-08-01",3,20000,8068,20000,-14800,-1200,0,0,68,0,0,0,0,0,0,0,0,0,12136,0,0,0,0,0,0,0,0,0,0,0,0,0,0,0,0,402,0,0,0,0,-1,3,0,0,200,0,0,0,0,604,0,0,0,0,0,0,0,0,0,0,0,0,0,0,0,0,0,0,0,0,0,0,0,0,0,0,0,0,null,0,0,0,0,0,0,null,0,0,0,0,0,0]
["2017-09-01",4,20000,12136,20000,-14800,-1200,0,0,91,0,0,0,0,0,2,0,0,0,16229,0,0,0,0,0,0,0,0,0,0,0,0,0,0,0,0,604,0,0,0,0,-1,5,0,0,200,0,0,0,0,808,0,0,0,0,0,0,0,0,0,0,0,0,0,0,0,0,0,0,0,0,0,0,0,0,0,0,0,0,null,0,0,0,0,0,0,null,0,0,0,0,0,0]
["2017-10-01",5,20000,16229,20000,-14800,-1200,0,0,114,0,0,0,0,0,0,0,0,0,20343,0,0,0,0,0,0,0,0,0,0,0,0,0,0,0,0,808,0,0,0,0,-2,6,0,0,200,0,0,0,0,1012,0,0,0,0,0,0,0,0,0,0,0,0,0,0,0,0,0,0,0,0,0,0,0,0,0,0,0,0,null,0,0,0,0,0,0,null,0,0,0,0,0,0]
["2017-11-01",6,20000,20343,20000,-14800,-1200,0,0,138,0,0,0,0,0,0,0,0,0,24481,0,0,0,0,0,0,0,0,0,0,0,0,0,0,0,0,1012,0,0,0,0,-2,7,0,0,200,0,0,0,0,1217,0,0,0,0,0,0,0,0,0,0,0,0,0,0,0,0,0,0,0,0,0,0,0,0,0,0,0,0,null,0,0,0,0,0,0,null,0,0,0,0,0,0]
["2017-12-01",7,20000,24481,20000,-14800,-1200,0,0,161,0,0,0,0,0,24,0,0,0,28666,0,0,0,0,0,0,0,0,0,0,0,0,0,0,0,0,1217,0,0,0,0,-2,8,0,0,200,0,0,0,0,1423,0,0,0,0,0,0,0,0,0,0,0,0,0,0,0,0,0,0,0,0,0,0,0,0,0,0,0,0,null,0,0,0,0,0,0,null,0,0,0,0,0,0]
["2018-01-01",8,20000,28666,20000,-14800,-1200,0,0,185,0,0,0,0,0,0,0,0,0,32851,0,0,0,0,0,0,0,0,0,0,0,0,0,0,0,0,1423,0,0,0,0,-3,9,0,0,200,0,0,0,0,1629,0,0,0,0,0,0,0,0,0,0,0,0,0,0,0,0,0,0,0,0,0,0,0,0,0,0,0,0,null,0,0,0,0,0,0,null,0,0,0,0,0,0]
["2018-02-01",9,20000,32851,20000,-14800,-1200,0,0,208,0,0,0,0,0,0,0,0,0,37059,0,0,0,0,0,0,0,0,0,0,0,0,0,0,0,0,1629,0,0,0,0,-3,10,0,0,200,0,0,0,0,1836,0,0,0,0,0,0,0,0,0,0,0,0,0,0,0,0,0,0,0,0,0,0,0,0,0,0,0,0,null,0,0,0,0,0,0,null,0,0,0,0,0,0]
["2018-03-01",10,20000,37059,20000,-14800,-1200,0,0,232,0,0,0,0,0,48,0,0,0,41339,0,0,0,0,0,0,0,0,0,0,0,0,0,0,0,0,1836,0,0,0,0,-3,12,0,0,200,0,0,0,0,2045,0,0,0,0,0,0,0,0,0,0,0,0,0,0,0,0,0,0,0,0,0,0,0,0,0,0,0,0,null,0,0,0,0,0,0,null,0,0,0,0,0,0]
["2018-04-01",11,20000,41339,20000,-14800,-1200,0,0,256,0,0,0,0,0,0,0,0,0,45595,0,0,0,0,0,0,0,0,0,0,0,0,0,0,0,0,2045,0,0,0,0,-4,13,0,0,200,0,0,0,0,2254,0,0,0,0,0,0,0,0,0,0,0,0,0,0,0,0,0,0,0,0,0,0,0,0,0,0,0,0,null,0,0,0,0,0,0,null,0,0,0,0,0,0]
["2018-05-01",12,20000,45595,20000,-14800,-1200,0,0,280,0,0,0,0,0,0,0,0,0,49875,0,0,0,0,0,0,0,0,0,0,0,0,0,0,0,0,2254,0,0,0,0,-4,14,0,0,200,0,0,0,0,2464,0,0,0,0,0,0,0,0,0,0,0,0,0,0,0,0,0,0,0,0,0,0,0,0,0,0,0,0,null,0,0,0,0,0,0,null,0,0,0,0,0,0]
["2018-06-01",13,20000,49875,21000,-9240,-1260,0,0,341,0,0,0,0,0,71,0,0,0,60787,0,0,0,0,0,0,0,0,0,0,0,0,0,0,0,0,2464,0,0,0,0,-4,15,0,0,210,0,0,0,0,2685,0,0,0,0,0,0,0,0,0,0,0,0,0,0,0,0,0,0,0,0,0,0,0,0,0,0,0,0,null,0,0,0,0,0,0,null,0,0,0,0,0,0]
["2018-07-01",14,20000,60787,21000,-9240,-1260,0,0,403,0,0,0,0,0,0,0,0,0,71690,0,0,0,0,0,0,0,0,0,0,0,0,0,0,0,0,2685,0,0,0,0,-5,16,0,0,210,0,0,0,0,2906,0,0,0,0,0,0,0,0,0,0,0,0,0,0,0,0,0,0,0,0,0,0,0,0,0,0,0,0,null,0,0,0,0,0,0,null,0,0,0,0,0,0]
["2018-08-01",15,20000,71690,21000,-9240,-1260,0,0,465,0,0,0,0,0,0,0,0,0,82655,0,0,0,0,0,0,0,0,0,0,0,0,0,0,0,0,2906,0,0,0,0,-5,18,0,0,210,0,0,0,0,3129,0,0,0,0,0,0,0,0,0,0,0,0,0,0,0,0,0,0,0,0,0,0,0,0,0,0,0,0,null,0,0,0,0,0,0,null,0,0,0,0,0,0]
{"$rows_left_out":286}
{"sheet":"oRes","index":6,"n_rows":31,"n_cols":12,"rows_kept":31,"cut":false,"hidden":true,"merged":[[4,1,4,6],[4,8,4,9],[4,10,4,11]]}
["oszlop",{"$f":"+oPool!T1","v":20},{"$f":"+oPool!AJ1","v":36},{"$f":"+oPool!AY1","v":51},{"$f":"+oPool!BI1","v":61},{"$f":"+oPool!BS1","v":71},{"$f":"+oPool!BZ1","v":78},{"$f":"+oPool!Q1","v":17},{"$f":"+oPool!BV1","v":74},{"$f":"+oPool!CA1","v":79},{"$f":"+oPool!C1","v":3},{"$f":"+oPool!E1","v":5}]
["típus",1,1,1,1,1,1,0,0,1,0,0]
["sorszám",2,3,4,5,6,7,8,9,10,11,12]
["utolsó adó.",0]
[null,"aktuális tőkeértékek",null,null,null,null,null,"bónusz","adójóváírás",null,"díjak"]
["bizt.év","alap (NYC)","alap (nNYC)","lojalitás","eseti (NYC)","eseti (nNYC)","adó-jóváírás","fel-szabadítás","jóváírás","vissza +20%","index nélkül","indexszel"]
[1,49875,0,2464,0,0,0,0,0,0,240000,240000]
[2,184669,0,5171,0,0,0,0,0,0,240000,252000]
[3,418957,0,8133,0,0,0,0,0,0,240000,264600]
[4,711011,0,28086,0,0,0,0,0,0,240000,277824]
[5,1033106,0,49151,0,0,0,0,0,0,240000,291720]
[6,1387663,0,74528,0,0,0,0,0,0,240000,306312]
[7,1777246,0,101465,0,0,0,0,0,0,240000,321624]
[8,2204613,0,130037,0,0,0,0,0,0,240000,337704]
[9,2672622,0,160345,0,0,0,0,0,0,240000,354588]
[10,3280680,0,96251,0,0,0,96252,0,0,240000,372312]
[11,3844328,0,125677,0,0,0,0,0,0,240000,390924]
[12,4459023,0,156932,0,0,0,0,0,0,240000,410472]
[13,5128424,0,190130,0,0,0,0,0,0,240000,430992]
[14,5856721,0,225393,0,0,0,0,0,0,240000,452544]
{"$rows_left_out":11}