{"text_format":"1","workbook":"xlsx","n_sheets":7,"sheets":["SN005","G1","G2","iPar","oData","oPool","oRes"],"not_rendered":{"charts":2,"images":1,"macros":1,"external_links":0,"defined_names":43,"comments":1,"pivot_tables":0},"unopened":[],"bounds":{"document_bytes":16777216,"sheet_cells":100000,"rows_first":2000,"rows_last":500,"rows_between":2000,"halvings":0,"cell_chars":16384,"cell_head_chars":4096},"cells_cut":0,"cells_raw":0,"read":"whole","date_system":"1900"}

{"sheet":"SN005","index":0,"n_rows":64,"n_cols":12,"rows_kept":64,"cut":false,"hidden":false,"merged":[[6,8,7,8],[63,0,63,11],[0,0,5,10],[6,3,7,3],[6,4,7,4],[6,5,7,5],[6,6,7,6],[6,7,7,7],[6,9,7,9],[6,11,7,11],[21,0,22,1],[6,10,7,10],[6,0,6,1]]}
[]
[]
[]
[]
[]
[]
["ügyfél név",null,null,"eltelt évek","aktuális érték ","lojalitási \nszámla \nértéke","jóváírt bónusz értéke","adójóváírás \nszámla \nértéke","felvehető összeg  összesen (nyugdíjcélú)","nyugdíjcélú eseti \nbefizetés ","szabad felhasználású megtakarítás értéke (100%-ban felvehető)","szabad felhasználású eseti \nbefizetés "]
["technikai kezdet","2018-02-01"]
["bizt. szül. dátuma","1976-03-25",null,1,{"$f":"oRes!B7+oRes!D7+oRes!E7+oRes!G7","v":80997},{"$f":"oRes!D7","v":7278},null,{"$f":"oRes!G7","v":0},{"$f":"oRes!B7+oRes!E7+oRes!G7+IF(D9=ROUNDUP(Term2/12,0),oRes!D7,0)","v":73719},0,{"$f":"IF(oRes!F7=0,\"\",oRes!F7)","v":""},0]
["belépési kor",{"$f":"Age","v":42},null,2,{"$f":"oRes!B8+oRes!D8+oRes!E8+oRes!G8","v":353212},{"$f":"oRes!D8","v":15058},null,{"$f":"oRes!G8","v":67341},{"$f":"oRes!B8+oRes!E8+oRes!G8+IF(D10=ROUNDUP(Term2/12,0),oRes!D8,0)","v":338154},0,{"$f":"IF(oRes!F8=0,\"\",oRes!F8)","v":""},0]
["lejárat dátuma",{"$f":"PolEnd","v":"2041-03-25"},null,3,{"$f":"oRes!B9+oRes!D9+oRes!E9+oRes!G9","v":778491},{"$f":"oRes!D9","v":23376},null,{"$f":"oRes!G9","v":146044},{"$f":"oRes!B9+oRes!E9+oRes!G9+IF(D11=ROUNDUP(Term2/12,0),oRes!D9,0)","v":755115},0,{"$f":"IF(oRes!F9=0,\"\",oRes!F9)","v":""},0]
["tartam (év-hó-nap)",{"$f":"sTerm","v":"23-1-24"},null,4,{"$f":"oRes!B10+oRes!D10+oRes!E10+oRes!G10","v":1310491},{"$f":"oRes!D10","v":56920},null,{"$f":"oRes!G10","v":230773},{"$f":"oRes!B10+oRes!E10+oRes!G10+IF(D12=ROUNDUP(Term2/12,0),oRes!D10,0)","v":1253571},0,{"$f":"IF(oRes!F10=0,\"\",oRes!F10)","v":""},0]
["díjfizetési mód","csoportos",null,5,{"$f":"oRes!B11+oRes!D11+oRes!E11+oRes!G11","v":1881560},{"$f":"oRes!D11","v":91551},null,{"$f":"oRes!G11","v":321893},{"$f":"oRes!B11+oRes!E11+oRes!G11+IF(D13=ROUNDUP(Term2/12,0),oRes!D11,0)","v":1790009},0,{"$f":"IF(oRes!F11=0,\"\",oRes!F11)","v":""},0]
["díjfizetési gyakoriság","havi",null,6,{"$f":"oRes!B12+oRes!D12+oRes!E12+oRes!G12","v":2493992},{"$f":"oRes!D12","v":127289},null,{"$f":"oRes!G12","v":419782},{"$f":"oRes!B12+oRes!E12+oRes!G12+IF(D14=ROUNDUP(Term2/12,0),oRes!D12,0)","v":2366703},0,{"$f":"IF(oRes!F12=0,\"\",oRes!F12)","v":""},0]
["gyakoriság szerinti díj",30000,null,7,{"$f":"oRes!B13+oRes!D13+oRes!E13+oRes!G13","v":3150260},{"$f":"oRes!D13","v":164180},null,{"$f":"oRes!G13","v":524845},{"$f":"oRes!B13+oRes!E13+oRes!G13+IF(D15=ROUNDUP(Term2/12,0),oRes!D13,0)","v":2986080},0,{"$f":"IF(oRes!F13=0,\"\",oRes!F13)","v":""},0]
["biztosítási összeg",{"$f":"MIN(DPrm*PayPa*2,1000000)","v":720000},null,8,{"$f":"oRes!B14+oRes!D14+oRes!E14+oRes!G14","v":3852810},{"$f":"oRes!D14","v":202274},null,{"$f":"oRes!G14","v":637488},{"$f":"oRes!B14+oRes!E14+oRes!G14+IF(D16=ROUNDUP(Term2/12,0),oRes!D14,0)","v":3650536},0,{"$f":"IF(oRes!F14=0,\"\",oRes!F14)","v":""},0]
["üzleti kedvezmény",0,null,9,{"$f":"oRes!B15+oRes!D15+oRes!E15+oRes!G15","v":4604413},{"$f":"oRes!D15","v":241616},null,{"$f":"oRes!G15","v":758165},{"$f":"oRes!B15+oRes!E15+oRes!G15+IF(D17=ROUNDUP(Term2/12,0),oRes!D15,0)","v":4362797},0,{"$f":"IF(oRes!F15=0,\"\",oRes!F15)","v":""},0]
["portfolió","Lendületes",null,10,{"$f":"oRes!B16+oRes!D16+oRes!E16+oRes!G16","v":5407885},{"$f":"IF(D18=ROUNDUP(Term2/12,0),0,oRes!D16)","v":141127},{"$f":"IF(D18=ROUNDUP(Term2/12,0),oRes!D16,0)+IF(MOD(D18,5)=0,oRes!H16,0)","v":141128},{"$f":"oRes!G16","v":887341},{"$f":"oRes!B16+oRes!E16+oRes!G16+IF(D18=ROUNDUP(Term2/12,0),oRes!D16,0)","v":5266758},0,{"$f":"IF(oRes!F16=0,\"\",oRes!F16)","v":""},0]
["éves várható hozam",0.04,null,11,{"$f":"oRes!B17+oRes!D17+oRes!E17+oRes!G17","v":6266365},{"$f":"IF(D19=ROUNDUP(Term2/12,0),0,oRes!D17)","v":180398},{"$f":"IF(D19=ROUNDUP(Term2/12,0),oRes!D17,0)+IF(MOD(D19,5)=0,oRes!H17,0)","v":0},{"$f":"oRes!G17","v":1025535},{"$f":"oRes!B17+oRes!E17+oRes!G17+IF(D19=ROUNDUP(Term2/12,0),oRes!D17,0)","v":6085967},0,{"$f":"IF(oRes!F17=0,\"\",oRes!F17)","v":""},0]
["index",0.05,null,12,{"$f":"oRes!B18+oRes!D18+oRes!E18+oRes!G18","v":7182731},{"$f":"IF(D20=ROUNDUP(Term2/12,0),0,oRes!D18)","v":221014},{"$f":"IF(D20=ROUNDUP(Term2/12,0),oRes!D18,0)+IF(MOD(D20,5)=0,oRes!H18,0)","v":0},{"$f":"oRes!G18","v":1173227},{"$f":"oRes!B18+oRes!E18+oRes!G18+IF(D20=ROUNDUP(Term2/12,0),oRes!D18,0)","v":6961717},0,{"$f":"IF(oRes!F18=0,\"\",oRes!F18)","v":""},0]
{"$rows_left_out":45}
{"sheet":"G1","index":1,"n_rows":59,"n_cols":4,"rows_kept":59,"cut":false,"hidden":false,"merged":[[0,3,1,3],[0,0,1,0],[0,1,1,1],[0,2,1,2]]}
["eltelt évek","főszámla értéke","ebből jóváírt bónusz","adójóváírás számla értéke"]
[]
[1,{"$f":"'SN005'!E9-'SN005'!H9-oRes!E7-C3","v":80997},{"$f":"+'SN005'!G9","v":0},{"$f":"+oRes!G7","v":0}]
[2,{"$f":"'SN005'!E10-'SN005'!H10-oRes!E8-C4","v":285871},{"$f":"+'SN005'!G10","v":0},{"$f":"+oRes!G8","v":67341}]
[3,{"$f":"'SN005'!E11-'SN005'!H11-oRes!E9-C5","v":632447},{"$f":"+'SN005'!G11","v":0},{"$f":"+oRes!G9","v":146044}]
[4,{"$f":"'SN005'!E12-'SN005'!H12-oRes!E10-C6","v":1079718},{"$f":"+'SN005'!G12","v":0},{"$f":"+oRes!G10","v":230773}]
[5,{"$f":"'SN005'!E13-'SN005'!H13-oRes!E11-C7","v":1559667},{"$f":"+'SN005'!G13","v":0},{"$f":"+oRes!G11","v":321893}]
[6,{"$f":"'SN005'!E14-'SN005'!H14-oRes!E12-C8","v":2074210},{"$f":"+'SN005'!G14","v":0},{"$f":"+oRes!G12","v":419782}]
[7,{"$f":"'SN005'!E15-'SN005'!H15-oRes!E13-C9","v":2625415},{"$f":"+'SN005'!G15","v":0},{"$f":"+oRes!G13","v":524845}]
[8,{"$f":"'SN005'!E16-'SN005'!H16-oRes!E14-C10","v":3215322},{"$f":"+'SN005'!G16","v":0},{"$f":"+oRes!G14","v":637488}]
[9,{"$f":"'SN005'!E17-'SN005'!H17-oRes!E15-C11","v":3846248},{"$f":"+'SN005'!G17","v":0},{"$f":"+oRes!G15","v":758165}]
[10,{"$f":"'SN005'!E18-'SN005'!H18-oRes!E16-C12","v":4379416},{"$f":"+'SN005'!G18","v":141128},{"$f":"+oRes!G16","v":887341}]
[11,{"$f":"'SN005'!E19-'SN005'!H19-oRes!E17-C13","v":5240830},{"$f":"+'SN005'!G19","v":0},{"$f":"+oRes!G17","v":1025535}]
[12,{"$f":"'SN005'!E20-'SN005'!H20-oRes!E18-C14","v":6009504},{"$f":"+'SN005'!G20","v":0},{"$f":"+oRes!G18","v":1173227}]
[13,{"$f":"'SN005'!E21-'SN005'!H21-oRes!E19-C15","v":6829472},{"$f":"+'SN005'!G21","v":0},{"$f":"+oRes!G19","v":1330979}]
[14,{"$f":"'SN005'!E22-'SN005'!H22-oRes!E20-C16","v":7703641},{"$f":"+'SN005'!G22","v":0},{"$f":"+oRes!G20","v":1499371}]
[15,{"$f":"'SN005'!E23-'SN005'!H23-oRes!E21-C17","v":8459462},{"$f":"+'SN005'!G23","v":175788},{"$f":"+oRes!G21","v":1673720}]
[16,{"$f":"'SN005'!E24-'SN005'!H24-oRes!E22-C18","v":9642037},{"$f":"+'SN005'!G24","v":0},{"$f":"+oRes!G22","v":1852879}]
[17,{"$f":"'SN005'!E25-'SN005'!H25-oRes!E23-C19","v":10713158},{"$f":"+'SN005'!G25","v":0},{"$f":"+oRes!G23","v":2037017}]
[18,{"$f":"'SN005'!E26-'SN005'!H26-oRes!E24-C20","v":11852233},{"$f":"+'SN005'!G26","v":0},{"$f":"+oRes!G24","v":2226271}]
{"$rows_left_out":40}
{"sheet":"G2","index":2,"n_rows":57,"n_cols":4,"rows_kept":57,"cut":false,"hidden":false,"merged":[[0,0,1,0],[0,1,1,1],[0,2,1,2]]}
["eltelt évek","Lojalitási számla értéke","Jóváírt bónusz értéke"]
[]
[1,{"$f":"+'SN005'!F9","v":7278},{"$f":"+'SN005'!G9","v":0},{"$f":"+B3+C3","v":7278}]
[2,{"$f":"+'SN005'!F10","v":15058},{"$f":"+'SN005'!G10","v":0},{"$f":"+B4+C4","v":15058}]
[3,{"$f":"+'SN005'!F11","v":23376},{"$f":"+'SN005'!G11","v":0},23376]
[4,{"$f":"+'SN005'!F12","v":56920},{"$f":"+'SN005'!G12","v":0},56920]
[5,{"$f":"+'SN005'!F13","v":91551},{"$f":"+'SN005'!G13","v":0},91551]
[6,{"$f":"+'SN005'!F14","v":127289},{"$f":"+'SN005'!G14","v":0},127289]
[7,{"$f":"+'SN005'!F15","v":164180},{"$f":"+'SN005'!G15","v":0},164180]
[8,{"$f":"+'SN005'!F16","v":202274},{"$f":"+'SN005'!G16","v":0},202274]
[9,{"$f":"+'SN005'!F17","v":241616},{"$f":"+'SN005'!G17","v":0},241616]
[10,{"$f":"+'SN005'!F18","v":141127},{"$f":"+'SN005'!G18","v":141128},282255]
[11,{"$f":"+'SN005'!F19","v":180398},{"$f":"+'SN005'!G19","v":0},180398]
[12,{"$f":"+'SN005'!F20","v":221014},{"$f":"+'SN005'!G20","v":0},221014]
[13,{"$f":"+'SN005'!F21","v":263047},{"$f":"+'SN005'!G21","v":0},263047]
[14,{"$f":"+'SN005'!F22","v":306551},{"$f":"+'SN005'!G22","v":0},306551]
[15,{"$f":"+'SN005'!F23","v":175787},{"$f":"+'SN005'!G23","v":175788},351575]
[16,{"$f":"+'SN005'!F24","v":233796},{"$f":"+'SN005'!G24","v":0},233796]
[17,{"$f":"+'SN005'!F25","v":293684},{"$f":"+'SN005'!G25","v":0},293684]
[18,{"$f":"+'SN005'!F26","v":355532},{"$f":"+'SN005'!G26","v":0},355532]
{"$rows_left_out":38}
{"sheet":"iPar","index":3,"n_rows":93,"n_cols":40,"rows_kept":93,"cut":false,"hidden":true,"merged":[]}
["PolBeg",{"$f":"+'SN005'!B8","v":"2018-02-01"},null,null,null,null,null,null,null,null,"PayMethod",null,"PayPa","Portfolios","Term-Age",null,"Yields","Prm",null,"Disc"]
["PolEnd",{"$f":"+DATE(YEAR(BD)+65,MONTH(BD),DAY(BD))","v":"2041-03-25"},null,null,null,null,null,null,null,null,"átutalás",1,"havi","Lendületes","min term",120,0,"min",144000,"min",0]
["Term",{"$f":"fterm(PolBeg,PolEnd)","v":277},{"$f":"sdatediff(PolBeg,PolEnd)","v":"23-1-24"},{"$f":"ROUNDUP(Term/12,0)","v":24},null,null,null,null,null,null,"csekk",3,"negyedéves","Mérsékelt","min age",18,0.01,"min topup",35000,"max",0.8]
["EntryAge",{"$f":"YEAR(PolBeg)-YEAR(BD)","v":42},{"$f":"fterm2(PolBeg,PolEnd)","v":278},null,null,null,null,null,null,null,"csoportos",2,"féléves","Óvatos","check",{"$f":"IF(Term<P2, \"Minimálisnál kisebb tartam.\",\"\")","v":""},0.02,"check",{"$f":"IF(DPrm*PayPa<S2, \"Minimálisnál kisebb díj.\",\"\")","v":""}]
[null,null,null,null,null,null,null,null,null,null,null,null,"éves","Nincs",null,{"$f":"IF(Age<P3, \"Minimálisnál kisebb kor.\",\"\")","v":""},0.03,null,{"$f":"IF(OR(DiscFEL<U2,DiscFEL>U3), \"Hibás üzleti kedvezmény.\",\"\")","v":""}]
["PayPa",{"$f":"IF(PP=\"havi\",12,IF(PP=\"negyedéves\",4,IF(PP=\"féléves\",2,1)))","v":12},null,null,null,null,null,null,null,null,null,null,null,null,null,null,0.04]
["PayMod",{"$f":"VLOOKUP(PM,K2:L4,2)","v":2},null,null,null,null,null,null,null,null,null,null,"ErrMsg",{"$f":"IF(hiba1=\"\",IF(hiba2=\"\",IF(hiba3=\"\",IF(hiba4=\"\",IF(ErrFromVB=\"\",\"\",ErrFromVB),hiba4),hiba3),hiba2),hiba1)","v":""},null,null,0.05]
["DuePrm",{"$f":"P","v":30000},null,null,null,null,null,null,null,null,null,null,"ErrMsg",null,null,null,0.06]
["PensionPart",1,null,null,"portfolio","ann.KBF","dailyKBF",null,null,null,null,null,null,null,null,null,7.0000000000000007E-2]
["DiscFEL",{"$f":"+D","v":0},null,"Lendületes",1,8.3000000000000001E-3,{"$f":"ROUND(F10/365,8)","v":2.2739999999999999E-5},null,null,null,null,null,"MaxG2",{"$f":"+MAX('G2'!D3:D57)","v":485387},null,null,0.08]
["Portfolio",{"$f":"MATCH(PO,iPar!N2:N5,0)","v":1},null,"Mérsékelt",2,7.4999999999999997E-3,2.0550000000000001E-5,null,null,null,null,null,null,null,null,null,0.09]
["Yield",{"$f":"YI","v":0.04},null,"Óvatos",3,6.4500000000000009E-3,1.7669999999999999E-5,null,null,null,null,null,null,null,null,null,0.1]
["Index",0.05,null,"Üres",4,0,{"$f":"ROUND(F13/365,8)","v":0},null,null,null,null,null,null,null,null,null,0.11]
[null,null,null,null,null,null,null,null,null,null,null,null,null,null,null,null,0.12]
["fPolBeg","fPolEnd","fTermType","fTerm","fInsPers","fSex","fEntAge","fFirstIndex","fLastIndex","fLapsePeriod","fKBFperiod","fKBFshift","fMinTopUp",null,null,null,0.13,null,null,null,null,null,null,null,null,null,null,null,null,"fPremTabID","fMinSex","fMaxSex","fMinAge","fMaxAge","fNetPrm",null,"fDur","fTopUpPen","fTopUpNon","fPartSurr"]
[{"$f":"+PolBeg","v":"2018-02-01"},{"$f":"+PolEnd","v":"2041-03-25"},5,{"$f":"+Term","v":277},111,1,{"$f":"+Age","v":42},1,0,0,3,3,{"$f":"+MinTopUp","v":35000},null,null,null,0.14000000000000001,null,null,null,null,null,null,null,null,null,null,null,null,null,null,null,null,null,null,null,1,{"$f":"'SN005'!J9","v":0},{"$f":"'SN005'!L9","v":0},0]
[null,null,null,null,null,null,null,null,null,null,null,null,null,null,null,null,0.15,null,null,null,null,null,null,null,null,null,null,null,null,null,null,null,null,null,null,null,2,{"$f":"'SN005'!J10","v":0},{"$f":"'SN005'!L10","v":0},0]
["fAccountNr","fTarOption","fTarifNr","fRisk","fIndexType","fIndex","fRiskBeg","fRiskEnd","fPayEnd","fPayReg","fPayPa","fPayMethod","fGrossPrm","fFirstPrm","fPensionPart","fMinPool",null,null,null,null,null,null,null,null,null,null,null,null,null,null,null,null,null,null,null,null,3,{"$f":"'SN005'!J11","v":0},{"$f":"'SN005'!L11","v":0},0]
[1,0,11,5,101,{"$f":"Index","v":0.05},{"$f":"+PolBeg","v":"2018-02-01"},{"$f":"+PolEnd","v":"2041-03-25"},{"$f":"+H19-DAY(H19)+1","v":"2041-03-01"},1,{"$f":"+PayPa","v":12},{"$f":"+PayMod","v":2},{"$f":"+DPrm*PayPa","v":360000},{"$f":"+M19","v":360000},{"$f":"PensionPart","v":1},100000,"SN005","alap",null,null,null,null,null,null,null,null,null,null,null,null,null,null,null,null,null,null,4,{"$f":"'SN005'!J12","v":0},{"$f":"'SN005'!L12","v":0},0]
[2,3,12,5,0,0,{"$f":"+G19","v":"2018-02-01"},"2041-03-25","2041-03-01",2,1,1,0,0,1,0,"SN005","eseti",null,null,null,null,null,null,null,null,null,null,null,null,null,null,null,null,null,null,5,{"$f":"'SN005'!J13","v":0},{"$f":"'SN005'!L13","v":0},0]
{"$rows_left_out":74}
{"sheet":"oData","index":4,"n_rows":278,"n_cols":25,"rows_kept":278,"cut":false,"hidden":true,"merged":[]}
["fAccountNr","fPremiumType","fPrmStatus","fPremiumSum","fPremiumFrom","fPremiumTo","fInvestDate",null,"fID","fAccountID","fPolBodyNr","fUnitType","fInsPers","fFromID","fFundID","fTransType","fFormula","fValue1","fValue2","fValue3","fValue4","fValue5","fValue6","fValidFrom","fValidTo"]
[1,101,3,30000,"2018-02-01","2018-03-01","2018-02-01",null,1,1,1,1,0,30,0,202,6,0.3,0,108000,12,108000,0,"2018-01-01","2041-02-28"]
[1,101,3,30000,"2018-03-01","2018-04-01","2018-03-01",null,2,1,1,1,0,30,0,202,6,0.3,0,221400,24,221400,0,"2018-01-01","2041-02-28"]
[1,101,3,30000,"2018-04-01","2018-05-01","2018-04-01",null,3,1,1,1,0,30,0,202,6,0.14000000000000001,0,158886,36,158886,0,"2018-01-01","2041-02-28"]
[1,101,3,30000,"2018-05-01","2018-06-01","2018-05-01",null,4,1,1,1,0,22,0,203,11,0.06,2000000000,0,0,0,0,"2018-01-01","2041-02-28"]
[1,101,3,30000,"2018-06-01","2018-07-01","2018-06-01",null,5,1,1,3,0,28,2690,225,9,1.6666700000000001E-3,0,1200,0,0,0,"2018-02-01","2041-02-28"]
[1,101,3,30000,"2018-07-01","2018-08-01","2018-07-01",null,6,1,1,1,0,15,0,260,7,3.0000000000000001E-3,300,1500,0,0,0,"2018-02-01","2041-02-28"]
[1,101,3,30000,"2018-08-01","2018-09-01","2018-08-01",null,7,1,1,3,0,17,0,262,5,1,0,0,0,0,0,"2018-02-01","2041-02-28"]
[1,101,3,30000,"2018-09-01","2018-10-01","2018-09-01",null,8,1,1,1,0,33,0,801,5,-0.01,0,0,0,0,3,"2018-01-01","2041-02-28"]
[1,101,3,30000,"2018-10-01","2018-11-01","2018-10-01",null,9,1,1,1,0,32,0,804,5,-0.01,0,0,0,0,3,"2018-01-01","2041-02-28"]
[1,101,3,30000,"2018-11-01","2018-12-01","2018-11-01",null,10,1,1,3,0,111,0,850,10,1000000,0,1200,0,0,0,"2018-02-01","2041-02-28"]
[1,101,3,30000,"2018-12-01","2019-01-01","2018-12-01",null,11,1,1,1,0,112,1,899,5,-2.2739999999999999E-5,0,0,0,0,1,"2018-02-01","2041-02-28"]
[1,101,3,30000,"2019-01-01","2019-02-01","2019-01-01",null,12,1,1,3,0,112,1,899,5,-2.2739999999999999E-5,0,0,0,0,1,"2018-02-01","2041-02-28"]
[1,101,3,31500,"2019-02-01","2019-03-01","2019-02-01",null,13,1,1,1,0,27,2690,225,9,1.6666700000000001E-3,37,1200,0,0,0,"2021-02-01","2041-02-28"]
[1,101,3,31500,"2019-03-01","2019-04-01","2019-03-01",null,14,1,1,3,0,26,0,803,4,-0.05,488286,1,0,0,3,"2021-02-01","2033-01-31"]
[1,101,3,31500,"2019-04-01","2019-05-01","2019-04-01",null,15,1,1,3,0,36,0,950,5,0.5,0,0,0,0,1,"2028-02-01","2028-02-29"]
[1,101,3,31500,"2019-05-01","2019-06-01","2019-05-01",null,16,1,1,3,0,36,0,950,5,0.5,0,0,0,0,1,"2033-02-01","2033-02-28"]
[1,101,3,31500,"2019-06-01","2019-07-01","2019-06-01",null,17,1,1,3,0,26,0,803,4,-0.08,488286,1,0,0,3,"2033-02-01","2038-01-31"]
[1,101,3,31500,"2019-07-01","2019-08-01","2019-07-01",null,18,1,1,3,0,36,0,950,5,0.5,0,0,0,0,1,"2038-02-01","2038-02-28"]
[1,101,3,31500,"2019-08-01","2019-09-01","2019-08-01"]
{"$rows_left_out":259}
{"sheet":"oPool","index":5,"n_rows":305,"n_cols":93,"rows_kept":305,"cut":false,"hidden":true,"merged":[]}
[null,"ID",3,4,5,6,7,8,9,10,11,12,13,14,15,16,17,18,19,20,21,22,23,24,25,26,27,28,29,30,31,32,33,34,35,36,37,38,39,40,41,42,43,44,45,46,47,48,49,50,51,52,53,54,55,56,57,58,59,60,61,62,63,64,65,66,67,68,69,70,71,72,73,74,75,76,77,78,79]
[null,"Account",1,1,1,1,1,1,1,1,1,1,1,1,1,1,1,1,1,1,1,1,1,1,1,1,1,1,1,1,1,1,1,1,1,1,1,1,1,1,1,1,1,1,1,1,1,1,1,1,1,1,2,2,2,2,2,2,2,2,2,2,3,3,3,3,3,3,3,3,3,3,4,4,4,4,4,4,4,null,{"$f":"MIN(CC$6:CC$1048576)","v":0},{"$f":"MIN(CD$6:CD$1048576)","v":0},0,0,0,0,null,{"$f":"MIN(CJ$6:CJ$1048576)","v":0},0,0,0,0,0]
[null,"UnitType",1,1,1,1,1,1,1,1,1,1,1,1,1,1,1,1,1,1,2,2,2,2,2,2,2,2,2,2,2,2,2,2,2,2,3,3,3,3,3,3,3,3,3,3,3,3,3,3,3,3,4,4,4,4,4,4,4,4,4,3,4,4,4,4,4,4,4,4,4,3,5,5,5,5,5,5,3,null,{"$f":"MAX(CC$6:CC$1048576)","v":0},{"$f":"MAX(CD$6:CD$1048576)","v":0},0,0,0,0,null,{"$f":"MAX(CJ$6:CJ$1048576)","v":18429219},0,322277,0,0,3268045]
[null,"TransType",null,0,100,202,203,204,225,800,801,803,804,805,825,899,950,260,400,1000,0,100,202,203,204,225,800,801,803,804,805,825,899,260,400,1000,0,100,202,203,204,225,800,801,803,804,805,825,950,850,1000,262,0,100,203,225,800,260,400,899,1000,262,0,100,203,225,800,260,400,899,1000,262,0,100,225,800,899,1000,262,null,"open + CF = close",null,null,null,null,null,null,"open = close-1"]
["Date","PolMo","Prm w/o index","OpPool","Prm","Exp202","Exp203","Exp204","Exp225","Yield","Bon801","Bon803","Bon804","Bon805","Bon825","Bon899","Tr950","Exp260","PartSurr","ClPool","OpPool","Prm","Exp202","Exp203","Exp204","Exp225","Yield","Bon801","Bon803","Bon804","Bon805","Bon825","Bon899","Exp260","PartSurr","ClPool","OpPool","Prm","Exp202","Exp203","Exp204","Exp225","Yield","Bon801","Bon803","Bon804","Bon805","Bon825","Bon950","BonOUT","ClPool","SurrFee","OpPool","Prm","Exp203","Exp225","Yield","Exp260","PartSurr","Bon899","ClPool","SurrFee","OpPool","Prm","Exp203","Exp225","Yield","Exp260","PartSurr","Bon899","ClPool","SurrFee","OpPool","Prm","Exp225","Yield","Bon899","ClPool","SurrFee"]
["2018-02-01",1,30000,0,30000,-22200,-1800,0,0,20,0,0,0,0,0,0,0,0,0,6020,0,0,0,0,0,0,0,0,0,0,0,0,0,0,0,0,0,0,0,0,0,-1,2,300,0,300,0,0,0,0,601,0,0,0,0,0,0,0,0,0,0,0,0,0,0,0,0,0,0,0,0,0,0,0,0,0,0,0,0,null,{"$f":"SUM(D6:S6)-T6","v":0},{"$f":"SUM(U6:AI6)-AJ6","v":0},{"$f":"SUM(AK6:AX6)-AY6","v":0},{"$f":"SUM(BA6:BH6)-BI6","v":0},{"$f":"SUM(BK6:BR6)-BS6","v":0},{"$f":"SUM(BU6:BY6)-BZ6","v":0}]
["2018-03-01",2,30000,6020,30000,-22200,-1800,0,0,39,0,0,0,0,0,0,0,0,0,12059,0,0,0,0,0,0,0,0,0,0,0,0,0,0,0,0,601,0,0,0,0,-2,4,300,0,300,0,0,0,0,1203,0,0,0,0,0,0,0,0,0,0,0,0,0,0,0,0,0,0,0,0,0,0,0,0,0,0,0,0,null,0,0,0,0,0,0,null,{"$f":"+T6-D7","v":0},{"$f":"+AJ6-U7","v":0},{"$f":"+AY6-AK7","v":0},{"$f":"+BI6-BA7","v":0},{"$f":"+BS6-BK7","v":0},{"$f":"+BZ6-BU7","v":0}]
["2018-04-01",3,30000,12059,30000,-22200,-1800,0,0,59,0,0,0,0,0,0,0,0,0,18118,0,0,0,0,0,0,0,0,0,0,0,0,0,0,0,0,1203,0,0,0,0,-3,6,300,0,300,0,0,0,0,1806,0,0,0,0,0,0,0,0,0,0,0,0,0,0,0,0,0,0,0,0,0,0,0,0,0,0,0,0,null,0,0,0,0,0,0,null,0,0,0,0,0,0]
["2018-05-01",4,30000,18118,30000,-22200,-1800,0,0,79,0,0,0,0,0,0,0,0,0,24197,0,0,0,0,0,0,0,0,0,0,0,0,0,0,0,0,1806,0,0,0,0,-4,8,300,0,300,0,0,0,0,2410,0,0,0,0,0,0,0,0,0,0,0,0,0,0,0,0,0,0,0,0,0,0,0,0,0,0,0,0,null,0,0,0,0,0,0,null,0,0,0,0,0,0]
["2018-06-01",5,30000,24197,30000,-22200,-1800,0,0,99,0,0,0,0,0,13,0,0,0,30309,0,0,0,0,0,0,0,0,0,0,0,0,0,0,0,0,2410,0,0,0,0,-5,10,300,0,300,0,0,0,0,3015,0,0,0,0,0,0,0,0,0,0,0,0,0,0,0,0,0,0,0,0,0,0,0,0,0,0,0,0,null,0,0,0,0,0,0,null,0,0,0,0,0,0]
["2018-07-01",6,30000,30309,30000,-22200,-1800,0,0,119,0,0,0,0,0,0,0,0,0,36428,0,0,0,0,0,0,0,0,0,0,0,0,0,0,0,0,3015,0,0,0,0,-6,12,300,0,300,0,0,0,0,3621,0,0,0,0,0,0,0,0,0,0,0,0,0,0,0,0,0,0,0,0,0,0,0,0,0,0,0,0,null,0,0,0,0,0,0,null,0,0,0,0,0,0]
["2018-08-01",7,30000,36428,30000,-22200,-1800,0,0,139,0,0,0,0,0,0,0,0,0,42567,0,0,0,0,0,0,0,0,0,0,0,0,0,0,0,0,3621,0,0,0,0,-7,14,300,0,300,0,0,0,0,4228,0,0,0,0,0,0,0,0,0,0,0,0,0,0,0,0,0,0,0,0,0,0,0,0,0,0,0,0,null,0,0,0,0,0,0,null,0,0,0,0,0,0]
["2018-09-01",8,30000,42567,30000,-22200,-1800,0,0,159,0,0,0,0,0,55,0,0,0,48781,0,0,0,0,0,0,0,0,0,0,0,0,0,0,0,0,4228,0,0,0,0,-8,16,300,0,300,0,0,0,0,4836,0,0,0,0,0,0,0,0,0,0,0,0,0,0,0,0,0,0,0,0,0,0,0,0,0,0,0,0,null,0,0,0,0,0,0,null,0,0,0,0,0,0]
["2018-10-01",9,30000,48781,30000,-22200,-1800,0,0,179,0,0,0,0,0,0,0,0,0,54960,0,0,0,0,0,0,0,0,0,0,0,0,0,0,0,0,4836,0,0,0,0,-9,18,300,0,300,0,0,0,0,5445,0,0,0,0,0,0,0,0,0,0,0,0,0,0,0,0,0,0,0,0,0,0,0,0,0,0,0,0,null,0,0,0,0,0,0,null,0,0,0,0,0,0]
["2018-11-01",10,30000,54960,30000,-22200,-1800,0,0,200,0,0,0,0,0,0,0,0,0,61160,0,0,0,0,0,0,0,0,0,0,0,0,0,0,0,0,5445,0,0,0,0,-10,20,300,0,300,0,0,0,0,6055,0,0,0,0,0,0,0,0,0,0,0,0,0,0,0,0,0,0,0,0,0,0,0,0,0,0,0,0,null,0,0,0,0,0,0,null,0,0,0,0,0,0]
["2018-12-01",11,30000,61160,30000,-22200,-1800,0,0,220,0,0,0,0,0,98,0,0,0,67478,0,0,0,0,0,0,0,0,0,0,0,0,0,0,0,0,6055,0,0,0,0,-11,22,300,0,300,0,0,0,0,6666,0,0,0,0,0,0,0,0,0,0,0,0,0,0,0,0,0,0,0,0,0,0,0,0,0,0,0,0,null,0,0,0,0,0,0,null,0,0,0,0,0,0]
["2019-01-01",12,30000,67478,30000,-22200,-1800,0,0,241,0,0,0,0,0,0,0,0,0,73719,0,0,0,0,0,0,0,0,0,0,0,0,0,0,0,0,6666,0,0,0,0,-12,24,300,0,300,0,0,0,0,7278,0,0,0,0,0,0,0,0,0,0,0,0,0,0,0,0,0,0,0,0,0,0,0,0,0,0,0,0,null,0,0,0,0,0,0,null,0,0,0,0,0,0]
["2019-02-01",13,30000,73719,31500,-13860,-1890,0,0,293,0,0,0,0,0,0,0,0,0,89762,0,0,0,0,0,0,0,0,0,0,0,0,0,0,0,0,7278,0,0,0,0,-13,26,315,0,315,0,0,0,0,7921,0,0,0,0,0,0,0,0,0,0,0,0,0,0,0,0,0,0,0,0,0,0,0,0,0,0,0,0,null,0,0,0,0,0,0,null,0,0,0,0,0,0]
["2019-03-01",14,30000,89762,31500,-13860,-1890,0,0,345,0,0,0,0,0,141,0,0,0,105998,0,0,0,0,0,0,0,0,0,0,0,0,0,0,0,0,7921,0,0,0,0,-14,28,315,0,315,0,0,0,0,8565,0,0,0,0,0,0,0,0,0,0,0,0,0,0,0,0,0,0,0,0,0,0,0,0,0,0,0,0,null,0,0,0,0,0,0,null,0,0,0,0,0,0]
["2019-04-01",15,30000,105998,31500,-13860,-1890,0,0,399,0,0,0,0,0,0,0,0,0,122147,0,0,0,0,0,0,0,0,0,0,0,0,0,0,0,0,8565,0,0,0,0,-15,30,315,0,315,0,0,0,0,9210,0,0,0,0,0,0,0,0,0,0,0,0,0,0,0,0,0,0,0,0,0,0,66000,-110,216,0,66106,0,null,0,0,0,0,0,0,null,0,0,0,0,0,0]
{"$rows_left_out":286}
{"sheet":"oRes","index":6,"n_rows":30,"n_cols":12,"rows_kept":30,"cut":false,"hidden":true,"merged":[[4,1,4,6],[4,8,4,9],[4,10,4,11]]}
["oszlop",{"$f":"+oPool!T1","v":20},{"$f":"+oPool!AJ1","v":36},{"$f":"+oPool!AY1","v":51},{"$f":"+oPool!BI1","v":61},{"$f":"+oPool!BS1","v":71},{"$f":"+oPool!BZ1","v":78},{"$f":"+oPool!Q1","v":17},{"$f":"+oPool!BV1","v":74},{"$f":"+oPool!CA1","v":79},{"$f":"+oPool!C1","v":3},{"$f":"+oPool!E1","v":5}]
["típus",1,1,1,1,1,1,0,0,1,0,0]
["sorszám",2,3,4,5,6,7,8,9,10,11,12]
["utolsó adó.",165980]
[null,"aktuális tőkeértékek",null,null,null,null,null,"bónusz","adójóváírás",null,"díjak"]
["bizt.év","alap (NYC)","alap (nNYC)","lojalitás","eseti (NYC)","eseti (nNYC)","adó-jóváírás","fel-szabadítás","jóváírás","vissza +20%","index nélkül","indexszel"]
[1,73719,0,7278,0,0,0,0,0,0,360000,360000]
[2,270813,0,15058,0,0,67341,0,66000,0,360000,378000]
[3,609071,0,23376,0,0,146044,0,75300,0,360000,396900]
[4,1022798,0,56920,0,0,230773,0,79065,0,360000,416748]
[5,1468116,0,91551,0,0,321893,0,83019,0,360000,437580]
[6,1946921,0,127289,0,0,419782,0,87169,0,360000,459456]
[7,2461235,0,164180,0,0,524845,0,91527,0,360000,482424]
[8,3013048,0,202274,0,0,637488,0,96102,0,360000,506544]
[9,3604632,0,241616,0,0,758165,0,100907,0,360000,531876]
[10,4379417,0,141127,0,0,887341,141128,105953,0,360000,558468]
[11,5060432,0,180398,0,0,1025535,0,111250,0,360000,586392]
[12,5788490,0,221014,0,0,1173227,0,116813,0,360000,615708]
[13,6566425,0,263047,0,0,1330979,0,122653,0,360000,646488]
[14,7397090,0,306551,0,0,1499371,0,128785,0,360000,678816]
{"$rows_left_out":10}