{"text_format":"1","workbook":"xlsx","n_sheets":9,"sheets":["Tarifa","1.telephely","2.telephely","3.telephely","4.telephely","5.telephely","Adatfelvétel","Díjkalkuláció nyomtatása","Ajánlat+Telephelyi adatközlő"],"not_rendered":{"charts":0,"images":2,"macros":1,"external_links":1,"defined_names":2,"comments":0,"pivot_tables":0},"unopened":[],"bounds":{"document_bytes":16777216,"sheet_cells":100000,"rows_first":2000,"rows_last":500,"rows_between":2000,"halvings":0,"cell_chars":16384,"cell_head_chars":4096},"cells_cut":0,"cells_raw":0,"read":"whole","date_system":"1900"}

{"sheet":"Tarifa","index":0,"n_rows":787,"n_cols":48,"rows_kept":787,"cut":false,"hidden":true,"merged":[[0,5,1,5],[0,0,1,0],[0,1,1,1],[0,2,1,2],[0,3,1,3],[0,4,1,4],[0,12,1,12],[0,13,1,13],[0,6,1,6],[0,7,1,7],[0,8,1,8],[0,9,1,9],[0,10,1,10],[0,11,1,11]]}
[null,null,null,null,"Tűz és elemi károk","Betöréses lopás és rablás","Üzemszünet","Általános felelősség","Munkaadói felelősség","Bérlői felelősség","Termékfelelősség","Szolgáltatói felelősség","Környezetszennyezési","Bérbeadói"]
[null,null,null,null,null,null,null,null,null,null,null,null,null,null,null,null,null,null,"Felelősség limitek",null,null,null,null,null,null,3,"díjfiz ütem",null,null,"díjfiz mód",null,1]
[1," 631","Adatfeldolgozás, web-hoszting, világháló-portál szolgáltatás",null,3,2,4,2,2,2,2,0,2,3,20,{"$f":"VLOOKUP(O3,$A$3:$C$246,2)","v":" 310"},{"$f":"VLOOKUP(O3,$A$3:$C$246,3,FALSE)","v":"Bútorgyártás"},1,0,0,0,null,null,null,null,1,"éves",0.9,0.1,"postai utalás",1,0,null,null,null,null,null,null,"lejárat","2017-06-30"]
[2," 821","Adminisztratív, kiegészítő szolgáltatás",null,4,4,2,3,3,2,0,2,2,3,3,{"$f":"VLOOKUP(O4,$A$3:$C$246,2)","v":477813},{"$f":"VLOOKUP(O4,$A$3:$C$246,3,FALSE)","v":"Ajándéktárgy-kiskereskedelem"},2,"5 millió Ft","5 millió Ft","5 millió Ft",null,null,null,null,2,"féléves",0.94,0.06,"banki átutalás",0.97,0.03]
[3,477813,"Ajándéktárgy-kiskereskedelem",null,3,2,2,3,2,3,3,0,3,3,39,{"$f":"VLOOKUP(O5,$A$3:$C$246,2)","v":" 182"},{"$f":"VLOOKUP(O5,$A$3:$C$246,3,FALSE)","v":"Egyéb sokszorosítás"},3,"25 millió Ft","15 millió Ft","15 millió Ft",null,null,null,null,3,"negyedéves",0.98,0.02,"csoportos beszedés",0.97,0.03]
[4," 852","Alapfokú oktatás",null,4,3,4,3,3,3,2,4,3,4,39,{"$f":"VLOOKUP(O6,$A$3:$C$246,2)","v":" 182"},{"$f":"VLOOKUP(O6,$A$3:$C$246,3,FALSE)","v":"Egyéb sokszorosítás"},4,"50 millió Ft","25 millió Ft",null,null,null,null,null,4,"havi",1,0,"csoportos beszedés K&H Banknál vezetett bankszámláról",0.95,0.05]
[5," 663","Alapkezelés",null,3,5,2,1,1,1,0,0,2,2,14,{"$f":"VLOOKUP(O7,$A$3:$C$246,2)","v":" 643"},{"$f":"VLOOKUP(O7,$A$3:$C$246,3,FALSE)","v":"Befektetési alapok és hasonlók"},null,null,null,null,null,null,null,null,null,null,{"$f":"VLOOKUP(Z2,Z3:AB6,3,FALSE)","v":0.98},{"$f":"VLOOKUP(Z2,Z3:AC6,4,FALSE)","v":0.02},null,{"$f":"VLOOKUP(AF2,Z3:AE6,6,FALSE)","v":1},{"$f":"VLOOKUP(AF2,Z3:AF6,7,FALSE)","v":0}]
[6," 900","Alkotó-, művészeti, szórakoztató tevékenység",null,3,1,2,2,2,2,0,2,3,3,null,null,null,"Tűz",{"$f":"VLOOKUP(O3,$A$3:$L$246,5)","v":5},{"$f":"VLOOKUP(O4,$A$3:$L$246,5)","v":3},{"$f":"VLOOKUP(O5,$A$3:$L$246,5)","v":3},{"$f":"VLOOKUP(O6,$A$3:$L$246,5)","v":3},{"$f":"VLOOKUP(O7,$A$3:$L$246,5)","v":2},null,null,{"$f":"1-((1-AB7)+(1-IF(AB7<1,AE7,1)))","v":0.98},{"$f":"AC7+AF7","v":0.02},null,{"$f":"VLOOKUP(Z2,Z3:AB6,2,FALSE)","v":"negyedéves"},null,{"$f":"VLOOKUP(AF2,Z3:AE6,5,FALSE)","v":"postai utalás"}]
[7," 750","Állat-egészségügyi ellátás",null,4,2,3,3,4,3,0,4,4,3,null,null,null,null,{"$f":"HLOOKUP(S8,S10:X11,2)","v":2.7},{"$f":"HLOOKUP(T8,S10:X11,2)","v":1.95},{"$f":"HLOOKUP(U8,$S$10:$X$11,2)","v":1.95},{"$f":"HLOOKUP(V8,$S$10:$X$11,2)","v":1.95},{"$f":"HLOOKUP(W8,$S$10:$X$11,2)","v":1.8}]
[8,990911,"Állatkozmetika, kutyaiskola ",null,2,2,1,2,3,2,1,3,4,3,null,null,null,null,1,2,3,4,5,6]
[9," 014","Állattenyésztés",null,4,2,3,3,3,2,1,1,2,2,null,null,null,null,1.71,1.8,1.95,2.4300000000000002,2.7,3.06,null,null,"DES",{"$f":"'1.telephely'!C60","v":1},{"$f":"1-AB11","v":0},null,null,null,null,null,null,null,"lojalitás+DES max. 20%",null,null,{"$f":"1-AO11","v":0},{"$f":"AA15*AB11","v":1},{"$f":"IF(AO11<0.8,\"0,8\",AO11)","v":1}]
[10," 8621","Általános járóbeteg-ellátás",null,4,2,3,3,3,3,0,0,5,3,null,null,null,null,null,null,null,null,null,null,null,null,"Közp. DES",{"$f":"'1.telephely'!C61","v":1},{"$f":"1-AB12","v":0},null,null,null,null,null,null,null,"volumen+csomag+lojalitás+DES max. 50%",null,null,{"$f":"1-AO12","v":0},{"$f":"AP11*AE15*AF31","v":1},{"$f":"IF(AO12<0.5,\"0,5\",AO12)","v":1}]
[11," 281","Általános rendeltetésű gép gyártása",null,3,2,3,2,2,3,3,0,4,3,null,null,null,null,{"$f":"IF(U109=FALSE,\"Bp\",IF('1.telephely'!F5<2000,\"Bp\",\"Vidék\"))","v":"Bp"},{"$f":"IF(U110=FALSE,\"Bp\",IF('2.telephely'!F2<2000,\"Bp\",\"Vidék\"))","v":"Bp"},{"$f":"IF(U111=FALSE,\"Bp\",IF('3.telephely'!F2<2000,\"Bp\",\"Vidék\"))","v":"Bp"},{"$f":"IF(U112=FALSE,\"Bp\",IF('4.telephely'!F2<2000,\"Bp\",\"Vidék\"))","v":"Bp"},{"$f":"IF(U113=FALSE,\"Bp\",IF('5.telephely'!F2<2000,\"Bp\",\"Vidék\"))","v":"Bp"}]
[12," 4743","Audio-, videoberendezés kiskereskedelme",null,2,2,2,2,2,2,1,0,3,2,null,null,null,null,{"$f":"IF(S13=\"Bp\",1,Y17)","v":1},{"$f":"IF(T13=\"Bp\",1,Y17)","v":1},{"$f":"IF(U13=\"Bp\",1,Y17)","v":1},{"$f":"IF(V13=\"Bp\",1,Y17)","v":1},{"$f":"IF(W13=\"Bp\",1,Y17)","v":1}]
[13," 433","Befejező építés",null,2,3,2,5,4,5,5,1,4,3,null,null,null,null,{"$f":"VLOOKUP(O3,$A$3:$L$246,6)","v":2},{"$f":"VLOOKUP(O4,$A$3:$L$246,6)","v":2},{"$f":"VLOOKUP(O5,$A$3:$L$246,6)","v":1},{"$f":"VLOOKUP(O6,$A$3:$L$246,6)","v":1},{"$f":"VLOOKUP(O7,$A$3:$L$246,6)","v":2},null,null,null,{"$f":"VLOOKUP(AC15,AA16:AC18,3,FALSE)","v":1},"lojalitás",1,{"$f":"VLOOKUP(AC15,AA16:AD18,4,FALSE)","v":"Nincs"},{"$f":"IF(AE16=1,AH16,IF(AE17=1,AH17,IF(AE18=1,AH18)))","v":1},"csomag",{"$f":"1-AE15","v":0}]
[14," 643","Befektetési alapok és hasonlók",null,2,2,1,2,2,2,0,0,2,3,null,null,null,"Betlop",{"$f":"HLOOKUP(S15,S17:X18,2)","v":3.1},{"$f":"HLOOKUP(T15,S17:X18,2)","v":3.1},{"$f":"HLOOKUP(U15,$S$17:$X$18,2)","v":2.5},{"$f":"HLOOKUP(V15,$S$17:$X$18,2)","v":2.5},{"$f":"HLOOKUP(W15,$S$17:$X$18,2)","v":3.1},null,"Vidéki eng.",null,1,"Nincs",1,"Nincs",{"$f":"IF(AND($AV$29>=AF16,$AV$29<=AG16),1,0)","v":1},0,3,1,"Nincs"]
[15," 236","Beton-, gipsz-, cementtermék gyártása",null,2,1,3,2,3,2,2,0,4,2,null,null,null,null,1,2,3,4,5,6,0.8,null,2,"K&H Banknál vezetett vállalkozói bankszámlával rendelkezik",0.98,0.02,{"$f":"IF(AND($AV$29>=AF17,$AV$29<=AG17),1,0)","v":0},4,5,0.95,0.05]
[16," 662","Biztosítást, nyugdíjalapot kiegészítő tevékenység",null,2,2,2,2,2,2,0,0,2,2,null,null,null,null,2.5,3.1,4,4.2,5.2,11.2,null,null,3,"K&H Banknál felvett vállalkozói hitellel rendelkezik",0.95,0.05,{"$f":"IF(AND($AV$29>=AF18,$AV$29<=AG18),1,0)","v":0},6,20,0.9,0.1]
[17," 431","Bontás, építési terület előkészítése",null,3,3,3,2,2,0,0,4,4,3]
[18," 151","Bőr, szőrme kikészítése",null,3,3,3,2,2,2,2,0,3,2,null,null,null,null,null,null,null,null,null,null,null,null,"irodai",4,null,"vakolat",0.5,null,"vandalizmus",9]
{"$rows_left_out":768}
{"sheet":"1.telephely","index":1,"n_rows":67,"n_cols":7,"rows_kept":67,"cut":false,"hidden":false,"merged":[[5,3,5,4],[19,7,19,10],[20,3,21,3],[20,4,21,4],[0,0,2,6],[3,3,3,5],[4,3,4,4],[8,0,8,1],[8,3,8,4],[8,5,8,6],[10,7,11,10],[12,7,16,10],[17,3,18,3],[17,7,17,10],[18,7,18,10],[64,1,64,2],[20,5,21,5],[20,7,20,10],[24,8,24,10],[54,0,54,1],[58,1,58,2],[63,1,63,2],[22,7,22,10]]}
["KVB-13 díjkalkuláció"]
[]
[]
["Telephely megnevezése",null,null,"Telephely és kockázatviselés helye"]
["Tevékenység megnevezése",null,null,"Telephely irányítószám"]
["Kódja",{"$f":"VLOOKUP(Tarifa!O3,Tarifa!A3:L246,2)","v":" 310"},null,"Település címe"]
[]
[]
["Alapadatok",null,null,"Felelősségbiztosítási limitek",null,"Felelősségbiztosítási záradék limitek"]
["Éves árbevétel (e Ft)",0,null,"Általános és épülethasználói felelősségbiztosítás",null,"Tanuló baleseti és felelősségbiztosítás","5 millió Ft"]
["Alkalmazottak száma (fő)",0,null,"Munkáltatói felelősségbiztosítás",null,"Szálloda üzemeltetői, szállásadói felelősségbiztosítás"]
["Éves forgalom (e Ft)",0,null,"Termékfelelősség biztosítás",null,"Gépjárműjavítók felelősségbiztosítása"]
["Éves bérleti díj (e Ft)",0,null,"Bérlői felelősségbiztosítás",null,"Gépjármű eredetiségvizsgálatot végzők felelősségbiztosítása","5 millió Ft"]
["Éves bérbeadásból származó forgalom (e Ft)",0,null,"Szolgáltatói felelősségbiztosítás",null,"Szolgáltatás tárgyában okozott károk biztosítása","5 millió Ft"]
[null,null,null,"Bérbeadói felelősségbiztosítás"]
["Tárgyi eszközk értékelésének módja",null,null,"Környezetszennyezési felelősségbiztosítás"]
[]
[null,"Biztosított vagyontárgyak biztosítási összege (e Ft)","Díj ","Betöréses lopás és rablás biztosítás"]
["Épület, építmény",0]
["Egyéb tárgyi eszközök",0,null,null,false]
{"$rows_left_out":48}
{"sheet":"2.telephely","index":2,"n_rows":52,"n_cols":7,"rows_kept":52,"cut":false,"hidden":false,"merged":[[51,0,51,1],[0,3,0,5],[1,3,1,4],[5,0,5,1],[5,3,5,4],[5,5,5,6],[14,3,15,3],[14,4,15,4],[17,3,18,3],[50,0,50,1],[2,3,2,4]]}
["Telephely megnevezése",null,null,"Telephely és kockázatviselés helye"]
["Tevékenység megnevezése",null,null,"Telephely irányítószám"]
["Kódja",{"$f":"VLOOKUP(Tarifa!O4,Tarifa!A3:L246,2)","v":477813},null,"Település címe"]
[]
[]
["Alapadatok",null,null,"Felelősségbiztosítási limitek",null,"Felelősségbiztosítási záradék limitek"]
["Éves árbevétel (e Ft)",0,null,"Általános és épülethasználói felelősségbiztosítás",null,"Tanuló baleseti és felelősségbiztosítás","5 millió Ft"]
["Alkalmazottak száma (fő)",0,null,"Munkáltatói felelősségbiztosítás",null,"Szálloda üzemeltetői, szállásadói felelősségbiztosítás"]
["Éves forgalom (e Ft)",0,null,"Termékfelelősség biztosítás",null,"Gépjárműjavítók felelősségbiztosítása"]
["Éves bérleti díj (e Ft)",0,null,"Bérlői felelősségbiztosítás",null,"Gépjármű eredetiségvizsgálatot végzők felelősségbiztosítása","5 millió Ft"]
["Éves bérbeadásból származó forgalom (e Ft)",0,null,"Szolgáltatói felelősségbiztosítás",null,"Szolgáltatás tárgyában okozott károk biztosítása","5 millió Ft"]
[null,null,null,"Bérbeadói felelősségbiztosítás"]
["Tárgyi eszközk értékelésének módja",null,null,"Környezetszennyezési felelősségbiztosítás"]
[]
[null,"Biztosítási összeg (e Ft)","Díj ","Betöréses lopás és rablás biztosítás"]
["Épület, építmény",0]
["Egyéb tárgyi eszközök",0,null,null,false]
["Saját készletek",0,null,null,false]
["Idegen készletek",0]
["Készpénz",0,null,null,false,"Díjkategória besorolás"]
{"$rows_left_out":33}
{"sheet":"3.telephely","index":3,"n_rows":52,"n_cols":7,"rows_kept":52,"cut":false,"hidden":false,"merged":[[51,0,51,1],[0,3,0,5],[1,3,1,4],[5,0,5,1],[5,3,5,4],[5,5,5,6],[14,3,15,3],[14,4,15,4],[17,2,18,2],[17,3,18,3],[2,3,2,4]]}
["Telephely megnevezése",null,null,"Telephely és kockázatviselés helye"]
["Tevékenység megnevezése",null,null,"Telephely irányítószám"]
["Kódja",{"$f":"VLOOKUP(Tarifa!O5,Tarifa!A3:L246,2)","v":" 182"},null,"Település címe"]
[]
[]
["Alapadatok",null,null,"Felelősségbiztosítási limitek",null,"Felelősségbiztosítási záradék limitek"]
["Éves árbevétel (e Ft)",0,null,"Általános és épülethasználói felelősségbiztosítás",null,"Tanuló baleseti és felelősségbiztosítás","5 millió Ft"]
["Alkalmazottak száma",0,null,"Munkáltatói felelősségbiztosítás",null,"Szálloda üzemeltetői, szállásadói felelősségbiztosítás"]
["Éves forgalom (e Ft)",0,null,"Termékfelelősség biztosítás",null,"Gépjárműjavítók felelősségbiztosítása"]
["Éves bérleti díj (e Ft)",0,null,"Bérlői felelősségbiztosítás",null,"Gépjármű eredetiségvizsgálatot végzők felelősségbiztosítása","5 millió Ft"]
["Éves bérbeadásból származó forgalom (e Ft)",0,null,"Szolgáltatói felelősségbiztosítás",null,"Szolgáltatás tárgyában okozott károk biztosítása","5 millió Ft"]
[null,null,null,"Bérbeadói felelősségbiztosítás"]
["Tárgyi eszközk értékelésének módja",null,null,"Környezetszennyezési felelősségbiztosítás"]
[]
[null,"Biztosítási összeg (e Ft)","Díj ","Betöréses lopás és rablás biztosítás"]
["Épület, építmény",0]
["Egyéb tárgyi eszközök",0,null,null,false]
["Saját készletek",0,null,null,false]
["Idegen készletek",0]
["Készpénz",0,null,null,false,"Díjkategória besorolás"]
{"$rows_left_out":33}
{"sheet":"4.telephely","index":4,"n_rows":52,"n_cols":7,"rows_kept":52,"cut":false,"hidden":false,"merged":[[0,3,0,5],[1,3,1,4],[5,0,5,1],[5,3,5,4],[5,5,5,6],[2,3,2,4],[51,0,51,1],[14,3,15,3],[17,3,18,3],[17,4,18,4],[17,5,18,5]]}
["Telephely megnevezése",null,null,"Telephely és kockázatviselés helye"]
["Tevékenység megnevezése",null,null,"Telephely irányítószám"]
["Kódja",{"$f":"VLOOKUP(Tarifa!O6,Tarifa!A3:L246,2)","v":" 182"},null,"Település címe"]
[]
[]
["Alapadatok",null,null,"Felelősségbiztosítási limitek",null,"Felelősségbiztosítási záradék limitek"]
["Éves árbevétel (e Ft)",0,null,"Általános és épülethasználói felelősségbiztosítás",null,"Tanuló baleseti és felelősségbiztosítás","5 millió Ft"]
["Alkalmazottak száma (fő)",0,null,"Munkáltatói felelősségbiztosítás",null,"Szálloda üzemeltetői, szállásadói felelősségbiztosítás"]
["Éves forgalom (e Ft)",0,null,"Termékfelelősség biztosítás",null,"Gépjárműjavítók felelősségbiztosítása"]
["Éves bérleti díj (e Ft)",0,null,"Bérlői felelősségbiztosítás",null,"Gépjármű eredetiségvizsgálatot végzők felelősségbiztosítása","5 millió Ft"]
["Éves bérbeadásból származó forgalom (e Ft)",0,null,"Szolgáltatói felelősségbiztosítás",null,"Szolgáltatás tárgyában okozott károk biztosítása","5 millió Ft"]
[null,null,null,"Bérbeadói felelősségbiztosítás"]
["Tárgyi eszközk értékelésének módja",null,null,"Környezetszennyezési felelősségbiztosítás"]
[]
[null,"Biztosított vagyontárgyak biztosítási összege (e Ft)","Díj ","Betöréses lopás és rablás biztosítás"]
["Épület, építmény",0]
["Egyéb tárgyi eszközök",0,null,null,false]
["Saját készletek",0,null,null,false]
["Idegen készletek",0]
["Készpénz",0,null,null,false,"Díjkategória besorolás"]
{"$rows_left_out":33}
{"sheet":"5.telephely","index":5,"n_rows":52,"n_cols":7,"rows_kept":52,"cut":false,"hidden":false,"merged":[[51,0,51,1],[0,3,0,5],[1,3,1,4],[5,0,5,1],[5,3,5,4],[5,5,5,6],[14,3,15,3],[17,3,18,3],[17,4,18,4],[17,5,18,5],[2,3,2,4]]}
["Telephely megnevezése",null,null,"Telephely és kockázatviselés helye"]
["Tevékenység megnevezése",null,null,"Telephely irányítószám"]
["Kódja",{"$f":"VLOOKUP(Tarifa!O7,Tarifa!A3:L246,2)","v":" 643"},null,"Település címe"]
[]
[]
["Alapadatok",null,null,"Felelősségbiztosítási limitek",null,"Felelősségbiztosítási záradék limitek"]
["Éves árbevétel (e Ft)",0,null,"Általános és épülethasználói felelősségbiztosítás",null,"Tanuló baleseti és felelősségbiztosítás","5 millió Ft"]
["Alkalmazottak száma (fő)",0,null,"Munkáltatói felelősségbiztosítás",null,"Szálloda üzemeltetői, szállásadói felelősségbiztosítás"]
["Éves forgalom (e Ft)",0,null,"Termékfelelősség biztosítás",null,"Gépjárműjavítók felelősségbiztosítása"]
["Éves bérleti díj (e Ft)",0,null,"Bérlői felelősségbiztosítás",null,"Gépjármű eredetiségvizsgálatot végzők felelősségbiztosítása","5 millió Ft"]
["Éves bérbeadásból származó forgalom (e Ft)",0,null,"Szolgáltatói felelősségbiztosítás",null,"Szolgáltatás tárgyában okozott károk biztosítása","5 millió Ft"]
[null,null,null,"Bérbeadói felelősségbiztosítás"]
["Tárgyi eszközk értékelésének módja",null,null,"Környezetszennyezési felelősségbiztosítás"]
[]
[null,"Biztosított vagyontárgyak biztosítási összege (e Ft)","Díj ","Betöréses lopás és rablás biztosítás"]
["Épület, építmény",0]
["Egyéb tárgyi eszközök",0,null,null,false]
["Saját készletek",0,null,null,false]
["Idegen készletek",0]
["Készpénz",0,null,null,false,"Díjkategória besorolás"]
{"$rows_left_out":33}
{"sheet":"Adatfelvétel","index":6,"n_rows":74,"n_cols":34,"rows_kept":74,"cut":false,"hidden":false,"merged":[[15,14,15,31],[34,8,34,13],[35,8,35,13],[36,8,36,20],[10,16,10,23],[33,8,33,20],[16,14,16,31],[17,14,17,18],[18,14,18,29],[19,14,19,29],[20,14,20,29],[23,8,23,11],[11,16,11,21],[24,8,24,20],[25,8,25,20],[30,8,30,11],[59,34,59,37],[64,8,64,20],[31,8,31,20],[32,8,32,20],[69,8,69,20],[70,8,70,20],[71,8,71,20],[72,8,72,20],[73,9,73,20],[37,1,37,7],[37,8,37,20],[56,11,57,31],[59,16,59,23],[68,8,68,20],[65,8,65,20],[67,8,67,11],[8,16,8,23],[9,16,9,30],[4,16,4,23],[3,16,3,23],[5,16,5,23],[6,16,6,23],[7,16,7,23]]}
[]
[null,"Adatfelvétel"]
[]
[null,"Biztosításközvetítő azonosítója"]
[null,"Biztosításközvetítő nyilvántartási száma"]
[null,"Biztosításközvetítő neve"]
[null,"Biztosításközvetítő képviselője (cég esetén)"]
[null,"Biztosításközvetítő telefonszáma"]
[null,"Jogi forma"]
[null,"Állandó lakóhely/székhely"]
[null,"Ajánlat felvételének helye"]
[null,"Dátuma",null,null,null,null,null,null,null,null,null,null,null,null,null,null,{"$f":"TODAY()","v":"2017-03-28"},null,null,null,null,null,{"$f":"IF(Q12>Tarifa!AN3,\"Lejárt kalkulátor, kérem töltse le a legfrissebb verziót!\",\" \")","v":" "}]
[]
[null,"Szerződő azonosításához szükséges adatok"]
[]
[null,"Név ( szervezet megnevezése )"]
[null,"Születéskori név ( leánykori név )"]
[null,"Születés dátuma ( éééé.hh.nn)"]
[null,"Születés helye "]
[null,"Anya neve"]
{"$rows_left_out":55}
{"sheet":"Díjkalkuláció nyomtatása","index":7,"n_rows":107,"n_cols":27,"rows_kept":107,"cut":false,"hidden":false,"merged":[[19,6,19,7],[19,15,19,16],[86,1,86,4],[86,10,86,13],[19,24,19,25],[25,1,25,4],[25,10,25,13],[25,19,25,22],[40,19,40,22],[57,3,57,4],[80,15,80,16],[101,1,101,4],[101,10,101,13],[40,1,40,4],[40,10,40,13],[80,6,80,7]]}
[]
[null,"Díjkalkuláció a K&H vállalkozói biztosításhoz ",null,null,null,null,null,null,null,null,"Díjkalkuláció a K&H vállalkozói biztosításhoz (3. telephely)",null,null,null,null,null,null,null,null,"Díjkalkuláció a K&H vállalkozói biztosításhoz (5.telephely)"]
[]
[null,"vállalkozói biztosítás kalkulációs adatai",null,null,null,null,null,null,null,null,"vállalkozói biztosítás kalkulációs adatai",null,null,null,null,null,null,null,null,"vállalkozói biztosítás kalkulációs adatai"]
[]
[null,"tevékenység megnevezése",null,null,null,{"$f":"Tarifa!Q3","v":"Bútorgyártás"},null,null,null,null,"tevékenység megnevezése",null,null,null,{"$f":"Tarifa!Q5","v":"Egyéb sokszorosítás"},null,null,null,null,"tevékenység megnevezése",null,null,null,{"$f":"Tarifa!Q7","v":"Befektetési alapok és hasonlók"}]
[null,"tevékenység kódja",null,null,null,{"$f":"'1.telephely'!B6","v":" 310"},null,null,null,null,"tevékenység kódja",null,null,null,{"$f":"'3.telephely'!$B$3","v":" 182"},null,null,null,null,"tevékenység kódja",null,null,null,{"$f":"'5.telephely'!$B$3","v":" 643"}]
[null,"telephely irányítószáma",null,null,null,{"$f":"'1.telephely'!F5","v":0},null,null,null,null,"telephely irányítószáma",null,null,null,{"$f":"'3.telephely'!$F$2","v":0},null,null,null,null,"telephely irányítószáma",null,null,null,{"$f":"'5.telephely'!$F$2","v":0}]
[]
[null,"telephely éves árbevétele (e Ft)",null,null,null,{"$f":"'1.telephely'!B10","v":0},null,null,null,null,"telephely éves árbevétele (e Ft)",null,null,null,{"$f":"'3.telephely'!$B$7","v":0},null,null,null,null,"telephely éves árbevétele (e Ft)",null,null,null,{"$f":"'5.telephely'!$B$7","v":0}]
[null,"éves forgalom (e Ft)",null,null,null,{"$f":"'1.telephely'!B12","v":0},null,null,null,null,"éves forgalom (e Ft)",null,null,null,{"$f":"'3.telephely'!$B$9","v":0},null,null,null,null,"éves forgalom (e Ft)",null,null,null,{"$f":"'5.telephely'!$B$9","v":0}]
[null,"alkalmazottak száma (fő)",null,null,null,{"$f":"'1.telephely'!B11","v":0},null,null,null,null,"alkalmazottak száma (fő)",null,null,null,{"$f":"'3.telephely'!$B$8","v":0},null,null,null,null,"alkalmazottak száma (fő)",null,null,null,{"$f":"'5.telephely'!$B$8","v":0}]
[null,"éves bérleti díj (e Ft)",null,null,null,{"$f":"'1.telephely'!B13","v":0},null,null,null,null,"éves bérleti díj (e Ft)",null,null,null,{"$f":"'3.telephely'!$B$10","v":0},null,null,null,null,"éves bérleti díj (e Ft)",null,null,null,{"$f":"'5.telephely'!$B$10","v":0}]
[null,"bérbeadásból származó forgalom (e Ft)",null,null,null,{"$f":"'1.telephely'!B14","v":0},null,null,null,null,"bérbeadásból származó forgalom (e Ft)",null,null,null,{"$f":"'3.telephely'!$B$11","v":0},null,null,null,null,"bérbeadásból származó forgalom (e Ft)",null,null,null,{"$f":"'5.telephely'!$B$11","v":0}]
[]
[null,"alapbiztosítás keretében biztosított vagyontárgyak",null,null,null,null,null,null,null,null,"alapbiztosítás keretében biztosított vagyontárgyak",null,null,null,null,null,null,null,null,"alapbiztosítás keretében biztosított vagyontárgyak"]
[null,"épület, építmény (e Ft)",null,null,{"$f":"'1.telephely'!B19","v":0},null,null,null,null,null,"épület, építmény (e Ft)",null,null,{"$f":"'3.telephely'!$B$16","v":0},null,null,null,null,null,"épület, építmény (e Ft)",null,null,{"$f":"'5.telephely'!$B$16","v":0}]
[null,"egyéb tárgyi eszközök (e Ft)",null,null,{"$f":"'1.telephely'!B20","v":0},null,null,null,null,null,"egyéb tárgyi eszközök (e Ft)",null,null,{"$f":"'3.telephely'!$B$17","v":0},null,null,null,null,null,"egyéb tárgyi eszközök (e Ft)",null,null,{"$f":"'5.telephely'!$B$17","v":0}]
[null,"készletek (e Ft)",null,null,{"$f":"'1.telephely'!B21+'1.telephely'!B22","v":0},null,null,null,null,null,"készletek (e Ft)",null,null,{"$f":"'3.telephely'!$B$18","v":0},null,null,null,null,null,"készletek (e Ft)",null,null,{"$f":"'5.telephely'!$B$18","v":0}]
[null,"készpénz (e Ft)",null,null,{"$f":"'1.telephely'!B23","v":0},null,"biztosítási összeg vagy kártérítési limit",null,"biztosítási díj",null,"készpénz (e Ft)",null,null,{"$f":"'3.telephely'!$B$19","v":0},null,"biztosítási összeg vagy kártérítési limit",null,"biztosítási díj",null,"készpénz (e Ft)",null,null,{"$f":"'5.telephely'!$B$19","v":0},null,"biztosítási összeg vagy kártérítési limit",null,"biztosítási díj"]
{"$rows_left_out":88}
{"sheet":"Ajánlat+Telephelyi adatközlő","index":8,"n_rows":581,"n_cols":11,"rows_kept":581,"cut":false,"hidden":false,"merged":[[209,2,209,3],[257,2,257,3],[73,5,73,6],[123,2,123,3],[136,5,136,6],[143,6,143,7],[80,2,80,3],[227,3,227,4],[190,2,190,3],[80,6,80,7],[134,5,134,9],[74,9,74,10],[335,9,335,10],[334,8,334,9],[334,5,334,6],[341,6,341,7],[202,8,202,9],[202,5,202,6],[209,6,209,7],[268,5,268,6],[269,9,269,10],[275,6,275,7],[29,0,29,3],[71,5,71,9],[30,0,30,10],[37,7,39,10],[44,0,53,10],[6,4,6,5],[460,0,522,5],[535,0,536,10],[580,0,587,10],[552,1,552,4],[460,6,526,10],[550,5,550,6],[23,0,24,10],[29,5,29,10],[9,7,9,10],[26,1,26,4],[27,0,27,1],[26,8,26,10],[55,0,55,1],[55,2,55,3],[73,8,73,9],[393,6,459,10],[393,0,459,5],[136,8,136,9],[5,4,5,10],[378,0,378,1],[389,2,389,3],[28,0,28,1],[246,0,246,1],[312,0,312,1],[37,3,37,4],[38,3,38,4],[39,3,39,4],[117,0,117,1],[180,0,180,1],[323,2,323,3],[7,4,7,5]]}
["előzetes díjkalkuláció a K&H vállalkozó biztosítás megkötésére",null,null,null,null,null,null,null,null,"K&H Biztosító Zrt."]
[null,null,null,null,null,null,null,null,null,"1095 Budapest, Lechner Ödön fasor 9."]
["biztosításközvetítő neve:",null,null,{"$f":"Adatfelvétel!Q6","v":0}]
["biztosításközvetítő K&H-s nyilvántartási száma:",null,null,null,{"$f":"Adatfelvétel!Q4","v":0},null,null,"telefonszám:",{"$f":"Adatfelvétel!Q8","v":0}]
["Szerzodo (Biztosított) adatai („ügyfél adatlap biztosítási szerzodés megkötéséhez” nyomtatvány adattartalmával egyenértékű adatok)"]
["név (szervezet rövid neve):",null,null,null,{"$f":"Adatfelvétel!O16","v":0}]
["születéskori név (leánykori név):",null,null,null,{"$f":"Adatfelvétel!O17","v":0}]
["anyja neve:",null,null,null,{"$f":"Adatfelvétel!O20","v":0}]
["születési dátum:",null,null,{"$f":"IF(Adatfelvétel!O18=0,\" \",Adatfelvétel!O18)","v":" "},"születés helye:",{"$f":"Adatfelvétel!O19","v":0},null,"szervezet adószáma:",null,{"$f":"Adatfelvétel!O21","v":0}]
["lakóhely / szervezet székhelyének címe:",null,null,null,{"$f":"Adatfelvétel!I24","v":0},{"$f":"Adatfelvétel!I25","v":0},null,{"$f":"Adatfelvétel!I26","v":0}]
["kapcsolattartáshoz szükséges adatok"]
["ha a levelezési cím nem a lakóhely / szervezet székhelye, akkor más levelezési cím:"]
["kapcsolattartó neve:",null,null,{"$f":"Adatfelvétel!I34","v":0}]
["telefonszám:",null,null,{"$f":"Adatfelvétel!I35","v":0},null,null,"mobil telefonszám:",null,{"$f":"Adatfelvétel!I36","v":0}]
["e-mail cím:",null,null,{"$f":"Adatfelvétel!I37","v":0},null,null,"fax:",{"$f":"Adatfelvétel!I38","v":0}]
["ügyfélkapcsolattartó kijelöléséhez szükséges adatok:"]
["Éves árbevétel 200 millió forint felett?",null,null,null,{"$f":"IF(Adatfelvétel!AH42=TRUE,\"igen\",\"nem\")","v":"nem"},null,null,"Állandó alkalmazottak száma 10 fő felett?",null,null,{"$f":"IF(Adatfelvétel!AH43=TRUE,\"igen\",\"nem\")","v":"nem"}]
["csak mezogazdasági ügyfelek esetén:"]
["Szántó/erdo terület 50 ha felett?",null,null,null,{"$f":"IF(Adatfelvétel!AH47=TRUE,\"igen\",\"nem\")","v":"nem"},null,null,"Kertészeti kultúra 5 ha felett?",null,null,{"$f":"IF(Adatfelvétel!AH48=TRUE,\"igen\",\"nem\")","v":"nem"}]
["Számosállatainak száma 30 felett?",null,null,null,{"$f":"IF(Adatfelvétel!AH49=TRUE,\"igen\",\"nem\")","v":"nem"}]
{"$rows_left_out":561}