{"text_format":"1","workbook":"xlsx","n_sheets":8,"sheets":["Kalkulátor","KalkLap","Minősítés","BaseData","Kalk","Indikativ","IndikatívOTK","Induló lap"],"not_rendered":{"charts":0,"images":7,"macros":1,"external_links":1,"defined_names":74,"comments":1,"pivot_tables":0},"unopened":[],"bounds":{"document_bytes":16777216,"sheet_cells":100000,"rows_first":2000,"rows_last":500,"rows_between":2000,"halvings":0,"cell_chars":16384,"cell_head_chars":4096},"cells_cut":0,"cells_raw":0,"read":"whole","date_system":"1900"}

{"sheet":"Kalkulátor","index":0,"n_rows":31,"n_cols":10,"rows_kept":31,"cut":false,"hidden":false,"merged":[[27,1,27,2],[23,1,23,2],[17,5,17,10],[11,5,11,11],[14,5,14,11],[13,5,13,11],[7,8,9,12],[0,9,1,12],[4,9,5,12],[1,1,1,2],[16,1,16,2],[0,5,0,6],[1,5,1,6],[2,5,2,6],[3,5,3,6],[4,5,4,6],[10,1,10,2],[5,5,5,6],[8,1,8,3],[12,5,12,10],[0,2,0,3],[6,5,6,11]]}
[null,"Ajánlatkészítő neve",null,null,null,{"$f":"IF(ISBLANK(C3),BaseData!$D$2,INDEX(BaseData!$D$2:$D$13,MATCH(Kalkulátor!C3,BaseData!$A$2:$A$13,0)))","v":" "},null,{"$f":"IF(ISBLANK(C3),Bubor,INDEX(Minősítés!$B$25:$M$25,MATCH(Kalkulátor!C3,Minősítés!$B$9:$M$9,0)))","v":1.21E-2}]
[null,"Termék:",null,null,null,{"$f":"IF(ISBLANK(C3),BaseData!$E$2,IF(INDEX(BaseData!$E$2:$E$13,MATCH(Kalkulátor!C3,BaseData!$A$2:$A$13,0))=\" \",\" \",INDEX(BaseData!$E$2:$E$13,MATCH(Kalkulátor!C3,BaseData!$A$2:$A$13,0))))","v":" "},null,{"$f":"IFERROR(IF(F2=\" \",\" \",BaseKamatfelár),\"\")","v":" "}]
[null,"Termék:","MagNet Stabil Ötös Lakáshitel",null,null,"Kedvezmények összesen",null,{"$f":"KedvValue","v":0}]
[null,"Hitelcél:","használt lakás / lakóház vásárlás",null,null,"Kamatláb (évi)\n(Kedvezménnyel csökkentett)",null,{"$f":"RealKamatláb","v":4.7100000000000003E-2}]
[null,"Kölcsön összege:",5000000,null,null,"Törlesztőrészlet:",null,{"$f":"IF(Kalk!$B$35=\"Nem hitelezhető\",Kalk!$B$35,IF(ISBLANK(PProduct),\"\",IF(Kalk!N8=0,IF(Installment=0,\"\",Installment),\"\")))","v":32380.627124318158},null,"A pontosabb eredményért töltse ki a \"Havi vállalt jóváírás összege\" mezőt!"]
[null,"Futamidő (év)",20,null,null,"THM",null,{"$f":"IF(H5=\"\",\"\",IFERROR(POWER((IRR(Kalk!I1:I361,0.01)+1),12)-1,\"\"))","v":4.9125783185612004E-2}]
[null,"Folyósítási díj meghitelezésre kerül?","Nem",null,null,{"$f":"IFERROR(IF(AND(C7=\"Igen\",PProduct=\"MagNet CSOK + Lakáshitel\"),\"Ennél a terméknél a folyósítási díj nem hitelezhető meg!\",\"\"),\"\")","v":""}]
[null,"Tényleges Kölcsönösszeg",{"$f":"IF(AND(FolyYO=\"Igen\",PProduct<>\"MagNet CSOK + Lakáshitel\"),LoanAmount+FolyDij,LoanAmount)","v":5000000},null,null,null,null,null,{"$f":"IF(Kalk!$B$9>Kalk!$D$9,CONCATENATE(\"A feltüntetett kedvezmény nem vehető teljesen figyelembe\",CHAR(10),\"Maximum kedvezmény: \",TEXT(Kalk!$D$9,\"0,0%\"),\"\"))","v":false}]
[]
[]
{"$rows_left_out":22}
{"sheet":"KalkLap","index":1,"n_rows":39,"n_cols":3,"rows_kept":39,"cut":false,"hidden":true,"merged":[[0,0,0,1],[35,0,35,2],[36,0,36,2],[25,0,25,1],[26,0,26,1],[30,0,30,1],[31,0,31,1],[32,0,32,1],[34,0,34,2],[24,0,24,1],[8,0,8,1],[9,0,9,1],[10,0,10,1],[11,0,11,1],[12,0,12,1],[15,0,15,2],[16,0,16,1],[19,0,19,2],[20,0,20,1],[22,0,22,2],[23,0,23,1],[13,0,13,1],[7,0,7,1],[1,0,1,1],[2,0,2,1],[3,0,3,1],[5,0,5,2],[6,0,6,1]]}
["Ajánlatkészítő neve",null,{"$f":"IF(Kalkulátor!C1=\"\",\"\",Kalkulátor!C1)","v":""}]
["Kölcsönigénylő neve:",null,{"$f":"IF(Name=\"\",\"\",Name)","v":""}]
["Kölcsönigénylő lakcíme:",null,{"$f":"IF(Address=\"\",\"\",Address)","v":""}]
["Kalkuláció készítésének napja:",null,{"$f":"TODAY()","v":"2020-01-30"}]
[]
["I. Kölcsönigénylő által megadott adatok:"]
["Kölcsön típusa:",null,{"$f":"IF(PProduct=\"\",\"\",PProduct)","v":"MagNet Stabil Ötös Lakáshitel"}]
["Hitel célja:",null,{"$f":"IF(Dealgoal=\"\",\"\",Dealgoal)","v":"használt lakás / lakóház vásárlás"}]
["Igényelt kölcsön összege:",null,{"$f":"IF(RealLoanAmount=\"\",\"\",RealLoanAmount)","v":5000000}]
["Futamidő:",null,{"$f":"IF(Tenor=\"\",\"\",Tenor*12)","v":240}]
{"$rows_left_out":30}
{"sheet":"Minősítés","index":2,"n_rows":28,"n_cols":22,"rows_kept":28,"cut":false,"hidden":true,"merged":[[0,20,0,21],[0,11,0,13],[0,1,0,3],[0,6,0,8],[0,16,0,18]]}
["Jóváírás","Kölcsönösszeg",null,null,null,"JTM Buboros","LTV kategória",null,null,null,"JTM 5 éves","LTV kategória",null,null,null,"JTM 10 éves","LTV kategória",null,null,null,"LTV"]
[0,8000000,20000000,1000000000,null,0,0.25,0.5,10,null,0,0.25,0.5,10,null,0,0.25,0.5,10,null,0]
[100000,"A1","A2","A3",null,7.4999999999000005E-2,"A1","A2","A3",null,0.10999999990000001,"A1","A2","A3",null,0.14999999899999999,"A1","A2","A3",null,0.25,1]
[300000,"B1","B2","B3",null,0.17499999990000001,"B1","B2","B3",null,0.249999999,"B1","B2","B3",null,0.34999999900000001,"B1","B2","B3",null,0.5,2]
[500000,"C1","C2","C3",null,10,"C1","C2","C3",null,10,"C1","C2","C3",null,10,"C1","C2","C3",null,null,3]
[1000000000,"D1","D2","D3"]
[]
[]
[null,"MagNet Lakáshitel","MagNet Új Társasházi Lakáshitel","MagNet Stabil Ötös Lakáshitel","MagNet Stabil Ötös Új Társasházi Lakáshitel","MagNet Jelzáloghitel","MagNet Stabil Ötös Kiváltó hitel","MagNet Stabil Ötös Jelzáloghitel","MagNet CSOK + Lakáshitel","MagNet Stabil Tízes Lakáshitel","MagNet Stabil Tízes Új Társasházi Lakáshitel","MagNet Stabil Tízes Kiváltó hitel","MagNet Stabil Tízes Jelzáloghitel"]
["A1",4.2500000000000003E-2,4.2500000000000003E-2,3.5000000000000003E-2,3.5000000000000003E-2,5.2499999999999998E-2,0.04,4.4999999999999998E-2,0.03,3.5000000000000003E-2,3.5000000000000003E-2,0.04,4.4999999999999998E-2]
{"$rows_left_out":19}
{"sheet":"BaseData","index":3,"n_rows":27,"n_cols":19,"rows_kept":27,"cut":false,"hidden":true,"merged":[]}
["Product","Hitelcél lista","Tenor","Alap","Kamatfelár","Kampány","Kamat","Folyósítási díj","Folyósítási díj max",400000,100000000,"FolyDíj","DealGoal_HOU","DealGoal_HQ","DealGoal_OTK","Yes_Or_No",4,4,10]
["MagNet Lakáshitel","DealGoal_HOU","Bubor_Tenor","Alapkamat (BUBOR)","Kamatfelár","Yes_Or_No",{"$f":"Kalk!B1","v":2.7000000000000001E-3},0.01,200000,0.25,0.3,{"$f":"LoanAmount*H2","v":50000},"új lakás / lakóház vásárlás","szabad felhasználás","új lakás / lakóház vásárlás","Igen",5,5,20]
["MagNet Új Társasházi Lakáshitel","DealGoal_Tars","Bubor_Tenor","Alapkamat (BUBOR)","Kamatfelár","No",{"$f":"G2","v":2.7000000000000001E-3},0.01,200000,0.25,0.3,50000,"használt lakás / lakóház vásárlás","nem lakáscélú hitel kiváltása","használt lakás / lakóház vásárlás","Nem",6,6,30]
["MagNet Stabil Ötös Lakáshitel","DealGoal_HOU","Bubor_Tenor"," "," ","Yes_Or_No"," ",7.4999999999999997E-3,150000,0.35,0.4,37500,"felújítás",null,"új társasházi lakás (MagNet projektfinanszírozás)",null,7,7]
["MagNet Stabil Ötös Új Társasházi Lakáshitel","DealGoal_Tars","Bubor_Tenor"," "," ","No"," ",7.4999999999999997E-3,150000,0.35,0.4,37500,"korszerűsítés",null,null,null,8,8]
["MagNet Jelzáloghitel","DealGoal_HQ","Bubor_Tenor","Alapkamat (BUBOR)","Kamatfelár","Yes_Or_No",{"$f":"G2","v":2.7000000000000001E-3},0.01,200000,0.25,0.3,50000,"üdülő, hétvégi ház, nyaraló vásárlás",null,null,null,9,9]
["MagNet Stabil Ötös Kiváltó hitel","DealGoal_HQ2","Bubor_Tenor"," "," ","Yes_Or_No"," ",7.4999999999999997E-3,150000,0.35,0.4,37500,"telekvásárlás",null,null,null,10,10]
["MagNet Stabil Ötös Jelzáloghitel","DealGoal_HQ1","Bubor_Tenor"," "," ","Yes_Or_No"," ",7.4999999999999997E-3,150000,0.35,0.4,37500,"lakáscélú hitel kiváltása",null,null,null,11,11]
["MagNet CSOK + Lakáshitel","DealGoal_OTK","OTK_Tenor"," "," ","Yes_Or_No"," ",0.01,200000,0.35,0.4,50000,null,null,null,null,12,12]
["MagNet Stabil Tízes Lakáshitel","DealGoal_HOU","Bubor_Tenor"," "," ","Yes_Or_No"," ",7.4999999999999997E-3,150000,0.5,0.6,37500,null,null,null,null,13,13]
{"$rows_left_out":18}
{"sheet":"Kalk","index":4,"n_rows":361,"n_cols":14,"rows_kept":361,"cut":false,"hidden":true,"merged":[]}
["Bubor",2.7000000000000001E-3,"HitelösszegKat",{"$f":"FREQUENCY(Minősítés!$A$2:$E$2,LoanAmount)","v":1},null,"Hónapok száma","Év","Nyitó tőke",{"$f":"-LoanAmount+Indulo_dijak","v":-4987400},"Havi kamat","Havi megfizetett tőke",null,"Hitelcél",{"$f":"IF(INDEX(BaseData!B2:B13,MATCH(PProduct,Product,0))=\"DealGoal_HOU\",IF(ISERROR(MATCH(Dealgoal,DealGoal_HOU,0)),\"NOK\",\"OK\"),IF(INDEX(BaseData!B2:B13,MATCH(PProduct,Product,0))=\"DealGoal_Tars\",IF(ISERROR(MATCH(Dealgoal,DealGoal_Tars,0)),\"NOK\",\"OK\"),IF(INDEX(BaseData!B2:B13,MATCH(PProduct,Product,0))=\"DealGoal_HQ\",IF(ISERROR(MATCH(Dealgoal,DealGoal_HQ,0)),\"NOK\",\"OK\"),IF(INDEX(BaseData!B2:B13,MATCH(PProduct,Product,0))=\"DealGoal_HQ1\",IF(ISERROR(MATCH(Dealgoal,DealGoal_HQ1,0)),\"NOK\",\"OK\"),IF(INDEX(BaseData!B2:B13,MATCH(PProduct,Product,0))=\"DealGoal_HQ2\",IF(ISERROR(MATCH(Dealgoal,DealGoal_HQ2,0)),\"NOK\",\"OK\"),IF(INDEX(BaseData!B2:B13,MATCH(PProduct,Product,0))=\"DealGoal_OTK\",IF(ISERROR(MATCH(Dealgoal,DealGoal_OTK,0)),\"NOK\",\"OK\"),\"\"))))))","v":"OK"}]
["AKK",1.06E-2,"Vállalt jóváírás kat",{"$f":"FREQUENCY(Minősítés!$A$2:$A$7,Jovir)","v":1},null,1,1,{"$f":"RealLoanAmount","v":5000000},{"$f":"Installment","v":32380.627124318158},{"$f":"H2*RealKamatláb/360*(365/12)","v":19897.569444444449},{"$f":"I2-J2","v":12483.057679873709},null,"Futamidő","OK"]
["AKK130",{"$f":"B2*1.3","v":1.3780000000000001E-2},"Kamatfelár kategória",{"$f":"INDEX(Minősítés!B3:D6,D2,D1)","v":"A1"},null,2,1,{"$f":"IF(F3>Tenor*12,0,H2-K2)","v":4987516.9423201261},{"$f":"IF(F3>Tenor*12,0,Installment)","v":32380.627124318158},{"$f":"IF(F3>Tenor*12,0,H3*RealKamatláb/360*(365/12))","v":19847.892943031587},{"$f":"IF(F3>Tenor*12,0,I3-J3)","v":12532.734181286571},null,"Mber","OK"]
["5Y",1.21E-2,null,null,null,3,1,4974984.2081388393,32380.627124318158,19798.018753291402,12582.608371026756,null,"Kkedv",{"$f":"IF(AND(KKedv=\"Igen\",PProduct=\"MagNet CSOK + Lakáshitel\"),\"NOK\",\"OK\")","v":"OK"}]
["10Y",0.02,null,null,null,4,1,4962401.5997678125,32380.627124318158,19747.946088520457,12632.681035797701,null,"Hkedv",{"$f":"IF(AND(EKedv>0,PProduct=\"MagNet CSOK + Lakáshitel\"),\"NOK\",\"OK\")","v":"OK"}]
["Jóvirkedv",{"$f":"IF(PProduct<>\"MagNet CSOK + Lakáshitel\",BaseKamatfelár-RealKamatfelár,0)","v":0},null,null,null,5,1,4949768.9187320145,32380.627124318158,19697.674158884591,12682.952965433567,null,"Kampány",{"$f":"IF(AND(INDEX(BaseData!F2:F13,MATCH(PProduct,BaseData!A2:A13,0))=\"No\",Kampany=\"Igen\"),\"NOK\",\"OK\")","v":"OK"}]
["Közösségikedv",{"$f":"IF(KKedv=\"Igen\",0.001,0)","v":0},null,null,null,6,1,4937085.9657665808,32380.627124318158,19647.202171406523,12733.424952911635,null,"Folyhit",{"$f":"IF(AND(FolyYO=\"Igen\",PProduct=\"MagNet CSOK + Lakáshitel\"),\"NOK\",\"OK\")","v":"OK"}]
["Egyedi kedvezmény",{"$f":"EKedv","v":0},null,null,null,7,1,4924352.5408136696,32380.627124318158,19596.52932995329,12784.097794364869,null,"Összesítve",{"$f":"COUNTIF(N1:N7,\"NOK\")","v":0}]
["Kedvezmények összesen",{"$f":"IF(PProduct<>\"MagNet CSOK + Lakáshitel\",SUM(B6:B8),0)","v":0},"MaxKevezmény",{"$f":"IF(PProduct<>\"MagNet CSOK + Lakáshitel\",BaseKamatfelár-MinKamat,0)","v":2.0000000000000004E-2},null,8,1,4911568.4430193044,32380.627124318158,19545.654835223701,12834.972289094458]
["MinKamat",{"$f":"IFERROR(INDEX(Minősítés!$B$22:$M$22,,MATCH(Kalkulátor!C3,Minősítés!$B$9:$M$9,0)),Minősítés!B22)","v":1.4999999999999999E-2},null,null,null,9,1,4898733.4707302097,32380.627124318158,19494.577884735743,12886.049239582415]
{"$rows_left_out":352}
{"sheet":"Indikativ","index":5,"n_rows":175,"n_cols":19,"rows_kept":175,"cut":false,"hidden":true,"merged":[[10,0,10,19],[11,0,11,19],[12,0,12,19],[13,4,13,7],[14,4,14,6],[16,0,16,19],[0,0,0,19],[2,0,2,19],[6,0,6,19],[7,0,7,19],[8,0,8,19],[9,0,9,19],[22,12,22,14],[24,13,24,15],[25,0,25,19],[26,0,26,19],[27,0,27,19],[28,6,28,7],[17,0,17,19],[18,7,18,9],[19,4,19,6],[19,13,19,15],[20,0,20,19],[21,0,21,19],[29,0,29,19],[30,0,30,19],[31,14,31,15],[32,2,32,3],[33,0,33,19],[36,0,36,1],[36,2,36,5],[36,6,36,7],[36,8,36,13],[36,14,36,15],[46,0,46,19],[47,5,47,7],[49,6,49,8],[50,1,50,19],[51,18,51,19],[37,0,37,19],[38,7,38,8],[38,9,38,19],[40,15,40,16],[41,8,41,9],[42,8,42,9],[63,0,63,19],[65,4,65,5],[66,0,66,19],[67,0,67,2],[68,0,68,19],[69,0,69,19],[53,10,53,12],[54,1,54,19],[55,1,55,19],[58,1,58,19],[60,1,60,19],[61,1,61,19],[70,8,70,9],[71,0,71,2],[72,0,72,19],[73,0,73,19],[74,0,74,19],[75,0,75,3],[75,4,75,7],[75,8,75,11],[75,12,75,15],[75,16,75,19],[76,0,76,3],[76,4,76,7],[76,8,76,11],[76,12,76,15],[76,16,76,19],[77,0,77,3],[77,4,77,7],[77,8,77,11],[77,12,77,15],[77,16,77,19],[78,0,78,3],[78,4,78,7],[78,8,78,11],[78,12,78,15],[78,16,78,19],[79,0,79,3],[79,4,79,7],[79,8,79,11],[79,12,79,15],[79,16,79,19],[80,0,80,3],[80,4,80,7],[80,8,80,11],[80,12,80,15],[80,16,80,19],[81,0,81,3],[81,4,81,7],[81,8,81,11],[81,12,81,15],[81,16,81,19],[82,0,82,3],[82,4,82,7],[82,8,82,11],[82,12,82,15],[82,16,82,19],[83,0,83,3],[83,4,83,7],[83,8,83,11],[83,12,83,15],[83,16,83,19],[84,0,84,3],[84,4,84,7],[84,8,84,11],[84,12,84,15],[84,16,84,19],[85,0,85,3],[85,4,85,7],[85,8,85,11],[85,12,85,15],[85,16,85,19],[86,0,86,3],[86,4,86,7],[86,8,86,11],[86,12,86,15],[86,16,86,19],[87,0,87,3],[87,4,87,7],[87,8,87,11],[87,12,87,15],[87,16,87,19],[88,0,88,3],[88,4,88,7],[88,8,88,11],[88,12,88,15],[88,16,88,19],[89,0,89,3],[89,4,89,7],[89,8,89,11],[89,12,89,15],[89,16,89,19],[90,0,90,3],[90,4,90,7],[90,8,90,11],[90,12,90,15],[90,16,90,19],[91,0,91,3],[91,4,91,7],[91,8,91,11],[91,12,91,15],[91,16,91,19],[92,0,92,3],[92,4,92,7],[92,8,92,11],[92,12,92,15],[92,16,92,19],[93,0,93,3],[93,4,93,7],[93,8,93,11],[93,12,93,15],[93,16,93,19],[94,0,94,3],[94,4,94,7],[94,8,94,11],[94,12,94,15],[94,16,94,19],[95,0,95,3],[95,4,95,7],[95,8,95,11],[95,12,95,15],[95,16,95,19],[96,0,96,3],[96,4,96,7],[96,8,96,11],[96,12,96,15],[96,16,96,19],[97,0,97,3],[97,4,97,7],[97,8,97,11],[97,12,97,15],[97,16,97,19],[98,0,98,3],[98,4,98,7],[98,8,98,11],[98,12,98,15],[98,16,98,19],[99,0,99,3],[99,4,99,7],[99,8,99,11],[99,12,99,15],[99,16,99,19],[100,0,100,3],[100,4,100,7],[100,8,100,11],[100,12,100,15],[100,16,100,19],[101,0,101,3],[101,4,101,7],[101,8,101,11],[101,12,101,15],[101,16,101,19],[102,0,102,3],[102,4,102,7],[102,8,102,11],[102,12,102,15],[102,16,102,19],[103,0,103,3],[103,4,103,7],[103,8,103,11],[103,12,103,15],[103,16,103,19],[104,0,104,3],[104,4,104,7],[104,8,104,11],[104,12,104,15],[104,16,104,19],[105,0,105,3],[105,4,105,7],[105,8,105,11],[105,12,105,15],[105,16,105,19],[106,0,106,3],[106,4,106,7],[106,8,106,11],[106,12,106,15],[106,16,106,19],[107,0,107,3],[107,4,107,7],[107,8,107,11],[107,12,107,15],[107,16,107,19],[108,0,108,3],[108,4,108,7],[108,8,108,11],[108,12,108,15],[108,16,108,19],[109,0,109,3],[109,4,109,7],[109,8,109,11],[109,12,109,15],[109,16,109,19],[110,0,110,3],[110,4,110,7],[110,8,110,11],[110,12,110,15],[110,16,110,19],[111,0,111,3],[111,4,111,7],[111,8,111,11],[111,12,111,15],[111,16,111,19],[112,0,112,3],[112,4,112,7],[112,8,112,11],[112,12,112,15],[112,16,112,19],[113,0,113,3],[113,4,113,7],[113,8,113,11],[113,12,113,15],[113,16,113,19],[114,0,114,3],[114,4,114,7],[114,8,114,11],[114,12,114,15],[114,16,114,19],[115,0,115,3],[115,4,115,7],[115,8,115,11],[115,12,115,15],[115,16,115,19],[116,0,116,3],[116,4,116,7],[116,8,116,11],[116,12,116,15],[116,16,116,19],[117,0,117,3],[117,4,117,7],[117,8,117,11],[117,12,117,15],[117,16,117,19],[118,0,118,3],[118,4,118,7],[118,8,118,11],[118,12,118,15],[118,16,118,19],[119,0,119,3],[119,4,119,7],[119,8,119,11],[119,12,119,15],[119,16,119,19],[127,0,127,19],[128,0,128,19],[129,0,129,19],[130,0,130,19],[132,0,132,19],[133,1,133,19],[121,0,121,19],[122,0,122,19],[123,0,123,19],[124,0,124,19],[125,0,125,19],[126,0,126,19],[131,1,131,19],[140,0,140,19],[141,0,141,19],[142,0,142,19],[143,0,143,19],[144,0,144,19],[145,0,145,19],[134,1,134,19],[135,1,135,19],[136,0,136,19],[137,0,137,19],[138,0,138,19],[139,0,139,19],[152,0,152,19],[153,0,153,19],[154,0,154,19],[155,0,155,19],[156,0,156,19],[157,0,157,19],[146,0,146,19],[147,0,147,19],[148,0,148,19],[149,0,149,19],[150,0,150,19],[151,0,151,19],[173,11,173,17],[174,11,174,17],[166,0,166,19],[158,0,158,19],[159,0,159,19],[160,0,160,19],[161,0,161,19],[162,0,162,19],[163,0,163,19]]}
["Bevezető szöveg"]
["Ez a dokumentum ",null,null,null,"2019.05.31-én  részére készült."]
["Ez a dokumentum az Ön által ezidáig megadott adatok és a jelenlegi pénzügyi piaci feltételek alapján készült."]
["Az alábbi tájékoztatás ",null,null,null,null,"2019.06.30-ig érvényes"]
["Ezt követően a piaci feltételek függvényében változhat."]
["Ez a dokumentum nem kötelezi MagNet Bank Zrt.-t arra, hogy hitelt nyújtson Önnek."]
["1. Hitelező"]
["Hitelező neve: MagNet Magyar Közösségi Bank Zrt."]
["Telefonszám: 06-1-428-8888"]
["Levelezési cím: 1376 Budapest 62. Pf. 86."]
{"$rows_left_out":166}
{"sheet":"IndikatívOTK","index":6,"n_rows":157,"n_cols":17,"rows_kept":157,"cut":false,"hidden":true,"merged":[[41,4,41,7],[23,12,23,14],[25,11,25,13],[109,14,109,15],[110,14,110,15],[111,14,111,15],[54,1,54,19],[56,1,56,19],[57,1,57,19],[59,0,59,19],[51,1,51,19],[43,6,43,8],[44,1,44,19],[45,7,45,9],[46,1,46,19],[50,1,50,19],[68,14,68,15],[69,14,69,15],[70,14,70,15],[71,14,71,15],[72,14,72,15],[73,14,73,15],[74,14,74,15],[75,14,75,15],[66,0,66,19],[67,0,67,19],[61,4,61,5],[62,0,62,19],[63,0,63,2],[64,0,64,19],[65,0,65,19],[68,0,68,2],[70,0,70,2],[68,16,68,19],[69,16,69,19],[70,16,70,19],[68,6,68,7],[69,6,69,7],[70,6,70,7],[68,11,68,13],[69,11,69,13],[70,11,70,13],[69,0,69,2],[69,3,69,5],[70,3,70,5],[71,0,71,2],[73,0,73,2],[26,0,26,19],[27,9,27,11],[14,4,14,7],[13,4,13,7],[141,0,141,19],[142,0,142,19],[111,0,111,2],[134,0,134,19],[136,0,136,19],[137,0,137,19],[127,0,127,19],[128,0,128,19],[129,0,129,19],[130,0,130,19],[126,0,126,19],[120,0,120,19],[121,0,121,19],[122,0,122,19],[123,0,123,19],[124,0,124,19],[125,0,125,19],[75,3,75,5],[118,0,118,19],[119,0,119,19],[112,0,112,3],[112,4,112,7],[112,8,112,11],[108,0,108,2],[114,0,114,19],[110,0,110,2],[109,0,109,2],[115,0,115,19],[116,0,116,19],[112,16,112,19],[110,6,110,7],[112,12,112,15],[111,8,111,10],[108,14,108,15],[108,3,108,5],[109,3,109,5],[110,3,110,5],[108,6,108,7],[109,6,109,7],[111,16,111,19],[111,11,111,13],[117,0,117,19],[107,0,107,2],[107,14,107,15],[107,3,107,5],[107,6,107,7],[107,8,107,10],[106,0,106,2],[105,0,105,2],[105,14,105,15],[106,14,106,15],[105,3,105,5],[106,3,106,5],[105,6,105,7],[106,6,106,7],[105,8,105,10],[106,8,106,10],[105,11,105,13],[106,11,106,13],[101,0,101,2],[101,14,101,15],[102,14,102,15],[101,3,101,5],[102,3,102,5],[101,6,101,7],[102,6,102,7],[101,8,101,10],[102,8,102,10],[101,11,101,13],[104,0,104,2],[103,0,103,2],[103,14,103,15],[104,14,104,15],[103,3,103,5],[104,3,104,5],[103,6,103,7],[104,6,104,7],[102,0,102,2],[103,8,103,10],[104,8,104,10],[103,11,103,13],[100,0,100,2],[99,0,99,2],[99,14,99,15],[100,14,100,15],[98,0,98,2],[97,0,97,2],[97,14,97,15],[98,14,98,15],[97,3,97,5],[98,3,98,5],[97,6,97,7],[98,6,98,7],[97,8,97,10],[98,8,98,10],[97,11,97,13],[98,11,98,13],[99,3,99,5],[100,3,100,5],[99,6,99,7],[100,6,100,7],[96,0,96,2],[95,0,95,2],[95,14,95,15],[96,14,96,15],[95,3,95,5],[96,3,96,5],[95,6,95,7],[96,6,96,7],[95,8,95,10],[96,8,96,10],[95,11,95,13],[96,11,96,13],[94,6,94,7],[93,8,93,10],[94,8,94,10],[93,11,93,13],[94,11,94,13],[88,0,88,2],[92,3,92,5],[92,0,92,2],[91,0,91,2],[91,6,91,7],[92,6,92,7],[91,8,91,10],[92,8,92,10],[94,0,94,2],[93,0,93,2],[93,3,93,5],[94,3,94,5],[93,6,93,7],[88,6,88,7],[89,6,89,7],[87,0,87,2],[91,3,91,5],[88,14,88,15],[87,14,87,15],[88,11,88,13],[87,16,87,19],[88,16,88,19],[90,0,90,2],[89,0,89,2],[89,14,89,15],[90,14,90,15],[90,6,90,7],[89,11,89,13],[90,11,90,13],[89,16,89,19],[90,16,90,19],[87,3,87,5],[88,3,88,5],[89,3,89,5],[90,3,90,5],[90,8,90,10],[91,16,91,19],[91,14,91,15],[87,6,87,7],[83,14,83,15],[81,3,81,5],[82,3,82,5],[86,0,86,2],[85,0,85,2],[84,0,84,2],[84,14,84,15],[85,14,85,15],[86,14,86,15],[84,3,84,5],[85,3,85,5],[86,3,86,5],[81,8,81,10],[82,8,82,10],[83,8,83,10],[84,8,84,10],[85,8,85,10],[86,8,86,10],[83,3,83,5],[82,0,82,2],[81,0,81,2],[81,14,81,15],[82,14,82,15],[81,6,81,7],[80,14,80,15],[78,3,78,5],[79,3,79,5],[80,3,80,5],[78,8,78,10],[79,8,79,10],[80,8,80,10],[80,6,80,7],[80,11,80,13],[71,3,71,5],[72,3,72,5],[73,3,73,5],[74,3,74,5],[68,8,68,10],[69,8,69,10],[70,8,70,10],[71,8,71,10],[72,8,72,10],[73,8,73,10],[74,8,74,10],[71,6,71,7],[72,6,72,7],[73,6,73,7],[156,11,156,17],[18,5,18,6],[19,0,19,19],[20,6,20,7],[22,7,22,10],[23,4,23,6],[24,0,24,19],[148,0,148,19],[155,11,155,17],[138,0,138,19],[139,0,139,19],[140,0,140,19],[143,0,143,19],[144,0,144,19],[145,0,145,19],[131,0,131,19],[132,0,132,19],[133,0,133,19],[74,0,74,2],[111,6,111,7],[77,0,77,2],[77,14,77,15],[72,0,72,2],[75,8,75,10],[0,0,0,19],[2,0,2,19],[6,0,6,19],[135,0,135,19],[16,0,16,19],[17,0,17,19],[7,0,7,19],[8,0,8,19],[9,0,9,19],[10,0,10,19],[11,0,11,19],[12,0,12,19],[40,0,40,19],[31,0,31,19],[32,6,32,7],[33,0,33,19],[34,0,34,19],[21,0,21,19],[30,0,30,19],[86,11,86,13],[111,3,111,5],[29,0,29,19],[76,14,76,15],[68,3,68,5],[84,11,84,13],[80,0,80,2],[79,0,79,2],[78,0,78,2],[83,0,83,2],[74,6,74,7],[75,6,75,7],[76,6,76,7],[77,6,77,7],[78,6,78,7],[79,6,79,7],[82,6,82,7],[83,6,83,7],[84,6,84,7],[76,8,76,10],[77,8,77,10],[76,3,76,5],[77,3,77,5],[76,0,76,2],[75,0,75,2],[81,11,81,13],[82,11,82,13],[83,11,83,13],[77,11,77,13],[85,6,85,7],[86,6,86,7],[85,11,85,13],[110,16,110,19],[107,11,107,13],[108,11,108,13],[109,11,109,13],[107,16,107,19],[108,16,108,19],[109,16,109,19],[110,11,110,13],[99,11,99,13],[100,11,100,13],[92,14,92,15],[93,14,93,15],[94,14,94,15],[102,11,102,13],[104,11,104,13],[99,16,99,19],[100,16,100,19],[101,16,101,19],[102,16,102,19],[108,8,108,10],[109,8,109,10],[110,8,110,10],[87,11,87,13],[87,8,87,10],[88,8,88,10],[89,8,89,10],[91,11,91,13],[92,11,92,13],[99,8,99,10],[100,8,100,10],[96,16,96,19],[97,16,97,19],[98,16,98,19],[103,16,103,19],[104,16,104,19],[105,16,105,19],[106,16,106,19],[71,16,71,19],[72,16,72,19],[73,16,73,19],[74,16,74,19],[75,16,75,19],[76,16,76,19],[80,16,80,19],[81,16,81,19],[82,16,82,19],[83,16,83,19],[84,16,84,19],[95,16,95,19],[85,16,85,19],[86,16,86,19],[92,16,92,19],[93,16,93,19],[94,16,94,19],[71,11,71,13],[72,11,72,13],[73,11,73,13],[74,11,74,13],[75,11,75,13],[76,11,76,13],[77,16,77,19],[78,16,78,19],[79,16,79,19],[78,11,78,13],[79,11,79,13],[78,14,78,15],[79,14,79,15]]}
["Bevezető szöveg"]
["Ez a dokumentum "]
["Ez a dokumentum az Ön által ezidáig megadott adatok és a jelenlegi pénzügyi piaci feltételek alapján készült."]
["Az alábbi tájékoztatás "]
["Ezt követően a piaci feltételek függvényében változhat."]
["Ez a dokumentum nem kötelezi MagNet Bank Zrt.-t arra, hogy hitelt nyújtson Önnek."]
["1. Hitelező"]
["Hitelező neve: MagNet Magyar Közösségi Bank Zrt."]
["Telefonszám: 06-1-428-8888"]
["Levelezési cím: 1376 Budapest 62. Pf. 86."]
{"$rows_left_out":148}
{"sheet":"Induló lap","index":7,"n_rows":17,"n_cols":15,"rows_kept":17,"cut":false,"hidden":true,"merged":[]}
[]
[]
[]
[]
[]
[]
[]
[]
[]
[]
{"$rows_left_out":7}