{"text_format":"1","workbook":"xlsx","n_sheets":21,"sheets":["TARIFÁLÓ","Családi","Családi díj","VIP","Jogtárs","Jogtárs díj","VIP díj","Gépjárművezetői","Gépjárművezetői díj","Útravaló","Átdolgozás, töredékdíj","Indexálás visszavonása","Útravaló díj","Színkódok","Adatok","Változáskövetés","Flotta adatközlő","Jogtárs engedély","Jogtárs egyedi díj","MZ Adatok","Adatváltozás nyomtatványok"],"not_rendered":{"charts":0,"images":6,"macros":1,"external_links":1,"defined_names":32,"comments":5,"pivot_tables":0},"unopened":[],"bounds":{"document_bytes":16777216,"sheet_cells":100000,"rows_first":2000,"rows_last":500,"rows_between":2000,"halvings":0,"cell_chars":16384,"cell_head_chars":4096},"cells_cut":0,"cells_raw":0,"read":"whole","date_system":"1900"}

{"sheet":"TARIFÁLÓ","index":0,"n_rows":1,"n_cols":15,"rows_kept":1,"cut":false,"hidden":false,"merged":[[0,1,0,8],[0,9,0,12],[0,0,52,0],[0,14,52,14]]}
[" MERT JOGÁBAN ÁLL    MERT JOGÁBAN ÁLL","               Üdvözöllek a tarifáló programban, a mai dátum:",null,null,null,null,null,null,null,{"$f":"TODAY()","v":"2019-12-12"},null,null,null,null," MERT JOGÁBAN ÁLL    MERT JOGÁBAN ÁLL"]

{"sheet":"Családi","index":1,"n_rows":9,"n_cols":11,"rows_kept":9,"cut":false,"hidden":true,"merged":[[1,0,1,1],[3,6,5,6],[8,3,10,3],[8,4,10,4],[3,5,5,5],[8,0,10,0]]}
[]
["Családi"]
[]
["Termék","Fizetési mód","Fizetési gyakoriság","HÍD","HÍD további gépjármű darabszám","Családi + Híd éves díj","Összes fizetendő éves díj","Gyakoriság szerint fizetendő díj"]
["Standard Classic","Csoportos","Féléves","Nem",0,null,null,{"$f":"+IF(AND(C5=Adatok!E7,NOT(B5=Adatok!C4)),\"Havi csak CSOB-osan köthető!!!\",A7*B7*C7*VLOOKUP(C5,Adatok!E4:G7,3,FALSE)+IF(D9=\"A Standard Classic mellé nem lehet Híd csomagot kötni.\",0,D9)*VLOOKUP(C5,Adatok!E4:G7,3,FALSE)+IF(E9=\"A Standard Classic mellé nem lehet Híd csomagot kötni.\",0,IF(D5=\"Igen\",E9,0))*VLOOKUP(C5,Adatok!E4:G7,3,FALSE))","v":30450},null,null,"\u0080"]
["Családi éves díj","Szorzó","Szorzó","Híd éves díj","Éves díj/darab",null,null,"Első díj"]
[{"$f":"+VLOOKUP(A5,Adatok!A4:B6,2,FALSE)","v":58000},{"$f":"+VLOOKUP(B5,Adatok!C4:D6,2,FALSE)","v":1},{"$f":"+VLOOKUP(C5,Adatok!E4:F7,2,FALSE)","v":1.05},50000,"16 000 Ft/további gépjármű",{"$f":"+A7+IF(A5=\"Standard Classic\",0,IF(D5=\"Igen\",D7+E5*16000,0))","v":58000},{"$f":"+IF(H5=\"Havi csak CSOB-osan köthető!!!\",\"Havi csak CSOB-osan köthető!!!\",H5*VLOOKUP(C5,Adatok!E4:H7,4,FALSE))","v":60900},{"$f":"+IF(H5=\"Havi csak CSOB-osan köthető!!!\",\"Havi csak CSOB-osan köthető!!!\",H5*VLOOKUP(C5,Adatok!E4:I7,5,FALSE))","v":30450}]
["Családi fizetendő éves díj",null,null,"Híd fizetendő éves díj","További jármű fizetendő éves díj"]
[{"$f":"+A7*B7*C7","v":60900},null,null,{"$f":"IF(A5=\"Standard Classic\",\"A Standard Classic mellé nem lehet Híd csomagot kötni.\",IF(NOT(ISBLANK(D5)),VLOOKUP(D5,Adatok!J4:K5,2,FALSE),0)*VLOOKUP(C5,Adatok!E4:G7,2,FALSE)*VLOOKUP(B5,Adatok!C4:D6,2,FALSE))","v":"A Standard Classic mellé nem lehet Híd csomagot kötni."},{"$f":"IF(A5=\"Standard Classic\",\"A Standard Classic mellé nem lehet Híd csomagot kötni.\",IF(NOT(ISBLANK(E5)),E5*Adatok!L4,0)*VLOOKUP(C5,Adatok!E4:G7,2,FALSE)*VLOOKUP(B5,Adatok!C4:D6,2,FALSE))","v":"A Standard Classic mellé nem lehet Híd csomagot kötni."}]

{"sheet":"Családi díj","index":2,"n_rows":48,"n_cols":7,"rows_kept":48,"cut":false,"hidden":true,"merged":[[31,1,31,4],[32,1,32,4],[33,1,33,4],[34,1,34,4],[29,1,29,4],[30,1,30,4],[8,9,9,11],[11,9,12,11],[14,9,15,11],[18,1,18,2],[17,1,17,2],[16,1,16,2],[19,1,19,2],[25,0,25,6],[16,3,16,5],[20,2,20,3],[28,1,28,4],[27,1,27,4],[47,0,52,6],[35,0,35,2],[36,0,36,2],[37,0,37,2],[40,2,40,5],[46,0,46,1],[43,1,43,6],[0,0,3,0],[9,0,9,6],[12,1,12,6],[13,1,13,6],[14,1,14,6],[38,9,39,11],[20,9,21,11],[17,9,18,11],[23,9,24,11],[26,9,27,11],[32,9,33,11],[35,9,36,11]]}
["D.A.S. Jogvédelmi Biztosító Zrt.\n1082 Budapest, Futó utca 47-53.\nTel.: +36 1 486 3600\ninfo@das.hu - www.das.hu"]
[]
[]
[]
[]
[]
[]
[]
[]
["CSALÁDI JOGVÉDELM INDÍKATÍV AJÁNLAT MAGÁNSZEMÉLY RÉSZÉRE"]
[]
["Ajánlatkérés adatai:"]
["Ügyfél neve"]
["Állandó lakcíme"]
["Telefonszáma"]
{"$rows_left_out":34}
{"sheet":"VIP","index":3,"n_rows":9,"n_cols":8,"rows_kept":9,"cut":false,"hidden":true,"merged":[[3,5,5,5],[3,6,5,6],[3,8,4,8]]}
[]
["VIP"]
[]
["Termék","Fizetési mód","Fizetési gyakoriság","HÍD","HÍD további gépjármű darabszám","VIP + Híd éves díj","Összes fizetendő éves díj","Gyakoriság szerint fizetendő díj"]
["VIP Standard","Csekkes","Negyedéves","Nem",0,null,null,{"$f":"+IF(AND(C5=Adatok!E7,NOT(B5=Adatok!C4)),\"Havi csak CSOB-osan köthető!!!\",A7*B7*C7*VLOOKUP(C5,Adatok!E4:G7,3,FALSE)+D9*VLOOKUP(C5,Adatok!E4:G7,3,FALSE)+IF(D5=\"Nem\",0,E9)*VLOOKUP(C5,Adatok!E4:G7,3,FALSE))","v":42224.875}]
["VIP éves díj","Szorzó","Szorzó","Híd éves díj","Éves díj/darab",null,null,"Első díj"]
[{"$f":"+VLOOKUP(A5,Adatok!A7:B9,2,FALSE)","v":154000},{"$f":"+VLOOKUP(B5,Adatok!C4:D6,2,FALSE)","v":1.0249999999999999},{"$f":"+VLOOKUP(C5,Adatok!E4:F7,2,FALSE)","v":1.07},50000,"16 000 Ft/további gépjármű",{"$f":"+A7+IF(D5=\"Nem\",0,IF(D5=\"Igen\",D7+E5*16000,0))","v":154000},{"$f":"+A9+D9+IF(D5=\"Nem\",0,E9)","v":168899.5},{"$f":"+IF(H5=\"Havi csak CSOB-osan köthető!!!\",\"Havi csak CSOB-osan köthető!!!\",H5*VLOOKUP(C5,Adatok!E4:I7,5,FALSE))","v":42224.875}]
["VIP fizetendő éves díj",null,null,"Híd fizetendő éves díj","További jármű fizetendő éves díj"]
[{"$f":"+A7*B7*C7","v":168899.5},null,null,{"$f":"IF(NOT(ISBLANK(D5)),VLOOKUP(D5,Adatok!J4:K5,2,FALSE),0)*VLOOKUP(C5,Adatok!E4:F7,2,FALSE)*VLOOKUP(B5,Adatok!C4:D6,2,FALSE)","v":0},{"$f":"+IF(NOT(ISBLANK(E5)),E5*Adatok!L4,0)*VLOOKUP(C5,Adatok!E4:F7,2,FALSE)*VLOOKUP(B5,Adatok!C4:D6,2,FALSE)","v":0}]

{"sheet":"Jogtárs","index":4,"n_rows":13,"n_cols":8,"rows_kept":13,"cut":false,"hidden":true,"merged":[[12,0,13,0],[5,4,6,5]]}
[]
["Jogtárs"]
[]
["Szerződő","Csomag","Fizetési mód","Fizetési gyakoriság","Alkalmazottak létszáma","Éves összes bevétel","Jogtárs éves díja","Ingatlan "]
["Vállalkozás","Standard","Csoportos","Negyedéves",0,0,{"$f":"IF(A5=\"Társasház\",A12,IF(AND(E5=0,F5=0),0,IF(A5=\"Vállalkozás\",IF(OR(E6=\"Egyedi ajánlatkérés szükséges\",F6=\"Egyedi ajánlatkérés szükséges\"),0,IF(B5=\"Standard\",INDEX(Adatok!H25:K28,VLOOKUP($E$5,Adatok!G31:I34,3,TRUE),VLOOKUP($F$5,Adatok!G36:I39,3,TRUE)),INDEX(Adatok!N25:Q28,VLOOKUP($E$5,Adatok!G31:I34,3,TRUE),VLOOKUP($F$5,Adatok!G36:I39,3,TRUE)))),A12)))","v":0},0]
[null,null,null,"Szorzó",{"$f":"+IF(OR(E5>249,F5>3000000000),\"Egyedi ajánlatkérés szükséges\",\"\")","v":""},null,null,"Ingatlan kiegészítő éves díja"]
["Társasház hasznos alapterülete nm-ben",null,null,{"$f":"+VLOOKUP(D5,Adatok!E4:F7,2,FALSE)","v":1.07},null,null,null,{"$f":"+IF(B5=\"Prémium\",62000,41000)&\" Ft\"&\"/ingatlan\"","v":"41000 Ft/ingatlan"}]
[0,null,null,null,null,null,null,"Ingatlan éves díja"]
["Éves díj",null,null,null,null,null,null,{"$f":"+IF(E6=\"Egyedi ajánlatkérés szükséges\",0,H5*+IF(B5=\"Prémium\",62000,41000))","v":0}]
[{"$f":"+IF(B5=\"Prémium\",100,68)&\" Ft\"&\"/nm\"","v":"68 Ft/nm"}]
["Társasház éves díja",null,null,"Összes éves díj","Összes fizetendő éves díj","Gyakoriság szerint fizetendő díj","Első díj"]
[{"$f":"+MAX(A8*IF(B5=\"Standard\",68,100),IF(B5=\"Standard\",68000,100000))","v":68000},null,null,{"$f":"IF(A5=\"Társasház\",A12,IF(AND(E5=0,F5=0),0,IF(A5=\"Vállalkozás\",IF(OR(E6=\"Egyedi ajánlatkérés szükséges\",F6=\"Egyedi ajánlatkérés szükséges\"),0,IF(B5=\"Standard\",INDEX(Adatok!H25:K28,VLOOKUP($E$5,Adatok!G31:I34,3,TRUE),VLOOKUP($F$5,Adatok!G36:I39,3,TRUE)),INDEX(Adatok!N25:Q28,VLOOKUP($E$5,Adatok!G31:I34,3,TRUE),VLOOKUP($F$5,Adatok!G36:I39,3,TRUE)))+H9),A12)))","v":0},{"$f":"+D12*$D$7","v":0},{"$f":"+E12*VLOOKUP(D5,Adatok!E4:G7,3)","v":0},{"$f":"+F12","v":0}]
[{"$f":"+IF(AND(AND($A$5=\"Társasház\",$B$5=\"Prémium\"),A8*100<100000),\"A minimum díj 100 000 Ft\",(IF(AND(AND($A$5=\"Társasház\",$B$5=\"Standard\"),A8*68<68000),\"A minimum díj 68 000 Ft\",\"\")))","v":""}]

{"sheet":"Jogtárs díj","index":5,"n_rows":48,"n_cols":6,"rows_kept":48,"cut":false,"hidden":true,"merged":[[37,5,37,9],[41,4,41,14],[44,2,44,14],[18,0,18,1],[47,0,50,14],[23,2,23,3],[31,0,31,2],[41,2,41,3],[44,0,44,1],[46,0,46,1],[41,0,41,1],[37,0,37,2],[36,0,36,2],[34,0,34,2],[33,5,33,9],[32,0,32,2],[34,5,34,9],[36,5,36,9],[33,0,33,2],[10,17,11,19],[9,0,9,3],[10,0,10,1],[14,0,14,1],[23,0,23,1],[31,5,31,9],[11,0,11,1],[11,2,11,14],[12,2,12,14],[13,2,13,14],[14,2,14,14],[12,0,12,1],[32,5,32,9],[21,2,21,3],[22,0,22,1],[22,2,22,3],[0,0,2,3],[6,0,6,14],[10,2,10,14],[13,0,13,1],[19,0,19,1],[19,2,19,3],[35,0,35,2],[35,5,35,9],[13,17,14,19],[16,17,17,19],[19,17,20,19],[22,17,23,19],[25,17,26,19],[30,5,30,9],[28,0,28,14],[24,0,24,1],[24,2,24,3],[32,3,32,4],[30,0,30,2],[20,0,20,1],[20,2,20,3],[21,0,21,1]]}
["D.A.S. Jogvédelmi Biztosító Zrt.\n1082 Budapest, Futó utca 47-53.\nTel.: +36 1 486 3600\ninfo@das.hu - www.das.hu"]
[]
[]
[]
[]
[]
[{"$f":"IF(Jogtárs!A5=\"vállalkozás\",\"JOGTÁRS INDIKATÍV DÍJAJÁNLAT VÁLLALKOZÁSOKNAK\",\"JOGTÁRS INDIKATÍV DÍJAJÁNLAT TÁRSASHÁZAKNAK\")","v":"JOGTÁRS INDIKATÍV DÍJAJÁNLAT VÁLLALKOZÁSOKNAK"}]
[]
[]
[{"$f":"IF(Jogtárs!A5=\"vállalkozás\",\"Ajánlatkérő cég adatai:\",\"Ajánlatkérő társasház adatai\")","v":"Ajánlatkérő cég adatai:"}]
[{"$f":"IF(Jogtárs!A5=\"vállalkozás\",\"Cég neve:\",\"Társasház neve\")","v":"Cég neve:"}]
[{"$f":"IF(Jogtárs!A5=\"vállalkozás\",\"Cég székhelye\",\"Társasház címe\")","v":"Cég székhelye"}]
[{"$f":"IF(Jogtárs!A5=\"vállalkozás\",\"Cég Adószáma\",\"Közös képviselő neve\")","v":"Cég Adószáma"}]
[{"$f":"IF(Jogtárs!A5=\"vállalkozás\",\"Tevékenység TEÁOR\",\"Közös képviselő telefonja\")","v":"Tevékenység TEÁOR"}]
[{"$f":"IF(Jogtárs!A6=\"vállalkozás\",\"Email cím\",\"Email cím\")","v":"Email cím"}]
{"$rows_left_out":34}
{"sheet":"VIP díj","index":6,"n_rows":48,"n_cols":7,"rows_kept":48,"cut":false,"hidden":true,"merged":[[47,0,52,6],[40,2,40,3],[43,1,43,6],[16,1,16,2],[17,1,17,2],[18,1,18,2],[19,1,19,2],[25,0,25,6],[20,2,20,3],[18,3,18,4],[16,3,16,5],[17,3,17,5],[27,0,27,1],[28,0,28,1],[28,2,28,3],[46,0,46,1],[34,2,34,3],[35,0,35,2],[36,0,36,2],[30,0,30,1],[31,0,31,1],[32,0,32,1],[32,2,32,3],[10,9,11,11],[13,9,14,11],[16,9,17,11],[19,9,20,11],[0,0,3,0],[13,1,13,6],[14,1,14,6],[9,0,9,6],[12,1,12,6],[37,9,38,11],[15,1,15,6],[28,9,29,11],[40,9,41,11],[22,9,23,11],[25,9,26,11],[34,9,35,11],[29,0,29,1],[29,2,29,3],[30,2,30,3],[31,2,31,3],[27,2,27,3],[37,0,37,2],[33,0,33,1],[33,2,33,3],[34,0,34,1]]}
["D.A.S. Jogvédelmi Biztosító Zrt.\n1082 Budapest, Futó utca 47-53.\nTel.: +36 1 486 3600\ninfo@das.hu - www.das.hu"]
[]
[]
[]
[]
[]
[]
[]
[]
["CSALÁDI VIP JOGVÉDELM INDÍKATÍV AJÁNLAT MAGÁNSZEMÉLY RÉSZÉRE"]
[]
["Ajánlatkérés adatai:"]
["Ügyfél neve"]
["Állandó lakcíme"]
["Telefonszáma"]
{"$rows_left_out":34}
{"sheet":"Gépjárművezetői","index":7,"n_rows":9,"n_cols":7,"rows_kept":9,"cut":false,"hidden":true,"merged":[[3,5,4,6]]}
[]
["Gépjárművezetői"]
[]
["Szerződő","Biztosított jogosítványok darabszáma","Fizetési mód","Fizetési gyakoriság",null,{"$f":"+IF(G7<10000,\"A Gyakoriság szerint fizetendő díj nem lehet 10.000 Forint alatt!\",\"\")","v":"A Gyakoriság szerint fizetendő díj nem lehet 10.000 Forint alatt!"}]
["NEM magánszemély",0,"Csoportos","Negyedéves"]
["Éves díj","Szorzó","Szorzó","Szorzó",null,"Fizetendő éves díj","Gyakoriság szerint fizetendő díj"]
[{"$f":"+VLOOKUP(A5,Adatok!N4:O5,2,FALSE)*B7","v":0},{"$f":"B5","v":0},{"$f":"+VLOOKUP(C5,Adatok!C4:D6,2,FALSE)","v":1},{"$f":"+VLOOKUP(D5,Adatok!E4:F7,2,FALSE)","v":1.07},{"$f":"+A7*C7*D7","v":0},{"$f":"+IF(G7=\"Havi csak CSOB-osan köthető!!!\",\"Havi csak CSOB-osan köthető!!!\",ROUND(G7*VLOOKUP(D5,Adatok!E4:H7,4,FALSE),0))","v":0},{"$f":"+IFERROR(IF(AND(D5=Adatok!E7,NOT(C5=Adatok!C4)),\"Havi csak CSOB-osan köthető!!!\",E7/B7/VLOOKUP(D5,Adatok!E4:H7,4,FALSE)*B7),0)","v":0}]
[null,null,null,null,null,null,"Első díj"]
[null,null,null,null,null,null,{"$f":"+IF(G7=\"Havi csak CSOB-osan köthető!!!\",\"Havi csak CSOB-osan köthető!!!\",G7*VLOOKUP(D5,Adatok!E4:I7,5,FALSE))","v":0}]

{"sheet":"Gépjárművezetői díj","index":8,"n_rows":49,"n_cols":4,"rows_kept":49,"cut":false,"hidden":true,"merged":[[21,9,22,11],[24,9,25,11],[27,9,28,11],[12,9,13,11],[15,9,16,11],[18,9,19,11],[47,0,47,1],[48,0,53,6],[30,0,30,1],[31,0,31,1],[32,0,32,1],[30,2,30,3],[31,2,31,3],[32,2,32,3],[41,2,41,5],[33,0,33,2],[36,0,36,2],[37,0,37,2],[38,0,38,2],[34,0,35,6],[44,1,44,6],[0,0,6,2],[28,0,28,6],[21,3,23,6],[12,0,12,6],[15,2,15,6],[16,2,16,6],[17,2,17,6],[18,2,18,6],[19,2,19,6],[20,2,20,6]]}
["D.A.S. Jogvédelmi Biztosító Zrt.\n1082 Budapest, Futó utca 47-53.\nTel.: +36 1 486 3600\ninfo@das.hu - www.das.hu"]
[]
[]
[]
[]
[]
[]
[]
[]
[]
[]
[]
[{"$f":"IF(Gépjárművezetői!A5=\"magánszemély\",\"GÉPJÁRMŰVEZETŐI INDIKATÍV ÁRAJÁNLAT MAGÁNSZEMÉLY RÉSZÉRE\",\"GÉPJÁRMŰVEZETŐI INDIKATÍV ÁRAJÁNLAT VÁLLALKOZÁS RÉSZÉRE\")","v":"GÉPJÁRMŰVEZETŐI INDIKATÍV ÁRAJÁNLAT VÁLLALKOZÁS RÉSZÉRE"}]
[]
["Ajánlatkérés adatai:"]
{"$rows_left_out":35}
{"sheet":"Útravaló","index":9,"n_rows":40,"n_cols":14,"rows_kept":40,"cut":false,"hidden":true,"merged":[[1,8,2,10],[23,0,23,2],[4,9,4,10],[6,9,6,10],[3,9,3,10],[5,9,5,10]]}
[]
["Útravaló",null,null,null,null,null,null,null,{"$f":"+IF(C5=\"Éves\",\"\",IF(J5<10000,\"A Gyakoriság szerint fizetendő díj nem lehet 10.000 Forint alatt!\",\"\"))","v":"A Gyakoriság szerint fizetendő díj nem lehet 10.000 Forint alatt!"}]
[]
["Biztosított","Fizetési mód","Fizetési gyakoriság",null,null,null,null,null,"Összes fizetendő éves díj","Gyakoriság szerint fizetendő díj"]
["NEM magánszemély","Csoportos","Havi",null,null,null,null,null,{"$f":"+IF(J5=\"Havi csak CSOB-osan köthető!!!\",\"Havi csak CSOB-osan köthető!!!\",J5*VLOOKUP(C5,Adatok!E4:H7,4,FALSE))","v":0},{"$f":"IF(AND(C5=Adatok!E7,NOT(B5=Adatok!C4)),\"Havi csak CSOB-osan köthető!!!\",F7*VLOOKUP(C5,Adatok!E4:G7,3,FALSE))","v":0}]
["Éves díj","Szorzó","Szorzó",null,null,null,null,null,null,"Első díj"]
[{"$f":"+IF(A5=Adatok!N4,Útravaló!E24,IF(A5=Adatok!N5,Útravaló!M40,\"\"))","v":0},{"$f":"+VLOOKUP(B5,Adatok!C4:D6,2,FALSE)","v":1},{"$f":"+VLOOKUP(C5,Adatok!E4:F7,2,FALSE)","v":1.1200000000000001},null,null,{"$f":"+A7*B7*C7","v":0},null,null,null,{"$f":"+IF(J5=\"Havi csak CSOB-osan köthető!!!\",\"Havi csak CSOB-osan köthető!!!\",J5*VLOOKUP(C5,Adatok!E4:I7,5,FALSE))","v":0}]
[]
[]
[{"$f":"+Adatok!N4","v":"Magánszemély"},"Kód","Éves díj/darab","Darabszám","Éves díj","Éves díj","Fizetendő éves díj",null,"NEM Magánszemély","Kód","Éves díj/darab","Darabszám","Éves díj","Fizetendő éves díj"]
["Segédmotoros kerékpár és motorkerékpár 500 cm³ alatt",1111,{"$f":"+Adatok!B13","v":13000},2,{"$f":"+IF(D11>0,D11*VLOOKUP(A11,Adatok!$A$12:$B$24,2,FALSE),0)","v":26000},null,{"$f":"+E11*$B$7*$C$7","v":29120.000000000004},null,"Segédmotoros kerékpár és motorkerékpár 500 cm³ alatt",2111,{"$f":"+VLOOKUP(I11,Adatok!D13:E40,2,FALSE)","v":17000},null,{"$f":"+IF(L11>0,L11*VLOOKUP(I11,Adatok!D11:E40,2,FALSE),0)","v":0},{"$f":"+M11*$C$7*$B$7","v":0}]
["Motorkerékpár 500 cm³ felett",1112,{"$f":"+Adatok!B14","v":17000},null,{"$f":"+IF(D12>0,D12*VLOOKUP(A12,Adatok!$A$12:$B$24,2,FALSE),0)","v":0},null,{"$f":"+E12*$B$7*$C$7","v":0},null,"Motorkerékpár 500 cm³ felett",2112,{"$f":"+VLOOKUP(I12,Adatok!D14:E41,2,FALSE)","v":19000},null,{"$f":"+IF(L12>0,L12*VLOOKUP(I12,Adatok!D12:E41,2,FALSE),0)","v":0},0]
["Személygépkocsi 1500 cm³ alatt",1213,{"$f":"+Adatok!B15","v":20000},null,{"$f":"+IF(D13>0,D13*VLOOKUP(A13,Adatok!$A$12:$B$24,2,FALSE),0)","v":0},null,0,null,"Személygépkocsi 1500 cm³ alatt",2211,{"$f":"+VLOOKUP(I13,Adatok!D15:E42,2,FALSE)","v":19000},null,{"$f":"+IF(L13>0,L13*VLOOKUP(I13,Adatok!D13:E42,2,FALSE),0)","v":0},0]
["Személygépkocsi 1500 cm³ felett",1214,{"$f":"+Adatok!B16","v":25000},null,{"$f":"+IF(D14>0,D14*VLOOKUP(A14,Adatok!$A$12:$B$24,2,FALSE),0)","v":0},null,0,null,"Személygépkocsi 1500 cm³ felett",2212,{"$f":"+VLOOKUP(I14,Adatok!D16:E43,2,FALSE)","v":24000},null,{"$f":"+IF(L14>0,L14*VLOOKUP(I14,Adatok!D14:E43,2,FALSE),0)","v":0},0]
["Lakókocsi",1311,{"$f":"+Adatok!B17","v":17000},null,{"$f":"+IF(D15>0,D15*VLOOKUP(A15,Adatok!$A$12:$B$24,2,FALSE),0)","v":0},null,0,null,"Lakókocsi",2311,{"$f":"+VLOOKUP(I15,Adatok!D17:E44,2,FALSE)","v":24000},null,{"$f":"+IF(L15>0,L15*VLOOKUP(I15,Adatok!D15:E44,2,FALSE),0)","v":0},0]
{"$rows_left_out":26}
{"sheet":"Átdolgozás, töredékdíj","index":10,"n_rows":9,"n_cols":2,"rows_kept":9,"cut":false,"hidden":true,"merged":[[0,0,0,1]]}
["Ezzel azt lehet számolni, hogy ha megyzűnik egy szerződés, mekkora töredékdíjat kell fizetni ahhoz, hogy jogfolytonos legyen."]
[]
[]
["Előzmény szerz. Megszűnése","2015-03-30"]
["Új szerz. Kockázatviselés kezdete","2019-07-30"]
["Megszűnt szerződés fizetendő éves díja",66666666]
["Díj/nap",{"$f":"+ROUNDUP(B6/360,2)","v":185185.19}]
["nap",{"$f":"+B5-B4","v":1583}]
["Fizetendő",{"$f":"+B7*DAYS360(B4,B5,TRUE)","v":288888896.39999998}]

{"sheet":"Indexálás visszavonása","index":11,"n_rows":10,"n_cols":9,"rows_kept":10,"cut":false,"hidden":true,"merged":[[2,1,2,2],[2,7,2,8],[2,6,3,6],[2,5,3,5]]}
[]
["Indexálás visszavonása"]
[null,"Index visszavonás előtt",null,null,null,"Indexálás mértéke","Indexálás visszavonás utáni éves díj","Index visszavonás után"]
["Aktuális éves díj","Fizetési mód","Fizetési gyakoriság","HÍD","HÍD további gépjármű darabszám",null,null,"Fizetési mód","Fizetési gyakoriság"]
[45000000,"Csekkes","Éves","Nem",0,{"$f":"Adatok!H15","v":0.04},{"$f":"+ROUND(A5/(100%+F5),0)","v":43269231},"Átutalásos","Éves"]
["Aktuális fizetendő éves díj","Szorzó","Szorzó","Ár","Ár",null,null,"Szorzó","Szorzó"]
[{"$f":"+A5*B7*C7","v":46124999.999999993},{"$f":"+VLOOKUP(B5,Adatok!C4:D6,2,FALSE)","v":1.0249999999999999},{"$f":"+VLOOKUP(C5,Adatok!E4:F7,2,FALSE)","v":1},{"$f":"+ROUND(IF(NOT(ISBLANK(D5)),VLOOKUP(D5,Adatok!J4:K5,2,FALSE),0)*VLOOKUP(C5,Adatok!E5:F7,2,FALSE)*VLOOKUP(B5,Adatok!C4:D6,2,FALSE),0)","v":{"$error":"#N/A"}},{"$f":"+IF(NOT(ISBLANK(E5)),E5*Adatok!L4,0)*VLOOKUP(C5,Adatok!E5:F7,2,FALSE)*VLOOKUP(B5,Adatok!C4:D6,2,FALSE)","v":{"$error":"#N/A"}},null,null,{"$f":"+VLOOKUP(H5,Adatok!C4:D6,2,FALSE)","v":1.0249999999999999},{"$f":"+VLOOKUP(I5,Adatok!E4:F7,2,FALSE)","v":1}]
[]
[null,null,null,null,null,null,null,"Gyakoriság szerint fizetendő díj","Fizetendő éves díj"]
[null,null,null,null,null,null,null,{"$f":"+I10*VLOOKUP(C5,Adatok!E4:G7,3,FALSE)","v":44350961.774999999},{"$f":"+G5*H7*I7","v":44350961.774999999}]

{"sheet":"Útravaló díj","index":12,"n_rows":73,"n_cols":8,"rows_kept":73,"cut":false,"hidden":true,"merged":[[72,0,77,7],[33,0,33,2],[35,0,35,2],[41,0,41,2],[34,0,34,2],[38,0,38,2],[71,0,71,1],[57,0,57,2],[42,0,42,2],[43,0,43,2],[63,0,63,2],[66,2,66,4],[63,4,63,5],[64,1,64,2],[69,1,69,7],[64,4,64,5],[13,2,13,7],[17,2,17,7],[16,2,16,7],[51,0,51,2],[39,0,39,2],[40,0,40,2],[50,0,50,2],[45,0,45,2],[46,0,46,2],[47,0,47,2],[48,0,48,2],[31,0,31,2],[44,0,44,2],[14,2,14,7],[18,2,18,7],[19,3,22,7],[0,0,7,2],[10,0,10,7],[60,0,60,7],[25,0,25,7],[30,0,30,2],[49,0,49,2],[52,0,52,2],[53,0,53,2],[54,0,54,2],[55,0,55,2],[29,0,29,2],[59,0,59,2],[15,2,15,7],[32,0,32,2],[36,0,36,2],[37,0,37,2],[56,0,56,2],[32,10,33,12],[35,10,36,12],[17,10,18,12],[20,10,21,12],[23,10,24,12],[26,10,27,12],[29,10,30,12]]}
["D.A.S. Jogvédelmi Biztosító Zrt.\n1082 Budapest, Futó utca 47-53.\nTel.: +36 1 486 3600\ninfo@das.hu - www.das.hu"]
[]
[]
[]
[]
[]
[]
[]
[]
[]
[{"$f":"IF(Útravaló!A5=\"magánszemély\",\"ÚTRAVALÓ INDIKATÍV ÁRAJÁNLAT MAGÁNSZEMÉLY RÉSZÉRE\",\"ÚTRAVALÓ INDIKATÍV ÁRAJÁNLAT VÁLLALKOZÁS RÉSZÉRE\")","v":"ÚTRAVALÓ INDIKATÍV ÁRAJÁNLAT VÁLLALKOZÁS RÉSZÉRE"}]
[]
["Ajánlatkérés adatai:"]
[{"$f":"IF(Útravaló!A5=\"Nem magánszemély\",\"Cég neve\",\"Ügyfél neve\")","v":"Cég neve"}]
[{"$f":"IF(Útravaló!A5=\"nem magánszemély\",\"Cég székhelye\",\"Ügyfél állandó címe\")","v":"Cég székhelye"}]
{"$rows_left_out":59}
{"sheet":"Színkódok","index":13,"n_rows":24,"n_cols":10,"rows_kept":24,"cut":false,"hidden":true,"merged":[]}
[]
[]
[]
[null,null,null,null,null,null,null,null,"Legördülő lista*","*Kattintás után jelenik meg a legördülő lista."]
[]
[]
[]
[null,null,null,null,null,null,null,null,"Írható cella"]
[]
[]
[]
[null,null,null,null,null,null,null,null,"Összes fizetendő éves díj"]
[]
[]
[]
{"$rows_left_out":10}
{"sheet":"Adatok","index":14,"n_rows":40,"n_cols":17,"rows_kept":40,"cut":false,"hidden":true,"merged":[]}
["Classic termékek"]
[]
["Terméknév","Alapár","Díjfiz mód","Mód szorzó","Díjfiz gyak","Gyak szorzó","Gyakoriság","Éves gyak","Elsődíj szorzó","HÍD",null,"Híd további autó",null,"Szerződő","Gépjárművezetői alapár"]
["Standard Classic",58000,"Csoportos",1,"Éves",1,1,1,1,"Igen",50000,16000,null,"Magánszemély",11000]
["Médium Classic",78000,"Átutalásos",1.0249999999999999,"Féléves",1.05,0.5,2,1,"Nem",0,null,null,"NEM magánszemély",16000]
["Prémium Classic",98000,"Csekkes",1.0249999999999999,"Negyedéves",1.07,0.25,4,1]
["VIP Standard",154000,null,null,"Havi",1.1200000000000001,8.3333333333333301E-2,12,2]
["VIP Médium",187000]
["VIP Prémium",221000]
[]
[]
["Magánszemély útravaló","Alapár",null,"Nem magánszemély útravaló árak",null,null,"Indexálás",null,null,"2010.07.26 előtt jött létre?"]
["Segédmotoros kerékpár és motorkerékpár 500 cm³ alatt",13000,null,"Segédmotoros kerékpár és motorkerékpár 500 cm³ alatt",17000,null,"2014.07.01 előtt",7.0000000000000007E-2,null,"igen"]
["Motorkerékpár 500 cm³ felett",17000,null,"Motorkerékpár 500 cm³ felett",19000,null,"2014.07.01-2015.07.31",4.9799999999999997E-2,null,"nem"]
["Személygépkocsi 1500 cm³ alatt",20000,null,"Személygépkocsi 1500 cm³ alatt",19000,null,"2015.08.01 után",0.04]
{"$rows_left_out":26}
{"sheet":"Változáskövetés","index":15,"n_rows":11,"n_cols":3,"rows_kept":11,"cut":false,"hidden":true,"merged":[]}
[]
["2.0","2015.03.09","Első kiadott verzió"]
["2.1","2015.04.22","2015.augusztól az indexálás mértéke 4%"]
["3.0","2015.06.19","Szerződés módosítás beírható Éves díjjal"]
["4.0","2016.01.22","Havi fizetési gyakoriság"]
["5.0","2019-08-12","Átírás új excel fájlba, adatok frissítése"]
["5.1","2019-08-14","Jogtárs hozzáadása"]
["5.2","2019-08-14","Kisebb javítások, szerkesztés"]
["5.3","2019-08-15","Formázás"]
["5.4","2019-08-16","Formázás"]
["6","2019-10-29","Makrók hozzáadása"]

{"sheet":"Flotta adatközlő","index":16,"n_rows":56,"n_cols":9,"rows_kept":56,"cut":false,"hidden":true,"merged":[[0,0,2,6],[55,1,55,3],[50,1,50,3],[50,4,50,6],[55,6,55,7],[6,2,6,4],[6,0,6,1],[54,1,54,3],[6,5,6,6],[6,7,6,8],[5,2,5,8],[3,0,3,1],[4,0,4,1],[5,0,5,1],[4,2,4,8],[54,6,54,7]]}
["Útravaló Flotta adatközlő"]
[]
[]
["Biztosított adatai"]
["Cég neve",null,{"$f":"IF('Útravaló díj'!A14=\"cég neve\",'Útravaló díj'!C14,\"\")","v":0}]
["Cég székhelye",null,{"$f":"IF('Útravaló díj'!A15=\"cég székhelye\",'Útravaló díj'!C15,\"\")","v":0}]
["Cég adószáma",null,{"$f":"IF('Útravaló díj'!A16=\"cég adószáma\",'Útravaló díj'!C16,\"\")","v":0},null,null,"Ajánlat száma:"]
[]
["Rendszám","Gyártmány","Típus","KW","Cm3","Teherbírás","Termékszám","Birtokviszony","Éves alapdíj"]
[]
[]
[]
[]
[]
[]
{"$rows_left_out":42}
{"sheet":"Jogtárs engedély","index":17,"n_rows":36,"n_cols":7,"rows_kept":36,"cut":false,"hidden":true,"merged":[[35,2,35,5],[17,1,17,6],[19,1,22,6],[24,1,27,6],[29,0,32,0],[29,1,32,6],[34,2,34,5],[15,1,15,2],[15,3,15,4],[15,5,15,6],[7,1,7,6],[8,1,8,6],[9,1,9,6],[10,1,10,6],[11,1,11,6],[12,1,12,6],[0,0,2,3],[4,1,4,6],[5,1,5,6],[6,1,6,6],[13,1,13,6]]}
["D.A.S. Jogtárs Egyedi Engedély Kérelem"]
[]
[]
[]
["Kérelem dátuma"]
["Étékesítő neve, kódja "]
["Termék neve"]
["Cég neve"]
["Cég székhelye"]
["Cég adószáma"]
["Alapítás éve"]
["Tulajdonos"]
["Fő tevékenység Teáor"]
["Egyéb tevékenység Teáor"]
["Utolsó 3 év dátum",null,"év",null,"év",null,"év"]
{"$rows_left_out":22}
{"sheet":"Jogtárs egyedi díj","index":18,"n_rows":43,"n_cols":6,"rows_kept":43,"cut":false,"hidden":true,"merged":[[27,5,27,8],[29,5,29,8],[31,5,31,8],[30,5,30,8],[39,2,39,9],[36,2,36,3],[36,4,36,9],[33,5,33,8],[29,2,29,3],[30,2,30,3],[31,2,31,3],[33,2,33,3],[11,0,11,1],[14,0,14,1],[29,0,29,1],[30,0,30,1],[31,0,31,1],[0,0,2,5],[39,0,39,1],[7,0,7,3],[9,2,9,9],[17,2,17,9],[22,4,22,9],[27,0,27,1],[24,2,24,3],[25,2,25,3],[27,2,27,3],[8,2,8,9],[11,2,11,9],[10,2,10,9],[15,2,15,9],[16,2,16,9],[17,0,17,1],[41,0,41,1],[42,0,46,11],[33,0,33,1],[36,0,36,1],[5,0,5,9],[20,0,20,9],[26,10,26,11],[24,10,24,12],[27,10,27,12],[22,0,22,3],[24,0,24,1],[25,0,25,1],[25,10,25,12],[15,0,15,1],[16,0,16,1],[10,0,10,1]]}
["D.A.S. Jogvédelmi Biztosító Zrt.\n1082 Budapest, Futó utca 47-53.\nTel.: +36 1 486 3600\ninfo@das.hu - www.das.hu"]
[]
[]
[]
[]
["JOGTÁRS INDIKATÍV DÍJAJÁNLAT VÁLLALKOZÁSOKNAK"]
[]
["Ajánlatkérő cég adatai:"]
["Cég neve: "]
["Cég székhelye"]
["Cég adószáma:"]
["Tevékenység TEÁOR:"]
[]
[]
["Számításhoz adatok:"]
{"$rows_left_out":29}
{"sheet":"MZ Adatok","index":19,"n_rows":4,"n_cols":3,"rows_kept":4,"cut":false,"hidden":true,"merged":[]}
["Tulajdonosa",null,"Igen"]
["Üzemben tartója",null,"Nem"]
["Bérlője",null,"Bizonytalan"]
["Lízingbe vevője"]

{"sheet":"Adatváltozás nyomtatványok","index":20,"n_rows":15,"n_cols":3,"rows_kept":15,"cut":false,"hidden":true,"merged":[[6,2,8,6],[10,2,12,6],[14,2,16,6],[2,2,4,6]]}
[]
[]
[null,null,"Adatváltozás bejelentő biztosított érdek"]
[]
[]
[]
[null,null,"Adatváltozás bejelentő általános adatok"]
[]
[]
[]
[null,null,"Jogtárs változás bejelentő szerződő adatai"]
[]
[]
[]
[null,null,"Jogtárs változás bejelentő biztosított adatai ingatlanjai"]