{"text_format":"1","workbook":"xlsx","n_sheets":7,"sheets":["Munka2","fedlap","díjszamító","Keretszerz","2. sz. mellekelt ","3. sz. mellekelt","adatközlő"],"not_rendered":{"charts":0,"images":5,"macros":1,"external_links":0,"defined_names":6,"comments":0,"pivot_tables":0},"unopened":[],"bounds":{"document_bytes":16777216,"sheet_cells":100000,"rows_first":2000,"rows_last":500,"rows_between":2000,"halvings":0,"cell_chars":16384,"cell_head_chars":4096},"cells_cut":0,"cells_raw":0,"read":"whole","date_system":"1900"}

{"sheet":"Munka2","index":0,"n_rows":4238,"n_cols":26,"rows_kept":4238,"cut":false,"hidden":true,"merged":[[37,23,37,24],[1,25,2,25],[33,23,33,24],[34,23,34,24],[35,23,35,24],[36,23,36,24],[20,23,20,24],[22,23,25,23],[26,23,26,24],[28,23,31,23],[21,0,26,0],[27,0,27,1],[29,0,32,0],[1,23,2,24],[3,23,8,23],[10,23,14,23],[16,23,19,23],[1,0,1,1],[2,0,7,0],[9,0,13,0],[15,0,18,0],[19,0,19,1],[34,0,34,1],[35,0,35,1],[36,0,36,1],[38,0,38,1],[37,0,37,1]]}
[null,null,null,null,null,null,null,null,null,null,null,"IRSZ","Terület 2014",null,null,"kategória",null,"Adószám","azonosítószám","szorzó"]
["Gépjármű-kategóriák",null,"Éves alapdíj","Nemzetközi fuv szorzó",null,null,"jutalékmetes",false,null,null,null,1000,1,null,{"$f":"díjszamító!J21","v":0},{"$f":"VLOOKUP(O2,L:M,2,FALSE)","v":{"$error":"#N/A"}},null,10347263201,33822123,0.80230000000000001,{"$f":"díjszamító!J38","v":0},"azonosító",null,"Gépjármű-kategóriák",null,"Baleseti adó\ndíj / db (Ft)"]
["Személygépkocsi","37 kW teljesítményig ",23400,1,null,null,null,null,null,null,null,1008,1,null,null,null,null,12555514242,33826335,0.82150000000000001,{"$f":"VLOOKUP(U2,S2:T1409,2,FALSE)","v":{"$error":"#N/A"}},"kötvényszám találat"]
[null,"38 kW-tól 50 kW teljesítményig ",27600,1,null,null,null,null,null,null,null,1011,1,null,1,1,null,12053373201,33832591,0.82330000000000003,{"$f":"IF(AND(U9=U2,ISNUMBER(U3)),U3,1)","v":{"$error":"#N/A"}},null,null,"Személygépkocsik \n(M1 gépjármű-kategória)","37 kW teljesítményig ",{"$f":"IF(díjszamító!D8=\"\",\"\",ROUND(MIN(díjszamító!G8*0.3,365*83),0))","v":""}]
[null,"51 kW-tól 70 kW teljesítményig ",32040,1,null,null,"DB szorzó",null,null,null,null,1012,1,null,2,1,null,10491984244,33837640,0.75,null,null,null,null,"38 kW-tól 50 kW teljesítményig ",{"$f":"IF(díjszamító!D9=\"\",\"\",ROUND(MIN(díjszamító!G9*0.3,366*83),0))","v":""}]
[null,"71 kW-tól 100 kW teljesítményig ",37800,1,null,null,0,1,null,null,null,1013,1,null,3,0.8,null,12649073242,35124353,0.63170000000000004,{"$f":"VALUE(díjszamító!J4)","v":0},"adószám",null,null,"51 kW-tól 70 kW teljesítményig ",{"$f":"IF(díjszamító!D10=\"\",\"\",ROUND(MIN(díjszamító!G10*0.3,366*83),0))","v":""}]
[null,"101 kW-tól 180 kW teljesítményig ",42000,1,null,null,11,1.1000000000000001,null,null,null,1014,1,null,4,0.8,null,10345735242,35124644,0.87019999999999997,{"$f":"IF(U6=0,0,IF(V10=1,1,IF(ISNUMBER(U8),0,1)))","v":0},"Díj igen/nem(1/0)",null,null,"71 kW-tól 100 kW teljesítményig ",{"$f":"IF(díjszamító!D11=\"\",\"\",ROUND(MIN(díjszamító!G11*0.3,366*83),0))","v":""}]
[null,"180 kW teljesítmény felett ",49800,1,null,null,31,1.1499999999999999,null,null,null,1015,1,null,5,0.7,null,12927555243,35149147,0.76880000000000004,{"$f":"VLOOKUP(U6,R2:R1409,1,FALSE)","v":{"$error":"#N/A"}},"adószám találat",null,null,"101 kW-tól 180 kW teljesítményig ",{"$f":"IF(díjszamító!D12=\"\",\"\",ROUND(MIN(díjszamító!G12*0.3,366*83),0))","v":""}]
[null,null,null,null,null,null,61,1.2,null,null,null,1016,1,null,6,0.7,null,10708242242,35237593,0.85950000000000004,{"$f":"VLOOKUP(U6,R2:S1409,2,FALSE)","v":{"$error":"#N/A"}},"azonosító",null,null,"180 kW teljesítmény felett ",{"$f":"IF(díjszamító!D13=\"\",\"\",ROUND(MIN(díjszamító!G13*0.3,366*83),0))","v":""}]
["Motorkerékpár","12 kW teljesítményig ",6350,1,null,null,101,1.3,null,null,null,1020,1,null,{"$f":"P2","v":{"$error":"#N/A"}},{"$f":"INDEX(P4:P9,O10,1)","v":{"$error":"#N/A"}},null,12782419243,35250704,0.8508,"nem jó kötvényszám",{"$f":"IF(ISNUMBER(U8)=TRUE,IF(EXACT(U9,U2)=FALSE,0,1),1)","v":1},null,null,null,{"$f":"IF(díjszamító!D14=\"\",\"\",ROUND(MIN(díjszamító!G14*0.3,366*83),0))","v":""}]
[null,"13 kW-tól 35 kW teljesítményig ",10500,1,null,null,{"$f":"díjszamító!J33","v":0},{"$f":"VLOOKUP(G11,G6:H10,2)","v":1},null,null,null,1021,1,null,null,null,null,12220652244,35285974,0.68910000000000005,"Tarifáláshoz az adószám, a TEÁOR kód és a székhely írányítószámának megadása kötelező!",{"$f":"IF(V19>0,U11,\"\")","v":"Tarifáláshoz az adószám, a TEÁOR kód és a székhely írányítószámának megadása kötelező!"},null,"Motorkerékpárok \n(L3e, L4e, L5e, L7e gépjármű-kategória)","12 kW teljesítményig ",{"$f":"IF(díjszamító!D15=\"\",\"\",ROUND(MIN(díjszamító!G15*0.3,366*83),0))","v":""}]
[null,"36 kW-tól 70 kW teljesítményig ",12900,1,null,null,"Használatmódja",null,null,null,null,1022,1,null,null,null,null,12921724213,35852203,0.38890000000000002,"A szerződő Egyedi UNION-Flotta szorzóval rendelkezik. Kérjük a tarifáláshoz adja meg a szerződő keretkötvényszámát vagy partnerszámát. Amennyiben nem ismeri az azonosítókat, kérjük vegye fel a kapcsolatot az Alkusz Igazgatósággal!",{"$f":"IF(U7=0,U12,\"\")","v":"A szerződő Egyedi UNION-Flotta szorzóval rendelkezik. Kérjük a tarifáláshoz adja meg a szerződő keretkötvényszámát vagy partnerszámát. Amennyiben nem ismeri az azonosítókat, kérjük vegye fel a kapcsolatot az Alkusz Igazgatósággal!"},null,null,"13 kW-tól 35 kW teljesítményig ",{"$f":"IF(díjszamító!D16=\"\",\"\",ROUND(MIN(díjszamító!G16*0.3,366*83),0))","v":""}]
[null,"71 kW-tól 94 kW teljesítményig ",13500,1,null,null,1,1,null,null,null,1023,1,null,"Flottakezelő",false,null,22516716213,36226730,0.86509999999999998,null,null,null,null,"36 kW-tól 70 kW teljesítményig ",{"$f":"IF(díjszamító!D17=\"\",\"\",ROUND(MIN(díjszamító!G17*0.3,366*83),0))","v":""}]
[null,"94 kW teljesítmény felett ",15000,1,null,null,2,1.5,null,null,null,1024,1,null,null,null,null,10741904213,36318336,0.5534,null,null,null,null,"71 kW-tól 94 kW teljesítményig ",{"$f":"IF(díjszamító!D18=\"\",\"\",ROUND(MIN(díjszamító!G18*0.3,366*83),0))","v":""}]
[null,null,null,null,null,null,3,2,null,null,null,1025,1,null,"Területszorzó",{"$f":"IF(P13=TRUE,1,P10)","v":{"$error":"#N/A"}},null,10555824216,36319478,0.51390000000000002,"1 hibát jelent",null,null,null,"94 kW teljesítmény felett ",{"$f":"IF(díjszamító!D19=\"\",\"\",ROUND(MIN(díjszamító!G19*0.3,366*83),0))","v":""}]
["Autóbusz","10-19 férőhely",80000,{"$f":"IF($F$27=TRUE,1.25,1)","v":1},null,null,null,null,null,null,null,1026,1,null,null,null,null,10512045218,36322511,0.5988,"adószám",{"$f":"IF(díjszamító!J4=\"\",1,0)","v":1},null,null,null,{"$f":"IF(díjszamító!D20=\"\",\"\",ROUND(MIN(díjszamító!G20*0.3,366*83),0))","v":""}]
[null,"20-42 férőhely",120000,{"$f":"IF($F$27=TRUE,1.25,1)","v":1},null,null,1,{"$f":"INDEX(H13:H16,G17,1)","v":1},null,null,null,1027,1,null,null,null,null,14044443241,36672423,0.92369999999999997,"Teáor kód",{"$f":"IF(H34=TRUE,0,IF(díjszamító!J33<31,0,IF(díjszamító!$J$15=\"\",1,0)))","v":0},null,"Autóbuszok \n(M2, M3 gépjármű-kategória)","10-19 férőhely",{"$f":"IF(díjszamító!D21=\"\",\"\",ROUND(MIN(díjszamító!G21*0.3,366*83),0))","v":""}]
[null,"43-79 férőhely",215000,1,null,null,null,null,null,null,null,1028,1,null,null,null,null,13440743241,37219436,0.75960000000000005,"székhely",{"$f":"IF(díjszamító!J21=\"\",1,0)","v":1},null,null,"20-42 férőhely",{"$f":"IF(díjszamító!D22=\"\",\"\",ROUND(MIN(díjszamító!G22*0.3,366*83),0))","v":""}]
[null,"80 férőhelytől",255000,1,null,null,null,null,null,null,null,1029,1,null,null,null,null,13247746241,37248923,1.0596000000000001,null,{"$f":"V18+V17+V16","v":2},null,null,"43-79 férőhely",{"$f":"IF(díjszamító!D23=\"\",\"\",ROUND(MIN(díjszamító!G23*0.3,366*83),0))","v":""}]
["Trolibusz",null,400000,1,null,"év",1,0.95,"Éves",1,null,1030,1,null,null,null,null,8409271036,37396184,0.86760000000000004,null,null,null,null,"80 férőhelytől",{"$f":"IF(díjszamító!D24=\"\",\"\",ROUND(MIN(díjszamító!G24*0.3,366*83),0))","v":""}]
[null,null,null,null,null,"félév",2,0.98,"Féléves",2,null,1031,1,null,null,null,null,"NULL",37889210,0.53590000000000004,null,null,null,"Trolibusz (M3 gépjármű-kategória)",null,{"$f":"IF(díjszamító!D25=\"\",\"\",ROUND(MIN(díjszamító!G25*0.3,366*83),0))","v":""}]
["Tehergépkocsi","1450 kg össztömegig",59880,{"$f":"IF($F$27=TRUE,2,1)","v":1},null,"negyedév",3,1,"Negyedéves",4,null,1032,1,null,null,null,null,12191680213,38059593,0.70269999999999999,null,null,null,null,null,{"$f":"IF(díjszamító!D26=\"\",\"\",ROUND(MIN(díjszamító!G26*0.3,366*83),0))","v":""}]
[null,"1451-2300 kg össztömegig",59880,{"$f":"IF($F$27=TRUE,2,1)","v":1},null,{"$f":"INDEX(F20:F22,G23,1)","v":"negyedév"},3,{"$f":"INDEX(H20:H22,G23,1)","v":1},{"$f":"INDEX(I20:I22,G23,1)","v":"Negyedéves"},{"$f":"INDEX(J20:J22,G23,1)","v":4},null,1033,1,null,null,null,null,12674013242,38076465,0.56100000000000005,null,null,null,"Tehergépkocsik \n(N1, N2, N3 gépjármű-kategória)","3500 kg össztömegig",{"$f":"IF(díjszamító!D27=\"\",\"\",ROUND(MIN(díjszamító!G27*0.3,366*83),0))","v":""}]
[null,"2301-3500 kg össztömegig",59880,1,null,null,null,null,null,null,null,1034,1,null,null,null,null,11263050216,38078284,2.0703999999999998,null,null,null,null,"3501-7500 kg össztömegig",{"$f":"IF(díjszamító!D28=\"\",\"\",ROUND(MIN(díjszamító!G28*0.3,366*83),0))","v":""}]
[null,"3501-7500 kgössztömegig",102600,1,null,null,null,null,null,null,null,1035,1,null,null,null,null,18688090213,38166081,0.68679999999999997,null,null,null,null,"7501-12000 kg össztömegig",{"$f":"IF(díjszamító!D29=\"\",\"\",ROUND(MIN(díjszamító!G29*0.3,366*83),0))","v":""}]
[null,"7501-12000 kg össztömegig",152280,1,null,"Nemzetközi fuvarozás",null,null,null,null,null,1036,1,null,null,null,null,29090646243,38171139,0.69489999999999996,null,null,null,null,"12000 kg össztömeg felett",{"$f":"IF(díjszamító!D30=\"\",\"\",ROUND(MIN(díjszamító!G30*0.3,366*83),0))","v":""}]
[null,"12000 kg össztömeg felett",222000,1,null,false,null,null,null,null,null,1037,1,null,null,null,null,10614446242,38326946,0.69820000000000004,null,null,null,"Vontatók (N1, N2, N3 gépjármű-kategória)",null,{"$f":"IF(díjszamító!D31=\"\",\"\",ROUND(MIN(díjszamító!G31*0.3,366*83),0))","v":""}]
["Vontató",null,640000,{"$f":"IF($F$27=TRUE,1.5,1)","v":1},null,null,null,null,null,null,null,1038,1,null,null,null,null,10751257241,38336028,0.68330000000000002,null,null,null,null,null,{"$f":"IF(díjszamító!D32=\"\",\"\",ROUND(MIN(díjszamító!G32*0.3,366*83),0))","v":""}]
[null,null,null,null,null,null,null,null,null,null,null,1039,1,null,null,null,null,13753076243,38344538,0.49659999999999999,null,null,null,"Pótkocsik, félpótkocsik (O1, O2, O3, O4, R1, R2, R3, R4 gépjármű-kategória)","750 kg össztömegig",{"$f":"IF(díjszamító!D33=\"\",\"\",ROUND(MIN(díjszamító!G33*0.3,366*83),0))","v":""}]
["Pótkocsik, félpótkocsik","750 kg össztömegig",2400,{"$f":"IF($F$27=TRUE,3,1)","v":1},null,null,"TEÁOR",{"$f":"díjszamító!J15","v":0},null,null,null,1040,2,null,null,null,null,12050473241,38348870,0.71189999999999998,null,null,null,null,"751-3500 kg össztömegig",{"$f":"IF(díjszamító!D34=\"\",\"\",ROUND(MIN(díjszamító!G34*0.3,366*83),0))","v":""}]
[null,"751-3500 kg össztömegig",3000,{"$f":"IF($F$27=TRUE,3,1)","v":1},null,null,"2 Db",{"$f":"LEFT(H30,2)","v":"0"},null,null,null,1041,2,null,null,null,null,12050473241,38348870,0.71189999999999998,null,null,null,null,"3501-10000 kg össztömegig",{"$f":"IF(díjszamító!D35=\"\",\"\",ROUND(MIN(díjszamító!G35*0.3,366*83),0))","v":""}]
[null,"3501-10000 kg össztömegig",3850,1,null,null,null,{"$f":"VLOOKUP(H31,H37:I114,2,FALSE)","v":{"$error":"#N/A"}},null,null,null,1042,2,null,null,null,null,11915661242,38350479,0.93520000000000003,null,null,null,null,"10000 kg össztömeg felett",{"$f":"IF(díjszamító!D36=\"\",\"\",ROUND(MIN(díjszamító!G36*0.3,366*83),0))","v":""}]
[null,"10000 kg össztömeg felett",10680,1,null,null,"szorzó I.",{"$f":"IF(H34=TRUE,0.85,IF(ISNUMBER(H32),H32,1))","v":1},null,null,null,1043,2,null,null,null,null,13842217241,38361442,1.0439000000000001,null,null,null,null,null,{"$f":"IF(díjszamító!D37=\"\",\"\",ROUND(MIN(díjszamító!G37*0.3,366*83),0))","v":""}]
[null,null,null,null,null,null,"TEÁOR nélküli",false,null,null,null,1044,2,null,null,null,null,10712221241,38362963,0.89239999999999997,null,null,null,"Mezőgazdasági vontatók (T1, T2, T3, T4, T5 gépjármű-kategória)","mezőgazdasági vontató",{"$f":"IF(díjszamító!D38=\"\",\"\",ROUND(MIN(díjszamító!G38*0.3,366*83),0))","v":""}]
["Mezőgazdasági vontató","mezőgazdasági vontató",14000,1,null,null,"DB szám TEÁOR",{"$f":"IF(ISNUMBER(VLOOKUP(H31,H37:J114,3,FALSE)),1,0)","v":0},null,null,null,1045,2,null,null,null,null,13353298244,38369663,0.92920000000000003,null,null,null,"Lassú járművek","lassú jármű",{"$f":"IF(díjszamító!D39=\"\",\"\",ROUND(MIN(díjszamító!G39*0.3,366*83),0))","v":""}]
["Lassú járműv","lassú jármű",12000,1,null,null,"Terület TEÁOR",{"$f":"IF(ISNUMBER(VLOOKUP(H31,H37:K114,4,FALSE)),1,0)","v":0},null,"TEÁOR db","TEÁOR terület",1046,2,null,null,null,null,10226779242,38387554,0.68220000000000003,null,null,null,"Munkagépek (S1, S2 gépjármű-kategória)","munkagép",{"$f":"IF(díjszamító!D40=\"\",\"\",ROUND(MIN(díjszamító!G40*0.3,366*83),0))","v":""}]
["Munkagépek","munkagép",12840,1,null,null,null,"01",0.6,1,1,1047,2,null,null,null,null,18097584241,38414284,0.71330000000000005,null,null,null,"Segédmotoros kerékpárok (L1e, L2e gépjármű-kategória)","segédmotoros kerékpár",{"$f":"IF(díjszamító!D41=\"\",\"\",ROUND(MIN(díjszamító!G41*0.3,366*83),0))","v":""}]
["Segédmotoros kerékpár","segédmotoros kerékpár",6840,1,null,null,null,"02",0.6,1,1,1048,2,null,null,null,null,14845220241,38423156,0.87070000000000003,null,null,null,"Négykerekű segédmotoros kerékpárok (L6e gépjármű-kategória)","segédmotoros kerékpár",{"$f":"IF(díjszamító!D42=\"\",\"\",ROUND(MIN(díjszamító!G42*0.3,366*83),0))","v":""}]
["Négykerekű segédmotoros kerékpár","segédmotoros kerékpár",7800,1,null,null,null,"03",0.6,1,1,1050,1,null,null,null,null,10890479244,38437267,0.8427,null,null,null,null,"összesen",{"$f":"SUMPRODUCT(Z4:Z38,díjszamító!D8:D42)","v":0}]
[null,null,null,null,null,null,null,"16",0.7,null,null,1051,1,null,null,null,null,10987711241,38525881,0.96179999999999999]
[null,null,"UNION-Flotta Casco",false,0.95,null,null,"22",0.7,null,null,1052,1,null,null,null,null,12555514242,38647846,0.81779999999999997]
[null,null,"PrivátMed Group",false,0.95,null,null,"35",0.7,1,null,1053,1,null,null,null,null,11952420243,38891160,0.51559999999999995]
[null,null,"UNION-Business Class",false,0.95,null,null,"36",0.7,1,null,1054,1,null,null,null,null,10344277243,38902819,0.9375]
[null,null,"UNION-Kompakt",false,0.95,null,null,"37",0.7,1,null,1055,1,null,null,null,null,12508110241,60207281,0.87190000000000001]
[null,null,"UNION-S.O.S. Extra baleset-biztosítás",false,0.95,null,null,"85",0.7,1,null,1056,1,null,null,null,null,28567002243,60997113,0.67889999999999995]
[null,null,"UNION-Üzlettárs",false,0.95,null,null,"05",0.8,null,null,1058,1,null,null,null,null,14288131213,60998642,0.55869999999999997]
[null,null,null,{"$f":"IF(ISNUMBER(VLOOKUP(TRUE,D41:F46,2,FALSE)),0.95,1)","v":1},null,null,null,"06",0.8,null,null,1060,1,null,null,null,null,"NULL",61273918,0.75819999999999999]
[null,null,null,null,null,null,null,"07",0.8,null,null,1061,1,null,null,null,null,12078314241,61328413,0.95569999999999999]
[null,null,"Értékvédelem","Jármű db","db díj","összesen",null,"08",0.8,null,null,1062,1,null,null,null,null,"NULL",61332834,0.6855]
[null,null,false,{"$f":"SUM(díjszamító!D8:D13)+díjszamító!D27","v":0},"6000",{"$f":"IF(OR(D50=0,C50=FALSE),\"\",MAX(E50*D50,15000))","v":""},null,"09",0.8,null,null,1063,1,null,null,null,null,12218761242,61336077,0.72330000000000005]
[null,null,null,null,null,null,null,"11",0.8,null,null,1064,1,null,null,null,null,49844997233,61345555,0.65980000000000005]
[null,null,null,null,null,null,null,"13",0.8,null,null,1065,1,null,null,null,null,61246177233,61379683,0.76370000000000005]
[null,null,null,null,null,null,null,"14",0.8,null,null,1066,1,null,null,null,null,10842689243,61386883,0.76829999999999998]
[null,null,null,null,null,null,null,"15",0.8,null,null,1067,1,null,null,null,null,13257525213,61388221,0.73309999999999997]
[null,null,null,null,null,null,null,"23",0.8,null,null,1068,1,null,null,null,null,11111111111,61393135,0.59960000000000002]
[null,null,null,null,null,null,null,"24",0.8,null,null,1069,1,null,null,null,null,13877855209,61400868,0.4002]
[null,null,null,null,null,null,null,"25",0.8,null,null,1071,1,null,null,null,null,12134438242,61401043,0.65039999999999998]
[null,null,null,null,null,null,null,"26",0.8,null,null,1072,1,null,null,null,null,12467611144,61401078,0.94410000000000005]
[null,null,null,null,null,null,null,"27",0.8,null,null,1073,1,null,null,null,null,11780043214,61406426,0.53180000000000005]
[null,null,null,null,null,null,null,"28",0.8,null,null,1074,1,null,null,null,null,12086146242,61414012,0.71309999999999996]
[null,null,null,null,null,null,null,"38",0.8,1,null,1075,1,null,null,null,null,12318847241,61426291,0.8488]
[null,null,null,null,null,null,null,"39",0.8,1,null,1076,1,null,null,null,null,12770566242,61426486,0.69530000000000003]
[null,null,null,null,null,null,null,"41",0.8,null,null,1077,1,null,null,null,null,"NULL",61428756,1.0390999999999999]
[null,null,null,null,null,null,null,"42",0.8,null,null,1078,1,null,null,null,null,10450578243,61429329,0.98650000000000004]
[null,null,null,null,null,null,null,"46",0.8,null,null,1080,1,null,null,null,null,10908129242,61432800,0.72199999999999998]
[null,null,null,null,null,null,null,"52",0.8,null,null,1081,1,null,null,null,null,14154542242,61433651,0.97019999999999995]
[null,null,null,null,null,null,null,"58",0.8,null,null,1082,1,null,null,null,null,10346877241,61435251,0.66469999999999996]
[null,null,null,null,null,null,null,"72",0.8,1,null,1083,1,null,null,null,null,10465118242,61438639,0.877]
[null,null,null,null,null,null,null,"74",0.8,1,null,1084,1,null,null,null,null,12238185242,61453185,0.78649999999999998]
[null,null,null,null,null,null,null,"84",0.8,null,null,1085,1,null,null,null,null,12938177217,61453708,0.2455]
[null,null,null,null,null,null,null,"87",0.8,null,null,1086,1,null,null,null,null,46673505228,61454962,1.0308999999999999]
[null,null,null,null,null,null,null,"93",0.8,null,null,1087,1,null,null,null,null,28427308241,61455690,0.76670000000000005]
[null,null,null,null,null,null,null,"94",0.8,null,null,1088,1,null,null,null,null,10813872213,61468440,0.48980000000000001]
[null,null,null,null,null,null,null,"95",0.8,null,null,1089,1,null,null,null,null,12292217242,61472036,0.72499999999999998]
[null,null,null,null,null,null,null,"96",0.8,null,null,1090,1,null,null,null,null,13551506241,61481485,0.68030000000000002]
[null,null,null,null,null,null,null,"10",0.9,null,null,1091,1,null,null,null,null,10791064243,61482648,0.77249999999999996]
[null,null,null,null,null,null,null,"17",0.9,null,null,1092,1,null,null,null,null,12144963243,61485443,0.97330000000000005]
[null,null,null,null,null,null,null,"18",0.9,null,null,1093,1,null,null,null,null,10953442213,61487318,0.88670000000000004]
[null,null,null,null,null,null,null,"29",0.9,null,null,1094,1,null,null,null,null,12050325241,61487342,0.87729999999999997]
[null,null,null,null,null,null,null,"30",0.9,null,null,1095,1,null,null,null,null,12825381241,61489110,0.66720000000000002]
[null,null,null,null,null,null,null,"31",0.9,null,null,1096,1,null,null,null,null,10962787242,61490680,0.85289999999999999]
[null,null,null,null,null,null,null,"32",0.9,null,null,1097,1,null,null,null,null,10774203241,61495879,0.84279999999999999]
[null,null,null,null,null,null,null,"43",0.9,null,null,1098,1,null,null,null,null,27670778218,61505993,0.51970000000000005]
[null,null,null,null,null,null,null,"56",0.9,null,null,1100,2,null,null,null,null,13147385113,61506718,0.63600000000000001]
[null,null,null,null,null,null,null,"62",0.9,null,null,1101,2,null,null,null,null,8392815165,61518321,0.50829999999999997]
[null,null,null,null,null,null,null,"'70",0.9,null,null,1102,2,null,null,null,null,11231240214,61518495,0.50560000000000005]
[null,null,null,null,null,null,null,"75",0.9,1,null,1103,2,null,null,null,null,12826076242,61518946,0.9859]
[null,null,null,null,null,null,null,"80",0.9,null,null,1104,2,null,null,null,null,11670786241,61524123,0.69430000000000003]
[null,null,null,null,null,null,null,"81",0.9,null,null,1105,2,null,null,null,null,42071767233,61525118,0.22159999999999999]
[null,null,null,null,null,null,null,"82",0.9,null,null,1106,2,null,null,null,null,22532404141,61527180,0.90029999999999999]
[null,null,null,null,null,null,null,"88",0.9,null,null,1107,2,null,null,null,null,50355886133,61537143,0.69599999999999995]
[null,null,null,null,null,null,null,"90",0.9,null,null,1108,2,null,null,null,null,12107616242,61538242,0.83540000000000003]
[null,null,null,null,null,null,null,"91",0.9,null,null,1109,2,null,null,null,null,12740112243,61538699,0.58830000000000005]
[null,null,null,null,null,null,null,"92",0.9,null,null,1110,1,null,null,null,null,13448545241,61538963,0.86480000000000001]
[null,null,null,null,null,null,null,"97",0.9,null,null,1111,1,null,null,null,null,12147117244,61544773,0.9607]
[null,null,null,null,null,null,null,"98",0.9,null,null,1112,1,null,null,null,null,13978767241,61546947,0.51529999999999998]
[null,null,null,null,null,null,null,"19",1.1000000000000001,null,null,1113,1,null,null,null,null,10267745243,61555384,0.71279999999999999]
[null,null,null,null,null,null,null,"12",1.2,null,null,1114,1,null,null,null,null,11960245243,61556459,0.74709999999999999]
[null,null,null,null,null,null,null,"47",1.2,null,null,1115,1,null,null,null,null,10537433244,61602240,0.82769999999999999]
[null,null,null,null,null,null,null,"50",1.2,null,null,1116,1,null,null,null,null,10527348242,61612879,0.76280000000000003]
[null,null,null,null,null,null,null,"51",1.2,null,null,1117,1,null,null,null,null,10618251243,61622882,0.69789999999999996]
[null,null,null,null,null,null,null,"53",1.2,null,null,1118,1,null,null,null,null,11867355243,61638489,1.3712]
[null,null,null,null,null,null,null,"60",1.2,null,null,1119,1,null,null,null,null,13458991213,61643763,0.88849999999999996]
[null,null,null,null,null,null,null,"61",1.2,null,null,1120,1,null,null,null,null,14363166241,61658113,1.0347]
[null,null,null,null,null,null,null,"64",1.2,null,null,1121,1,null,null,null,null,12707436242,61667669,0.85980000000000001]
[null,null,null,null,null,null,null,"65",1.2,null,null,1122,1,null,null,null,null,10210798244,61671633,0.90029999999999999]
[null,null,null,null,null,null,null,"66",1.2,null,null,1123,1,null,null,null,null,10894727241,61678042,0.85440000000000005]
[null,null,null,null,null,null,null,"68",1.2,null,null,1124,1,null,null,null,null,12257474244,61680871,1.2263999999999999]
[null,null,null,null,null,null,null,"77",1.2,null,null,1125,1,null,null,null,null,10967438243,61685015,0.71020000000000005]
[null,null,null,null,null,null,null,"79",1.2,null,null,1126,1,null,null,null,null,10275656213,61685269,1.1066]
[null,null,null,null,null,null,null,"99",1.2,null,null,1127,1,null,null,null,null,22969815242,61687491,0.92830000000000001]
[null,null,null,null,null,null,null,"45",1.5,null,null,1128,1,null,null,null,null,10189377244,61687619,0.89690000000000003]
[null,null,null,null,null,null,null,"86",1.5,null,null,1129,1,null,null,null,null,22248460241,61712036,0.46289999999999998]
[null,null,null,null,null,null,null,"49",2,null,null,1130,1,null,null,null,null,14539334213,61712749,0.69979999999999998]
[null,null,null,null,null,null,null,null,null,null,null,1131,1,null,null,null,null,22126456242,61750067,0.58860000000000001]
[null,null,null,null,null,null,null,null,null,null,null,1132,1,null,null,null,null,12218871243,61986176,0.68569999999999998]
[null,null,null,null,null,null,null,null,null,null,null,1133,1,null,null,null,null,12284461213,61991477,0.50139999999999996]
[null,null,null,null,null,null,null,null,null,null,null,1134,1,null,null,null,null,13942094242,62654528,0.42159999999999997]
[null,null,null,null,null,null,null,null,null,null,null,1135,1,null,null,null,null,13689089216,63332213,0.46739999999999998]
[null,null,null,null,null,null,null,null,null,null,null,1136,1,null,null,null,null,14835829243,63822060,0.54049999999999998]
[null,null,null,null,null,null,null,null,null,null,null,1137,1,null,null,null,null,13428781243,64539523,0.60780000000000001]
[null,null,null,null,null,null,null,null,null,null,null,1138,1,null,null,null,null,11590990206,64540882,0.55400000000000005]
[null,null,null,null,null,null,null,null,null,null,null,1139,1,null,null,null,null,12288221243,64738223,0.68440000000000001]
[null,null,null,null,null,null,null,null,null,null,null,1140,1,null,null,null,null,12216398242,64740104,0.88990000000000002]
[null,null,null,null,null,null,null,null,null,null,null,1141,1,null,null,null,null,10262063213,64741289,0.68440000000000001]
[null,null,null,null,null,null,null,null,null,null,null,1142,1,null,null,null,null,12591004241,64742660,0.67859999999999998]
[null,null,null,null,null,null,null,null,null,null,null,1143,1,null,null,null,null,13409588213,64752228,0.22159999999999999]
[null,null,null,null,null,null,null,null,null,null,null,1144,1,null,null,null,null,12120679241,64768959,0.69740000000000002]
[null,null,null,null,null,null,null,null,null,null,null,1145,1,null,null,null,null,11333524219,64816930,0.48080000000000001]
[null,null,null,null,null,null,null,null,null,null,null,1146,1,null,null,null,null,12657874241,64833650,0.70409999999999995]
[null,null,null,null,null,null,null,null,null,null,null,1147,1,null,null,null,null,12849929243,64859009,0.52249999999999996]
[null,null,null,null,null,null,null,null,null,null,null,1148,1,null,null,null,null,10959651243,64928713,0.95909999999999995]
[null,null,null,null,null,null,null,null,null,null,null,1149,1,null,null,null,null,12927153243,64937177,0.50860000000000005]
[null,null,null,null,null,null,null,null,null,null,null,1150,1,null,null,null,null,10452666241,64939674,0.76839999999999997]
[null,null,null,null,null,null,null,null,null,null,null,1151,1,null,null,null,null,10795996243,64944326,0.72619999999999996]
[null,null,null,null,null,null,null,null,null,null,null,1152,1,null,null,null,null,12283381243,64946866,0.94750000000000001]
[null,null,null,null,null,null,null,null,null,null,null,1153,1,null,null,null,null,11524128241,64947359,0.78500000000000003]
[null,null,null,null,null,null,null,null,null,null,null,1154,1,null,null,null,null,10668407241,64968934,0.72409999999999997]
[null,null,null,null,null,null,null,null,null,null,null,1155,1,null,null,null,null,12348813241,64981338,0.72409999999999997]
[null,null,null,null,null,null,null,null,null,null,null,1156,1,null,null,null,null,10547456242,64990314,0.73680000000000001]
[null,null,null,null,null,null,null,null,null,null,null,1157,1,null,null,null,null,11060541205,64992483,0.51119999999999999]
[null,null,null,null,null,null,null,null,null,null,null,1158,1,null,null,null,null,13401425203,64995051,0.51490000000000002]
[null,null,null,null,null,null,null,null,null,null,null,1159,1,null,null,null,null,10588439242,64995174,1.0367999999999999]
[null,null,null,null,null,null,null,null,null,null,null,1160,2,null,null,null,null,15324047241,64995318,0.62570000000000003]
[null,null,null,null,null,null,null,null,null,null,null,1161,2,null,null,null,null,12182431242,65004352,0.75749999999999995]
[null,null,null,null,null,null,null,null,null,null,null,1162,2,null,null,null,null,"NULL",65138289,0.44879999999999998]
[null,null,null,null,null,null,null,null,null,null,null,1163,2,null,null,null,null,14178128213,65138510,0.93779999999999997]
[null,null,null,null,null,null,null,null,null,null,null,1164,2,null,null,null,null,64653273236,65143299,0.50939999999999996]
[null,null,null,null,null,null,null,null,null,null,null,1165,2,null,null,null,null,10923160243,65147273,0.69569999999999999]
[null,null,null,null,null,null,null,null,null,null,null,1166,2,null,null,null,null,10803804213,65177608,0.50090000000000001]
[null,null,null,null,null,null,null,null,null,null,null,1167,2,null,null,null,null,10867527213,65188673,0.53939999999999999]
[null,null,null,null,null,null,null,null,null,null,null,1168,2,null,null,null,null,10418398244,65189027,0.70730000000000004]
[null,null,null,null,null,null,null,null,null,null,null,1169,2,null,null,null,null,12627554242,65189377,0.79800000000000004]
[null,null,null,null,null,null,null,null,null,null,null,1170,2,null,null,null,null,12341476242,65189414,0.69640000000000002]
[null,null,null,null,null,null,null,null,null,null,null,1171,2,null,null,null,null,11182902211,65191063,0.50490000000000002]
[null,null,null,null,null,null,null,null,null,null,null,1172,2,null,null,null,null,12280326241,65191434,0.71240000000000003]
[null,null,null,null,null,null,null,null,null,null,null,1173,2,null,null,null,null,10908679242,65208574,0.68799999999999994]
[null,null,null,null,null,null,null,null,null,null,null,1174,2,null,null,null,null,"NULL",65209470,0.51910000000000001]
[null,null,null,null,null,null,null,null,null,null,null,1175,2,null,null,null,null,44540935224,65210412,0.46089999999999998]
[null,null,null,null,null,null,null,null,null,null,null,1176,2,null,null,null,null,11281355217,65213875,0.54169999999999996]
[null,null,null,null,null,null,null,null,null,null,null,1177,2,null,null,null,null,22240510243,65217366,0.68540000000000001]
[null,null,null,null,null,null,null,null,null,null,null,1178,2,null,null,null,null,13874144214,65217614,0.46160000000000001]
[null,null,null,null,null,null,null,null,null,null,null,1179,2,null,null,null,null,12160651213,65217833,0.79730000000000001]
[null,null,null,null,null,null,null,null,null,null,null,1180,1,null,null,null,null,10446616243,65217956,0.8891]
[null,null,null,null,null,null,null,null,null,null,null,1181,1,null,null,null,null,12841598213,65218393,0.63149999999999995]
[null,null,null,null,null,null,null,null,null,null,null,1182,1,null,null,null,null,11317960218,65221031,0.63600000000000001]
[null,null,null,null,null,null,null,null,null,null,null,1183,1,null,null,null,null,12228526241,65221445,0.97529999999999994]
[null,null,null,null,null,null,null,null,null,null,null,1184,1,null,null,null,null,12960585210,65221533,0.51639999999999997]
[null,null,null,null,null,null,null,null,null,null,null,1185,1,null,null,null,null,11790365243,65222034,0.68640000000000001]
[null,null,null,null,null,null,null,null,null,null,null,1186,1,null,null,null,null,"NULL",65222050,0.49009999999999998]
[null,null,null,null,null,null,null,null,null,null,null,1187,1,null,null,null,null,50757604241,65222085,0.78800000000000003]
[null,null,null,null,null,null,null,null,null,null,null,1188,1,null,null,null,null,12242016242,65222544,0.68200000000000005]
[null,null,null,null,null,null,null,null,null,null,null,1189,1,null,null,null,null,12344709241,65222827,0.74319999999999997]
[null,null,null,null,null,null,null,null,null,null,null,1190,1,null,null,null,null,11917412211,65222878,0.22159999999999999]
[null,null,null,null,null,null,null,null,null,null,null,1191,1,null,null,null,null,10219522244,65223010,0.66539999999999999]
[null,null,null,null,null,null,null,null,null,null,null,1192,1,null,null,null,null,14750698241,65223045,0.67730000000000001]
[null,null,null,null,null,null,null,null,null,null,null,1193,1,null,null,null,null,11138460208,65223109,0.50590000000000002]
[null,null,null,null,null,null,null,null,null,null,null,1194,1,null,null,null,null,48454122231,65223133,0.23319999999999999]
[null,null,null,null,null,null,null,null,null,null,null,1195,1,null,null,null,null,10182930243,65223205,0.80059999999999998]
[null,null,null,null,null,null,null,null,null,null,null,1196,1,null,null,null,null,13081216213,65223248,0.72529999999999994]
[null,null,null,null,null,null,null,null,null,null,null,1198,1,null,null,null,null,18153952242,65223360,0.7026]
[null,null,null,null,null,null,null,null,null,null,null,1199,1,null,null,null,null,12000382243,65223491,0.70209999999999995]
[null,null,null,null,null,null,null,null,null,null,null,1200,2,null,null,null,null,10772335243,65223598,0.77649999999999997]
[null,null,null,null,null,null,null,null,null,null,null,1201,2,null,null,null,null,10328905213,65223619,1.0425]
[null,null,null,null,null,null,null,null,null,null,null,1202,2,null,null,null,null,11425816203,65223643,0.51439999999999997]
[null,null,null,null,null,null,null,null,null,null,null,1203,2,null,null,null,null,11798868242,65223715,0.72109999999999996]
[null,null,null,null,null,null,null,null,null,null,null,1204,2,null,null,null,null,10773893243,65231280,0.88080000000000003]
[null,null,null,null,null,null,null,null,null,null,null,1205,2,null,null,null,null,12195440244,65231379,0.73180000000000001]
[null,null,null,null,null,null,null,null,null,null,null,1206,2,null,null,null,null,10948534213,65242190,0.60819999999999996]
[null,null,null,null,null,null,null,null,null,null,null,1207,2,null,null,null,null,62138671223,65242625,0.22159999999999999]
[null,null,null,null,null,null,null,null,null,null,null,1208,2,null,null,null,null,11968511242,65242940,0.86250000000000004]
[null,null,null,null,null,null,null,null,null,null,null,1209,2,null,null,null,null,14555929243,65243943,0.85829999999999995]
[null,null,null,null,null,null,null,null,null,null,null,1210,1,null,null,null,null,11344603220,65346694,0.48270000000000002]
[null,null,null,null,null,null,null,null,null,null,null,1211,1,null,null,null,null,10899667213,65404348,0.4138]
[null,null,null,null,null,null,null,null,null,null,null,1212,1,null,null,null,null,12019782213,65428139,0.68879999999999997]
[null,null,null,null,null,null,null,null,null,null,null,1213,1,null,null,null,null,12288946243,65848715,0.68710000000000004]
[null,null,null,null,null,null,null,null,null,null,null,1214,1,null,null,null,null,12241565242,65875174,0.68540000000000001]
[null,null,null,null,null,null,null,null,null,null,null,1215,1,null,null,null,null,10630880241,65875393,0.68540000000000001]
[null,null,null,null,null,null,null,null,null,null,null,1216,1,null,null,null,null,12523230241,66537062,0.92169999999999996]
[null,null,null,null,null,null,null,null,null,null,null,1217,1,null,null,null,null,11111111111,66905398,0.95189999999999997]
[null,null,null,null,null,null,null,null,null,null,null,1218,1,null,null,null,null,13788645203,67043937,0.87470000000000003]
[null,null,null,null,null,null,null,null,null,null,null,1219,1,null,null,null,null,22793867213,67175876,0.56489999999999996]
[null,null,null,null,null,null,null,null,null,null,null,1220,1,null,null,null,null,22668325213,67176182,0.66039999999999999]
[null,null,null,null,null,null,null,null,null,null,null,1221,1,null,null,null,null,12253470213,67191999,0.7319]
[null,null,null,null,null,null,null,null,null,null,null,1222,1,null,null,null,null,10356993241,67197231,0.89059999999999995]
[null,null,null,null,null,null,null,null,null,null,null,1223,1,null,null,null,null,12253425213,67207268,0.53269999999999995]
[null,null,null,null,null,null,null,null,null,null,null,1224,1,null,null,null,null,12029145241,67260798,0.88119999999999998]
[null,null,null,null,null,null,null,null,null,null,null,1225,1,null,null,null,null,12907227243,67261715,1.2215]
[null,null,null,null,null,null,null,null,null,null,null,1226,1,null,null,null,null,11179515210,67288176,0.52380000000000004]
[null,null,null,null,null,null,null,null,null,null,null,1227,1,null,null,null,null,12646726243,67289486,0.88639999999999997]
[null,null,null,null,null,null,null,null,null,null,null,1228,1,null,null,null,null,10707485242,67290719,0.47699999999999998]
[null,null,null,null,null,null,null,null,null,null,null,1229,1,null,null,null,null,13038263213,67290751,0.70250000000000001]
[null,null,null,null,null,null,null,null,null,null,null,1230,2,null,null,null,null,"NULL",67300841,0.36890000000000001]
[null,null,null,null,null,null,null,null,null,null,null,1231,2,null,null,null,null,13702324243,67300876,0.89629999999999999]
[null,null,null,null,null,null,null,null,null,null,null,1232,2,null,null,null,null,10897438243,67312017,0.92759999999999998]
[null,null,null,null,null,null,null,null,null,null,null,1233,2,null,null,null,null,10569731241,67312316,0.86439999999999995]
[null,null,null,null,null,null,null,null,null,null,null,1234,2,null,null,null,null,11225740214,67312906,0.59860000000000002]
[null,null,null,null,null,null,null,null,null,null,null,1235,2,null,null,null,null,10856383213,67313271,0.82579999999999998]
[null,null,null,null,null,null,null,null,null,null,null,1236,2,null,null,null,null,11074410205,67313335,0.70909999999999995]
[null,null,null,null,null,null,null,null,null,null,null,1237,2,null,null,null,null,12678471208,67313474,0.59830000000000005]
[null,null,null,null,null,null,null,null,null,null,null,1238,2,null,null,null,null,13048080203,67313554,0.52139999999999997]
[null,null,null,null,null,null,null,null,null,null,null,1239,2,null,null,null,null,14430864213,67313669,0.45]
[null,null,null,null,null,null,null,null,null,null,null,1241,1,null,null,null,null,10223714243,67313722,1.0583]
[null,null,null,null,null,null,null,null,null,null,null,1242,1,null,null,null,null,10586073241,67314987,0.89590000000000003]
[null,null,null,null,null,null,null,null,null,null,null,1243,1,null,null,null,null,10585278211,67315269,0.53269999999999995]
[null,null,null,null,null,null,null,null,null,null,null,1244,1,null,null,null,null,10767410242,67315728,0.37419999999999998]
[null,null,null,null,null,null,null,null,null,null,null,1245,1,null,null,null,null,20448145203,67316018,0.49030000000000001]
[null,null,null,null,null,null,null,null,null,null,null,1251,1,null,null,null,null,12757644242,67316333,0.81950000000000001]
[null,null,null,null,null,null,null,null,null,null,null,1253,1,null,null,null,null,10512966209,67316472,0.70240000000000002]
[null,null,null,null,null,null,null,null,null,null,null,1255,1,null,null,null,null,11560515202,67316552,0.6361]
[null,null,null,null,null,null,null,null,null,null,null,1258,1,null,null,null,null,12249556241,67316632,0.91669999999999996]
[null,null,null,null,null,null,null,null,null,null,null,1275,1,null,null,null,null,12963966241,67316739,0.86360000000000003]
[null,null,null,null,null,null,null,null,null,null,null,1276,1,null,null,null,null,15304726242,67318419,0.75170000000000003]
[null,null,null,null,null,null,null,null,null,null,null,1277,1,null,null,null,null,10654411243,67318531,0.87150000000000005]
[null,null,null,null,null,null,null,null,null,null,null,1279,1,null,null,null,null,10678994242,67318646,0.94499999999999995]
[null,null,null,null,null,null,null,null,null,null,null,1281,1,null,null,null,null,13345370242,67319403,1.3081]
[null,null,null,null,null,null,null,null,null,null,null,1282,1,null,null,null,null,73333595233,67321466,0.22159999999999999]
[null,null,null,null,null,null,null,null,null,null,null,1286,1,null,null,null,null,11913274242,67321669,0.85529999999999995]
[null,null,null,null,null,null,null,null,null,null,null,1300,1,null,null,null,null,62397180243,67322901,0.94169999999999998]
[null,null,null,null,null,null,null,null,null,null,null,1301,1,null,null,null,null,15395883241,67324202,0.89790000000000003]
[null,null,null,null,null,null,null,null,null,null,null,1302,1,null,null,null,null,10072075217,67325117,0.33879999999999999]
[null,null,null,null,null,null,null,null,null,null,null,1309,1,null,null,null,null,12382875207,67326734,1.2811999999999999]
[null,null,null,null,null,null,null,null,null,null,null,1311,1,null,null,null,null,10923902241,67327876,0.87480000000000002]
[null,null,null,null,null,null,null,null,null,null,null,1312,1,null,null,null,null,14478442213,67330258,0.71940000000000004]
[null,null,null,null,null,null,null,null,null,null,null,1313,1,null,null,null,null,11389697205,67330346,0.49049999999999999]
[null,null,null,null,null,null,null,null,null,null,null,1315,1,null,null,null,null,13834980205,67331699,0.63980000000000004]
[null,null,null,null,null,null,null,null,null,null,null,1325,1,null,null,null,null,10644209243,67332050,0.7853]
[null,null,null,null,null,null,null,null,null,null,null,1327,1,null,null,null,null,11894847213,67332923,0.71020000000000005]
[null,null,null,null,null,null,null,null,null,null,null,1329,1,null,null,null,null,12087903242,67333088,1.0262]
[null,null,null,null,null,null,null,null,null,null,null,1330,1,null,null,null,null,10979563213,67333993,0.89990000000000003]
[null,null,null,null,null,null,null,null,null,null,null,1338,1,null,null,null,null,10804393242,67335059,1.7257]
[null,null,null,null,null,null,null,null,null,null,null,1351,1,null,null,null,null,11796770243,67367632,0.90390000000000004]
[null,null,null,null,null,null,null,null,null,null,null,1354,1,null,null,null,null,10485587241,67368926,0.79090000000000005]
[null,null,null,null,null,null,null,null,null,null,null,1357,1,null,null,null,null,12383003243,67368977,0.87839999999999996]
[null,null,null,null,null,null,null,null,null,null,null,1360,1,null,null,null,null,10769261241,67371199,1.0397000000000001]
[null,null,null,null,null,null,null,null,null,null,null,1361,1,null,null,null,null,11226710214,67372175,0.85609999999999997]
[null,null,null,null,null,null,null,null,null,null,null,1362,1,null,null,null,null,13528630211,67372247,0.68920000000000003]
[null,null,null,null,null,null,null,null,null,null,null,1363,1,null,null,null,null,10872961243,67372271,1.0054000000000001]
[null,null,null,null,null,null,null,null,null,null,null,1364,1,null,null,null,null,14147388243,67372335,0.44669999999999999]
[null,null,null,null,null,null,null,null,null,null,null,1365,1,null,null,null,null,11895051242,67374058,0.89480000000000004]
[null,null,null,null,null,null,null,null,null,null,null,1366,1,null,null,null,null,10339895243,67375122,0.91549999999999998]
[null,null,null,null,null,null,null,null,null,null,null,1367,1,null,null,null,null,11014007202,67376571,0.36009999999999998]
[null,null,null,null,null,null,null,null,null,null,null,1368,1,null,null,null,null,11030953203,67377806,0.61980000000000002]
[null,null,null,null,null,null,null,null,null,null,null,1369,1,null,null,null,null,14367438241,67378016,0.93510000000000004]
[null,null,null,null,null,null,null,null,null,null,null,1371,1,null,null,null,null,12020744242,67379086,0.93669999999999998]
[null,null,null,null,null,null,null,null,null,null,null,1372,1,null,null,null,null,10740439243,67380837,0.8548]
[null,null,null,null,null,null,null,null,null,null,null,1373,1,null,null,null,null,12335990241,67381266,0.8609]
[null,null,null,null,null,null,null,null,null,null,null,1374,1,null,null,null,null,10362675243,67383114,1.1000000000000001]
[null,null,null,null,null,null,null,null,null,null,null,1376,1,null,null,null,null,10549032242,67384088,0.96519999999999995]
[null,null,null,null,null,null,null,null,null,null,null,1380,1,null,null,null,null,13602059207,67386198,0.49440000000000001]
[null,null,null,null,null,null,null,null,null,null,null,1381,1,null,null,null,null,12164442242,67387369,0.97540000000000004]
[null,null,null,null,null,null,null,null,null,null,null,1382,1,null,null,null,null,11828800243,67391683,0.97219999999999995]
[null,null,null,null,null,null,null,null,null,null,null,1383,1,null,null,null,null,12748141212,67412659,0.53610000000000002]
[null,null,null,null,null,null,null,null,null,null,null,1384,1,null,null,null,null,11005535202,67413846,0.54010000000000002]
[null,null,null,null,null,null,null,null,null,null,null,1385,1,null,null,null,null,10380406220,67414857,0.51759999999999995]
[null,null,null,null,null,null,null,null,null,null,null,1386,1,null,null,null,null,"NULL",67415155,0.50860000000000005]
[null,null,null,null,null,null,null,null,null,null,null,1387,1,null,null,null,null,"NULL",67415390,0.53549999999999998]
[null,null,null,null,null,null,null,null,null,null,null,1388,1,null,null,null,null,13610764213,67423948,0.50170000000000003]
[null,null,null,null,null,null,null,null,null,null,null,1389,1,null,null,null,null,10847392244,67424035,0.57130000000000003]
[null,null,null,null,null,null,null,null,null,null,null,1390,1,null,null,null,null,12260036242,67429661,0.92100000000000004]
[null,null,null,null,null,null,null,null,null,null,null,1391,1,null,null,null,null,24538994213,67430734,0.57679999999999998]
[null,null,null,null,null,null,null,null,null,null,null,1392,1,null,null,null,null,11988612242,67431294,0.84340000000000004]
[null,null,null,null,null,null,null,null,null,null,null,1393,1,null,null,null,null,10690767208,67432289,0.4647]
[null,null,null,null,null,null,null,null,null,null,null,1394,1,null,null,null,null,12190593242,67432748,0.85580000000000001]
[null,null,null,null,null,null,null,null,null,null,null,1395,1,null,null,null,null,13410021213,67434145,0.56999999999999995]
[null,null,null,null,null,null,null,null,null,null,null,1396,1,null,null,null,null,12051553242,67434946,0.85870000000000002]
[null,null,null,null,null,null,null,null,null,null,null,1397,1,null,null,null,null,11120858208,67434997,0.59609999999999996]
[null,null,null,null,null,null,null,null,null,null,null,1398,1,null,null,null,null,14560222213,67435228,0.53549999999999998]
[null,null,null,null,null,null,null,null,null,null,null,1399,1,null,null,null,null,13629377203,67435332,0.53979999999999995]
[null,null,null,null,null,null,null,null,null,null,null,1400,1,null,null,null,null,13613121242,67435404,0.85840000000000005]
[null,null,null,null,null,null,null,null,null,null,null,1406,1,null,null,null,null,13152767213,67435666,0.87219999999999998]
[null,null,null,null,null,null,null,null,null,null,null,1410,1,null,null,null,null,10610868213,67435738,0.88670000000000004]
[null,null,null,null,null,null,null,null,null,null,null,1425,1,null,null,null,null,10922956243,67435834,0.85929999999999995]
[null,null,null,null,null,null,null,null,null,null,null,1426,1,null,null,null,null,10989634241,67436300,0.87280000000000002]
[null,null,null,null,null,null,null,null,null,null,null,1428,1,null,null,null,null,12146415241,67436546,0.83489999999999998]
[null,null,null,null,null,null,null,null,null,null,null,1430,1,null,null,null,null,12005150242,67436888,0.90529999999999999]
[null,null,null,null,null,null,null,null,null,null,null,1431,1,null,null,null,null,13945437213,67437055,0.51400000000000001]
[null,null,null,null,null,null,null,null,null,null,null,1437,1,null,null,null,null,12612684241,67437100,0.92789999999999995]
[null,null,null,null,null,null,null,null,null,null,null,1438,1,null,null,null,null,14858026241,67437127,0.97140000000000004]
[null,null,null,null,null,null,null,null,null,null,null,1439,1,null,null,null,null,12329452241,67437290,0.89639999999999997]
[null,null,null,null,null,null,null,null,null,null,null,1440,1,null,null,null,null,15340931203,67477487,0.52159999999999995]
[null,null,null,null,null,null,null,null,null,null,null,1441,1,null,null,null,null,15445964215,67482083,0.57799999999999996]
[null,null,null,null,null,null,null,null,null,null,null,1442,1,null,null,null,null,73922188235,67482366,0.47510000000000002]
[null,null,null,null,null,null,null,null,null,null,null,1443,1,null,null,null,null,10402544242,67484599,1.427]
[null,null,null,null,null,null,null,null,null,null,null,1444,1,null,null,null,null,12766680220,67484812,0.80640000000000001]
[null,null,null,null,null,null,null,null,null,null,null,1445,1,null,null,null,null,18160013241,67496805,0.94099999999999995]
[null,null,null,null,null,null,null,null,null,null,null,1446,1,null,null,null,null,10415429241,67497525,0.95189999999999997]
[null,null,null,null,null,null,null,null,null,null,null,1447,1,null,null,null,null,10434268242,67503200,0.69479999999999997]
[null,null,null,null,null,null,null,null,null,null,null,1448,1,null,null,null,null,"NULL",67504983,0.28949999999999998]
[null,null,null,null,null,null,null,null,null,null,null,1450,1,null,null,null,null,10779026242,67507746,0.86240000000000006]
[null,null,null,null,null,null,null,null,null,null,null,1452,1,null,null,null,null,10965137241,67508714,0.87539999999999996]
[null,null,null,null,null,null,null,null,null,null,null,1453,1,null,null,null,null,12158485244,67509610,0.90259999999999996]
[null,null,null,null,null,null,null,null,null,null,null,1461,1,null,null,null,null,10814811242,67510734,0.91639999999999999]
[null,null,null,null,null,null,null,null,null,null,null,1462,1,null,null,null,null,10543256243,67511665,0.90639999999999998]
[null,null,null,null,null,null,null,null,null,null,null,1463,1,null,null,null,null,10621961220,67511956,0.50580000000000003]
[null,null,null,null,null,null,null,null,null,null,null,1464,1,null,null,null,null,12083916243,67512502,0.78139999999999998]
[null,null,null,null,null,null,null,null,null,null,null,1465,1,null,null,null,null,28205751243,67528627,0.95379999999999998]
[null,null,null,null,null,null,null,null,null,null,null,1475,1,null,null,null,null,10441264241,67531770,0.95330000000000004]
[null,null,null,null,null,null,null,null,null,null,null,1476,1,null,null,null,null,10955884242,67532634,0.84040000000000004]
[null,null,null,null,null,null,null,null,null,null,null,1479,1,null,null,null,null,12105580242,67533362,0.86109999999999998]
[null,null,null,null,null,null,null,null,null,null,null,1493,1,null,null,null,null,22313393243,67535069,0.76990000000000003]
[null,null,null,null,null,null,null,null,null,null,null,1501,1,null,null,null,null,13854799208,67535309,0.437]
[null,null,null,null,null,null,null,null,null,null,null,1502,1,null,null,null,null,14816145213,67535405,0.88690000000000002]
[null,null,null,null,null,null,null,null,null,null,null,1505,1,null,null,null,null,10940385242,67535456,0.88180000000000003]
[null,null,null,null,null,null,null,null,null,null,null,1506,1,null,null,null,null,13959007243,67535528,0.82609999999999995]
[null,null,null,null,null,null,null,null,null,null,null,1507,1,null,null,null,null,10574948213,67535595,0.85819999999999996]
[null,null,null,null,null,null,null,null,null,null,null,1508,1,null,null,null,null,10964301241,67535835,0.94530000000000003]
[null,null,null,null,null,null,null,null,null,null,null,1509,1,null,null,null,null,10300923211,67535907,0.51939999999999997]
[null,null,null,null,null,null,null,null,null,null,null,1511,1,null,null,null,null,13598286243,67536053,0.92130000000000001]
[null,null,null,null,null,null,null,null,null,null,null,1517,1,null,null,null,null,15307633241,67536109,1.0946]
[null,null,null,null,null,null,null,null,null,null,null,1518,1,null,null,null,null,12290693242,67536176,0.86699999999999999]
[null,null,null,null,null,null,null,null,null,null,null,1519,1,null,null,null,null,11030458203,67537312,0.56489999999999996]
[null,null,null,null,null,null,null,null,null,null,null,1520,1,null,null,null,null,12398155241,67537347,0.82650000000000001]
[null,null,null,null,null,null,null,null,null,null,null,1525,1,null,null,null,null,12738946208,67537486,0.64910000000000001]
[null,null,null,null,null,null,null,null,null,null,null,1526,1,null,null,null,null,10386921242,67540108,0.96750000000000003]
[null,null,null,null,null,null,null,null,null,null,null,1529,1,null,null,null,null,10610064202,67541493,0.38229999999999997]
[null,null,null,null,null,null,null,null,null,null,null,1530,1,null,null,null,null,10364842241,67542496,1.2911999999999999]
[null,null,null,null,null,null,null,null,null,null,null,1531,1,null,null,null,null,20348904208,67544563,0.56640000000000001]
[null,null,null,null,null,null,null,null,null,null,null,1535,1,null,null,null,null,11034029203,67545996,0.52869999999999995]
[null,null,null,null,null,null,null,null,null,null,null,1536,1,null,null,null,null,10892907242,67547545,0.96130000000000004]
[null,null,null,null,null,null,null,null,null,null,null,1537,1,null,null,null,null,14381241242,67550365,0.79179999999999995]
[null,null,null,null,null,null,null,null,null,null,null,1538,1,null,null,null,null,13014584242,67579731,1.2138]
[null,null,null,null,null,null,null,null,null,null,null,1539,1,null,null,null,null,10870055141,67586579,0.88639999999999997]
[null,null,null,null,null,null,null,null,null,null,null,1550,1,null,null,null,null,10331055213,67660089,0.55049999999999999]
[null,null,null,null,null,null,null,null,null,null,null,1551,1,null,null,null,null,12764073241,67661049,0.92290000000000005]
[null,null,null,null,null,null,null,null,null,null,null,1553,1,null,null,null,null,14023059243,67661401,1.0610999999999999]
[null,null,null,null,null,null,null,null,null,null,null,1554,1,null,null,null,null,27641648220,67674501,0.51149999999999995]
[null,null,null,null,null,null,null,null,null,null,null,1555,1,null,null,null,null,12350508242,67675440,1.0915999999999999]
[null,null,null,null,null,null,null,null,null,null,null,1557,1,null,null,null,null,12090187213,67676988,0.50860000000000005]
[null,null,null,null,null,null,null,null,null,null,null,1558,1,null,null,null,null,10609758213,67677083,0.51119999999999999]
[null,null,null,null,null,null,null,null,null,null,null,1576,1,null,null,null,null,11988124213,67679476,0.95599999999999996]
[null,null,null,null,null,null,null,null,null,null,null,1580,1,null,null,null,null,10708754241,67680987,0.90890000000000004]
[null,null,null,null,null,null,null,null,null,null,null,1581,1,null,null,null,null,11467917208,67681779,0.81559999999999999]
[null,null,null,null,null,null,null,null,null,null,null,1583,1,null,null,null,null,12663123213,67682229,0.45]
[null,null,null,null,null,null,null,null,null,null,null,1590,1,null,null,null,null,15329004243,67682958,1.2497]
[null,null,null,null,null,null,null,null,null,null,null,1591,1,null,null,null,null,12252730241,67684240,0.88470000000000004]
[null,null,null,null,null,null,null,null,null,null,null,1592,1,null,null,null,null,21985445241,67684355,0.88580000000000003]
[null,null,null,null,null,null,null,null,null,null,null,1593,1,null,null,null,null,11816672241,67684451,0.90590000000000004]
[null,null,null,null,null,null,null,null,null,null,null,1601,1,null,null,null,null,14529407242,67684494,0.87450000000000006]
[null,null,null,null,null,null,null,null,null,null,null,1605,1,null,null,null,null,8381434424,67684873,0.89959999999999996]
[null,null,null,null,null,null,null,null,null,null,null,1615,1,null,null,null,null,20185996243,67684902,1.8837999999999999]
[null,null,null,null,null,null,null,null,null,null,null,1616,1,null,null,null,null,"NULL",67684945,0.4471]
[null,null,null,null,null,null,null,null,null,null,null,1625,1,null,null,null,null,13094720202,67685040,0.78779999999999994]
[null,null,null,null,null,null,null,null,null,null,null,1630,1,null,null,null,null,11271112216,67685120,0.52549999999999997]
[null,null,null,null,null,null,null,null,null,null,null,1631,1,null,null,null,null,12518968211,67685366,0.91420000000000001]
[null,null,null,null,null,null,null,null,null,null,null,1656,1,null,null,null,null,11943972219,67685569,0.56510000000000005]
[null,null,null,null,null,null,null,null,null,null,null,1660,1,null,null,null,null,13153854241,67685841,0.87790000000000001]
[null,null,null,null,null,null,null,null,null,null,null,1675,1,null,null,null,null,12824720243,67685980,0.87580000000000002]
[null,null,null,null,null,null,null,null,null,null,null,1676,1,null,null,null,null,11893389213,67686078,0.77149999999999996]
[null,null,null,null,null,null,null,null,null,null,null,1680,1,null,null,null,null,10233146241,67686318,0.80669999999999997]
[null,null,null,null,null,null,null,null,null,null,null,1683,1,null,null,null,null,10764266241,67686377,0.94669999999999999]
[null,null,null,null,null,null,null,null,null,null,null,1701,1,null,null,null,null,10499449243,67686473,0.86450000000000005]
[null,null,null,null,null,null,null,null,null,null,null,1703,1,null,null,null,null,18677746113,67686641,0.47239999999999999]
[null,null,null,null,null,null,null,null,null,null,null,1704,1,null,null,null,null,12023462213,67686916,0.54590000000000005]
[null,null,null,null,null,null,null,null,null,null,null,1725,1,null,null,null,null,11991425241,67687126,0.88360000000000005]
[null,null,null,null,null,null,null,null,null,null,null,1734,1,null,null,null,null,"NULL",67687193,0.88770000000000004]
[null,null,null,null,null,null,null,null,null,null,null,1751,1,null,null,null,null,10362826213,67687337,0.51239999999999997]
[null,null,null,null,null,null,null,null,null,null,null,1752,1,null,null,null,null,"NULL",67687492,0.73870000000000002]
[null,null,null,null,null,null,null,null,null,null,null,1755,1,null,null,null,null,10814701241,67687644,0.85899999999999999]
[null,null,null,null,null,null,null,null,null,null,null,1756,1,null,null,null,null,12152764242,67688372,0.87139999999999995]
[null,null,null,null,null,null,null,null,null,null,null,1773,1,null,null,null,null,12493188203,67688508,0.54]
[null,null,null,null,null,null,null,null,null,null,null,1775,1,null,null,null,null,11048572204,67688532,0.52890000000000004]
[null,null,null,null,null,null,null,null,null,null,null,1777,1,null,null,null,null,12558610241,67688620,0.85260000000000002]
[null,null,null,null,null,null,null,null,null,null,null,1780,1,null,null,null,null,13769947243,67688954,0.79310000000000003]
[null,null,null,null,null,null,null,null,null,null,null,1781,1,null,null,null,null,12203695241,67689105,0.87690000000000001]
[null,null,null,null,null,null,null,null,null,null,null,1802,1,null,null,null,null,12744491241,67699186,0.93230000000000002]
[null,null,null,null,null,null,null,null,null,null,null,1810,1,null,null,null,null,10659739242,67731561,0.89449999999999996]
[null,null,null,null,null,null,null,null,null,null,null,1811,1,null,null,null,null,10868171213,67733946,0.86160000000000003]
[null,null,null,null,null,null,null,null,null,null,null,1819,1,null,null,null,null,12201246213,67735212,0.50960000000000005]
[null,null,null,null,null,null,null,null,null,null,null,1829,1,null,null,null,null,10980965207,67735968,0.60389999999999999]
[null,null,null,null,null,null,null,null,null,null,null,1838,1,null,null,null,null,13389806241,67736821,0.78820000000000001]
[null,null,null,null,null,null,null,null,null,null,null,1843,1,null,null,null,null,10832219242,67740353,0.83760000000000001]
[null,null,null,null,null,null,null,null,null,null,null,1846,1,null,null,null,null,11779445242,67740863,0.88290000000000002]
[null,null,null,null,null,null,null,null,null,null,null,1852,1,null,null,null,null,10787315242,67741305,0.85850000000000004]
[null,null,null,null,null,null,null,null,null,null,null,1870,1,null,null,null,null,11133836208,67743298,0.66990000000000005]
[null,null,null,null,null,null,null,null,null,null,null,1888,1,null,null,null,null,12084261213,67744119,0.98970000000000002]
[null,null,null,null,null,null,null,null,null,null,null,1906,1,null,null,null,null,12099045205,67744194,0.65100000000000002]
[null,null,null,null,null,null,null,null,null,null,null,1910,1,null,null,null,null,10506136243,67744442,0.94969999999999999]
[null,null,null,null,null,null,null,null,null,null,null,1911,1,null,null,null,null,10768064241,67746771,0.77129999999999999]
[null,null,null,null,null,null,null,null,null,null,null,1922,1,null,null,null,null,28293925243,67746835,1.1147]
[null,null,null,null,null,null,null,null,null,null,null,1927,1,null,null,null,null,11404006208,67746966,0.5121]
[null,null,null,null,null,null,null,null,null,null,null,1928,1,null,null,null,null,10449925242,67747731,0.94750000000000001]
[null,null,null,null,null,null,null,null,null,null,null,1930,1,null,null,null,null,11002044242,67748371,0.86580000000000001]
[null,null,null,null,null,null,null,null,null,null,null,1931,1,null,null,null,null,13784122243,67749147,0.8044]
[null,null,null,null,null,null,null,null,null,null,null,1944,1,null,null,null,null,10226353241,67752573,0.82]
[null,null,null,null,null,null,null,null,null,null,null,1946,1,null,null,null,null,10698655243,67753904,0.86180000000000001]
[null,null,null,null,null,null,null,null,null,null,null,1947,1,null,null,null,null,10423471243,67756101,0.87919999999999998]
[null,null,null,null,null,null,null,null,null,null,null,1948,1,null,null,null,null,12836848242,67756267,0.8105]
[null,null,null,null,null,null,null,null,null,null,null,1956,1,null,null,null,null,11952107244,67764005,0.47989999999999999]
[null,null,null,null,null,null,null,null,null,null,null,1958,1,null,null,null,null,13838685243,67767265,0.69950000000000001]
[null,null,null,null,null,null,null,null,null,null,null,1959,1,null,null,null,null,10273489241,67772152,1.03]
[null,null,null,null,null,null,null,null,null,null,null,1960,1,null,null,null,null,10758027241,67772427,0.89239999999999997]
[null,null,null,null,null,null,null,null,null,null,null,1961,1,null,null,null,null,11797881205,67773358,0.55740000000000001]
[null,null,null,null,null,null,null,null,null,null,null,1964,1,null,null,null,null,10382082243,67776225,0.87180000000000002]
[null,null,null,null,null,null,null,null,null,null,null,1965,1,null,null,null,null,22456447211,67787768,0.5575]
[null,null,null,null,null,null,null,null,null,null,null,1967,1,null,null,null,null,11598204206,67788090,0.51590000000000003]
[null,null,null,null,null,null,null,null,null,null,null,1970,1,null,null,null,null,10823637243,67788103,0.9294]
[null,null,null,null,null,null,null,null,null,null,null,1971,1,null,null,null,null,"NULL",67788285,0.46929999999999999]
[null,null,null,null,null,null,null,null,null,null,null,1972,1,null,null,null,null,13821720241,67788808,0.86439999999999995]
[null,null,null,null,null,null,null,null,null,null,null,1973,1,null,null,null,null,10244593213,67790457,0.50119999999999998]
[null,null,null,null,null,null,null,null,null,null,null,1974,1,null,null,null,null,12403613243,67790529,0.85189999999999999]
[null,null,null,null,null,null,null,null,null,null,null,1975,1,null,null,null,null,12597622216,67790836,0.47039999999999998]
[null,null,null,null,null,null,null,null,null,null,null,1976,1,null,null,null,null,10659832216,67790908,0.49070000000000003]
[null,null,null,null,null,null,null,null,null,null,null,1977,1,null,null,null,null,10442791216,67797798,0.52569999999999995]
[null,null,null,null,null,null,null,null,null,null,null,1978,1,null,null,null,null,10339455241,67797974,0.86909999999999998]
[null,null,null,null,null,null,null,null,null,null,null,1979,1,null,null,null,null,14759996243,67799777,0.87139999999999995]
[null,null,null,null,null,null,null,null,null,null,null,1980,1,null,null,null,null,10935439243,67800563,0.94440000000000002]
[null,null,null,null,null,null,null,null,null,null,null,1981,1,null,null,null,null,10401055242,67801056,0.88080000000000003]
[null,null,null,null,null,null,null,null,null,null,null,1982,1,null,null,null,null,10720534241,67801419,0.92200000000000004]
[null,null,null,null,null,null,null,null,null,null,null,1983,1,null,null,null,null,10834895242,67801478,0.87160000000000004]
[null,null,null,null,null,null,null,null,null,null,null,1984,1,null,null,null,null,11199661241,67801558,0.87419999999999998]
[null,null,null,null,null,null,null,null,null,null,null,1985,1,null,null,null,null,11300490218,67801929,0.45710000000000001]
[null,null,null,null,null,null,null,null,null,null,null,1986,1,null,null,null,null,13450546242,67804521,1.3118000000000001]
[null,null,null,null,null,null,null,null,null,null,null,1987,1,null,null,null,null,12027772213,67804660,0.64900000000000002]
[null,null,null,null,null,null,null,null,null,null,null,1988,1,null,null,null,null,10553626242,67805022,1.0764]
[null,null,null,null,null,null,null,null,null,null,null,1989,1,null,null,null,null,12305412241,67805508,0.89129999999999998]
[null,null,null,null,null,null,null,null,null,null,null,1990,1,null,null,null,null,12006883244,67807159,1.2442]
[null,null,null,null,null,null,null,null,null,null,null,1991,1,null,null,null,null,23501344216,67809883,0.56799999999999995]
[null,null,null,null,null,null,null,null,null,null,null,1992,1,null,null,null,null,28178750242,67812126,0.91539999999999999]
[null,null,null,null,null,null,null,null,null,null,null,1993,1,null,null,null,null,13018430219,67814252,0.86880000000000002]
[null,null,null,null,null,null,null,null,null,null,null,1994,1,null,null,null,null,13570981213,67815781,0.59109999999999996]
[null,null,null,null,null,null,null,null,null,null,null,1995,1,null,null,null,null,12915444210,67817357,0.59030000000000005]
[null,null,null,null,null,null,null,null,null,null,null,1996,1,null,null,null,null,14427422213,67818149,0.25850000000000001]
[null,null,null,null,null,null,null,null,null,null,null,1997,1,null,null,null,null,12177671243,67819352,0.51400000000000001]
[null,null,null,null,null,null,null,null,null,null,null,1998,1,null,null,null,null,14424388241,67819424,0.90210000000000001]
[null,null,null,null,null,null,null,null,null,null,null,1999,1,null,null,null,null,23126806241,67819467,0.88829999999999998]
[null,null,null,null,null,null,null,null,null,null,null,2000,1,null,null,null,null,28296100242,67819512,1.5421]
[null,null,null,null,null,null,null,null,null,null,null,2001,1,null,null,null,null,12477689243,67819600,0.89659999999999995]
[null,null,null,null,null,null,null,null,null,null,null,2002,1,null,null,null,null,10464430203,67820230,0.69499999999999995]
[null,null,null,null,null,null,null,null,null,null,null,2003,1,null,null,null,null,10874011241,67821241,0.9456]
[null,null,null,null,null,null,null,null,null,null,null,2008,5,null,null,null,null,10301539241,67821372,0.98099999999999998]
[null,null,null,null,null,null,null,null,null,null,null,2009,5,null,null,null,null,13183057241,67821954,0.97599999999999998]
[null,null,null,null,null,null,null,null,null,null,null,2010,1,null,null,null,null,10931198241,67827977,0.85329999999999995]
[null,null,null,null,null,null,null,null,null,null,null,2011,1,null,null,null,null,12354526242,67838158,0.89280000000000004]
[null,null,null,null,null,null,null,null,null,null,null,2012,1,null,null,null,null,13174578243,67839476,0.9123]
[null,null,null,null,null,null,null,null,null,null,null,2013,1,null,null,null,null,13868761204,67840071,0.5282]
[null,null,null,null,null,null,null,null,null,null,null,2014,1,null,null,null,null,12795521217,67841816,0.34050000000000002]
[null,null,null,null,null,null,null,null,null,null,null,2015,1,null,null,null,null,11612801208,67842827,0.63460000000000005]
[null,null,null,null,null,null,null,null,null,null,null,2016,4,null,null,null,null,"NULL",67843715,0.46870000000000001]
[null,null,null,null,null,null,null,null,null,null,null,2017,1,null,null,null,null,12466768241,67846801,0.5514]
[null,null,null,null,null,null,null,null,null,null,null,2019,1,null,null,null,null,11253611207,67847580,0.627]
[null,null,null,null,null,null,null,null,null,null,null,2021,5,null,null,null,null,10841860243,67848401,0.87870000000000004]
[null,null,null,null,null,null,null,null,null,null,null,2022,5,null,null,null,null,11935243244,67854035,0.65569999999999995]
[null,null,null,null,null,null,null,null,null,null,null,2023,4,null,null,null,null,10949638244,67872874,0.91400000000000003]
[null,null,null,null,null,null,null,null,null,null,null,2024,5,null,null,null,null,29053272243,67887603,0.85670000000000002]
[null,null,null,null,null,null,null,null,null,null,null,2025,5,null,null,null,null,11253738241,67887718,0.97389999999999999]
[null,null,null,null,null,null,null,null,null,null,null,2026,5,null,null,null,null,12273753243,67890933,0.94589999999999996]
[null,null,null,null,null,null,null,null,null,null,null,2027,5,null,null,null,null,10768741244,67895961,0.78190000000000004]
[null,null,null,null,null,null,null,null,null,null,null,2028,5,null,null,null,null,12169825241,67896315,0.95899999999999996]
[null,null,null,null,null,null,null,null,null,null,null,2030,1,null,null,null,null,11490182241,67897027,1.0407999999999999]
[null,null,null,null,null,null,null,null,null,null,null,2031,1,null,null,null,null,12099124243,67900273,0.86980000000000002]
[null,null,null,null,null,null,null,null,null,null,null,2032,1,null,null,null,null,11614951208,67902308,0.63970000000000005]
[null,null,null,null,null,null,null,null,null,null,null,2033,1,null,null,null,null,12621730241,67902738,0.77129999999999999]
[null,null,null,null,null,null,null,null,null,null,null,2035,1,null,null,null,null,10658329201,67902770,0.85929999999999995]
[null,null,null,null,null,null,null,null,null,null,null,2036,1,null,null,null,null,13795067242,67902818,0.879]
[null,null,null,null,null,null,null,null,null,null,null,2038,5,null,null,null,null,19719483242,67903693,0.85250000000000004]
[null,null,null,null,null,null,null,null,null,null,null,2039,5,null,null,null,null,10802937243,67903941,0.99339999999999995]
[null,null,null,null,null,null,null,null,null,null,null,2040,1,null,null,null,null,13750406213,67904004,0.53539999999999999]
[null,null,null,null,null,null,null,null,null,null,null,2041,1,null,null,null,null,11325462219,67904135,0.51559999999999995]
[null,null,null,null,null,null,null,null,null,null,null,2042,1,null,null,null,null,10409826205,67904389,0.627]
[null,null,null,null,null,null,null,null,null,null,null,2043,1,null,null,null,null,13342786213,67904522,0.53539999999999999]
[null,null,null,null,null,null,null,null,null,null,null,2044,1,null,null,null,null,15311746241,67906720,0.80889999999999995]
[null,null,null,null,null,null,null,null,null,null,null,2045,3,null,null,null,null,10229284243,67907483,0.87680000000000002]
[null,null,null,null,null,null,null,null,null,null,null,2046,3,null,null,null,null,12366077241,67907600,0.59750000000000003]
[null,null,null,null,null,null,null,null,null,null,null,2049,1,null,null,null,null,22569776243,67909585,1.0048999999999999]
[null,null,null,null,null,null,null,null,null,null,null,2050,1,null,null,null,null,11960252243,67910826,0.92249999999999999]
[null,null,null,null,null,null,null,null,null,null,null,2051,1,null,null,null,null,14740228243,67915803,0.92020000000000002]
[null,null,null,null,null,null,null,null,null,null,null,2052,1,null,null,null,null,10229552241,67925438,0.87749999999999995]
[null,null,null,null,null,null,null,null,null,null,null,2053,5,null,null,null,null,11811866242,67926422,1.0379]
[null,null,null,null,null,null,null,null,null,null,null,2060,4,null,null,null,null,11407133208,67927054,0.56320000000000003]
[null,null,null,null,null,null,null,null,null,null,null,2061,4,null,null,null,null,10244184213,67927310,1.0302]
[null,null,null,null,null,null,null,null,null,null,null,2063,4,null,null,null,null,11630979243,67927476,0.88739999999999997]
[null,null,null,null,null,null,null,null,null,null,null,2064,4,null,null,null,null,13036766243,67927951,1.1840999999999999]
[null,null,null,null,null,null,null,null,null,null,null,2065,6,null,null,null,null,13832919241,67928946,0.92259999999999998]
[null,null,null,null,null,null,null,null,null,null,null,2066,4,null,null,null,null,23702167219,67930173,0.51819999999999999]
[null,null,null,null,null,null,null,null,null,null,null,2067,6,null,null,null,null,13139010242,67930587,0.87939999999999996]
[null,null,null,null,null,null,null,null,null,null,null,2071,1,null,null,null,null,12726907213,67930691,0.84189999999999998]
[null,null,null,null,null,null,null,null,null,null,null,2072,4,null,null,null,null,11315205242,67931109,0.88119999999999998]
[null,null,null,null,null,null,null,null,null,null,null,2073,5,null,null,null,null,12813469244,67931133,0.86970000000000003]
[null,null,null,null,null,null,null,null,null,null,null,2074,5,null,null,null,null,12964462208,67931459,1.3782000000000001]
[null,null,null,null,null,null,null,null,null,null,null,2080,5,null,null,null,null,14029361242,67931504,0.96799999999999997]
[null,null,null,null,null,null,null,null,null,null,null,2081,3,null,null,null,null,12238288243,67931598,0.84309999999999996]
[null,null,null,null,null,null,null,null,null,null,null,2083,1,null,null,null,null,41555992233,67931731,0.63090000000000002]
[null,null,null,null,null,null,null,null,null,null,null,2084,1,null,null,null,null,10248793241,67933235,0.8962]
[null,null,null,null,null,null,null,null,null,null,null,2085,1,null,null,null,null,11037163203,67935804,0.32929999999999998]
[null,null,null,null,null,null,null,null,null,null,null,2086,5,null,null,null,null,10750342242,67936583,0.98740000000000006]
[null,null,null,null,null,null,null,null,null,null,null,2087,3,null,null,null,null,29693263208,67936671,0.62039999999999995]
[null,null,null,null,null,null,null,null,null,null,null,2089,1,null,null,null,null,"NULL",67950043,0.3896]
[null,null,null,null,null,null,null,null,null,null,null,2090,5,null,null,null,null,13848725242,67952137,0.96399999999999997]
[null,null,null,null,null,null,null,null,null,null,null,2091,4,null,null,null,null,13540214213,67952436,0.87560000000000004]
[null,null,null,null,null,null,null,null,null,null,null,2092,1,null,null,null,null,10699807243,67952647,0.90200000000000002]
[null,null,null,null,null,null,null,null,null,null,null,2093,5,null,null,null,null,12998353213,67953332,0.82540000000000002]
[null,null,null,null,null,null,null,null,null,null,null,2094,1,null,null,null,null,15433750220,67954087,0.51249999999999996]
[null,null,null,null,null,null,null,null,null,null,null,2095,4,null,null,null,null,13408532241,67954319,0.78800000000000003]
[null,null,null,null,null,null,null,null,null,null,null,2096,1,null,null,null,null,20934989220,67954423,1.5069999999999999]
[null,null,null,null,null,null,null,null,null,null,null,2097,4,null,null,null,null,13734770205,67954474,1.1408]
[null,null,null,null,null,null,null,null,null,null,null,2098,5,null,null,null,null,10253993213,67958192,0.72009999999999996]
[null,null,null,null,null,null,null,null,null,null,null,2099,5,null,null,null,null,13985677242,67958301,0.97409999999999997]
[null,null,null,null,null,null,null,null,null,null,null,2100,1,null,null,null,null,11793272243,67958352,0.86060000000000003]
[null,null,null,null,null,null,null,null,null,null,null,2101,1,null,null,null,null,13607834246,67958491,0.85670000000000002]
[null,null,null,null,null,null,null,null,null,null,null,2102,1,null,null,null,null,12714676214,67958512,0.51439999999999997]
[null,null,null,null,null,null,null,null,null,null,null,2103,1,null,null,null,null,12832930205,67958571,0.60940000000000005]
[null,null,null,null,null,null,null,null,null,null,null,2111,1,null,null,null,null,12497931202,67958707,0.6139]
[null,null,null,null,null,null,null,null,null,null,null,2112,1,null,null,null,null,10804001241,67958854,0.80569999999999997]
[null,null,null,null,null,null,null,null,null,null,null,2113,5,null,null,null,null,13650478219,67959056,0.77769999999999995]
[null,null,null,null,null,null,null,null,null,null,null,2114,5,null,null,null,null,10253027241,67959312,0.96240000000000003]
[null,null,null,null,null,null,null,null,null,null,null,2115,5,null,null,null,null,10885107213,67960196,0.85729999999999995]
[null,null,null,null,null,null,null,null,null,null,null,2116,5,null,null,null,null,10659100242,67960292,1.0469999999999999]
[null,null,null,null,null,null,null,null,null,null,null,2117,1,null,null,null,null,10397880243,67960866,0.90449999999999997]
[null,null,null,null,null,null,null,null,null,null,null,2118,5,null,null,null,null,13006824243,67963426,0.95330000000000004]
[null,null,null,null,null,null,null,null,null,null,null,2119,1,null,null,null,null,20162892213,67966432,0.53769999999999996]
[null,null,null,null,null,null,null,null,null,null,null,2120,2,null,null,null,null,13674463213,67968112,0.69579999999999997]
[null,null,null,null,null,null,null,null,null,null,null,2121,2,null,null,null,null,10853940242,67968550,0.87709999999999999]
[null,null,null,null,null,null,null,null,null,null,null,2122,2,null,null,null,null,13689443243,67968745,0.9204]
[null,null,null,null,null,null,null,null,null,null,null,2123,2,null,null,null,null,10737956242,67968841,1.0745]
[null,null,null,null,null,null,null,null,null,null,null,2131,1,null,null,null,null,10806481242,67968876,0.86970000000000003]
[null,null,null,null,null,null,null,null,null,null,null,2132,1,null,null,null,null,10398458241,67968905,0.80320000000000003]
[null,null,null,null,null,null,null,null,null,null,null,2133,5,null,null,null,null,10803835213,67968972,0.52310000000000001]
[null,null,null,null,null,null,null,null,null,null,null,2134,5,null,null,null,null,11933375213,67984024,1.0875999999999999]
[null,null,null,null,null,null,null,null,null,null,null,2135,5,null,null,null,null,11026778244,67984243,0.47549999999999998]
[null,null,null,null,null,null,null,null,null,null,null,2141,1,null,null,null,null,11574862203,67984323,0.52400000000000002]
[null,null,null,null,null,null,null,null,null,null,null,2142,1,null,null,null,null,10429288241,67985043,0.85260000000000002]
[null,null,null,null,null,null,null,null,null,null,null,2143,1,null,null,null,null,47900235230,67985246,0.23430000000000001]
[null,null,null,null,null,null,null,null,null,null,null,2144,1,null,null,null,null,12602678211,67987989,0.3599]
[null,null,null,null,null,null,null,null,null,null,null,2145,1,null,null,null,null,10816772242,67989175,0.99509999999999998]
[null,null,null,null,null,null,null,null,null,null,null,2146,1,null,null,null,null,10920277241,67991822,0.87460000000000004]
[null,null,null,null,null,null,null,null,null,null,null,2150,1,null,null,null,null,13102896208,67992497,0.52380000000000004]
[null,null,null,null,null,null,null,null,null,null,null,2151,1,null,null,null,null,12998391241,67995815,0.96809999999999996]
[null,null,null,null,null,null,null,null,null,null,null,2152,1,null,null,null,null,21372324243,67997757,1.6863999999999999]
[null,null,null,null,null,null,null,null,null,null,null,2153,1,null,null,null,null,12858367215,67997837,0.2676]
[null,null,null,null,null,null,null,null,null,null,null,2161,1,null,null,null,null,75244453220,67999816,0.44269999999999998]
[null,null,null,null,null,null,null,null,null,null,null,2162,4,null,null,null,null,12453285213,67999859,0.99099999999999999]
[null,null,null,null,null,null,null,null,null,null,null,2163,5,null,null,null,null,11051691204,67999875,0.5151]
[null,null,null,null,null,null,null,null,null,null,null,2164,5,null,null,null,null,12341067243,67999904,0.5988]
[null,null,null,null,null,null,null,null,null,null,null,2165,5,null,null,null,null,13082956219,68001210,0.55789999999999995]
[null,null,null,null,null,null,null,null,null,null,null,2166,5,null,null,null,null,10570528211,68001667,0.62019999999999997]
[null,null,null,null,null,null,null,null,null,null,null,2167,5,null,null,null,null,12232756213,68002643,0.68200000000000005]
[null,null,null,null,null,null,null,null,null,null,null,2170,5,null,null,null,null,12253786213,68003611,0.53029999999999999]
[null,null,null,null,null,null,null,null,null,null,null,2173,5,null,null,null,null,12060197213,68003822,0.50070000000000003]
[null,null,null,null,null,null,null,null,null,null,null,2174,5,null,null,null,null,21185023243,68003937,0.91320000000000001]
[null,null,null,null,null,null,null,null,null,null,null,2175,6,null,null,null,null,15511001243,68004067,0.76549999999999996]
[null,null,null,null,null,null,null,null,null,null,null,2176,6,null,null,null,null,12089266242,68004171,0.87060000000000004]
[null,null,null,null,null,null,null,null,null,null,null,2177,6,null,null,null,null,12369348241,68004382,0.9758]
[null,null,null,null,null,null,null,null,null,null,null,2181,5,null,null,null,null,11999502244,68016009,0.87690000000000001]
[null,null,null,null,null,null,null,null,null,null,null,2182,5,null,null,null,null,10736687241,68018063,0.94030000000000002]
[null,null,null,null,null,null,null,null,null,null,null,2183,5,null,null,null,null,46461043227,68018194,0.51680000000000004]
[null,null,null,null,null,null,null,null,null,null,null,2184,5,null,null,null,null,12536029207,68019621,0.4995]
[null,null,null,null,null,null,null,null,null,null,null,2185,5,null,null,null,null,12239117242,68020091,0.85670000000000002]
[null,null,null,null,null,null,null,null,null,null,null,2191,5,null,null,null,null,10549496219,68020470,0.51490000000000002]
[null,null,null,null,null,null,null,null,null,null,null,2192,5,null,null,null,null,12259191243,68020964,0.8831]
[null,null,null,null,null,null,null,null,null,null,null,2193,5,null,null,null,null,20356499243,68021377,0.89480000000000004]
[null,null,null,null,null,null,null,null,null,null,null,2194,5,null,null,null,null,11972033242,68023540,0.83350000000000002]
[null,null,null,null,null,null,null,null,null,null,null,2200,4,null,null,null,null,12655353213,68024105,0.48099999999999998]
[null,null,null,null,null,null,null,null,null,null,null,2201,4,null,null,null,null,13741037243,68025335,1.7835000000000001]
[null,null,null,null,null,null,null,null,null,null,null,2202,4,null,null,null,null,10567203243,68026354,0.86109999999999998]
[null,null,null,null,null,null,null,null,null,null,null,2209,5,null,null,null,null,22906681209,68027197,0.68759999999999999]
[null,null,null,null,null,null,null,null,null,null,null,2211,5,null,null,null,null,22906681209,68027197,0.68759999999999999]
[null,null,null,null,null,null,null,null,null,null,null,2212,5,null,null,null,null,13564979211,68029141,0.23749999999999999]
[null,null,null,null,null,null,null,null,null,null,null,2213,5,null,null,null,null,13532695204,68030855,0.37919999999999998]
[null,null,null,null,null,null,null,null,null,null,null,2214,5,null,null,null,null,14320112213,68031153,0.86750000000000005]
[null,null,null,null,null,null,null,null,null,null,null,2215,5,null,null,null,null,10829781213,68031313,0.48220000000000002]
[null,null,null,null,null,null,null,null,null,null,null,2216,5,null,null,null,null,10811399213,68031364,0.87490000000000001]
[null,null,null,null,null,null,null,null,null,null,null,2217,5,null,null,null,null,11848918241,68031444,0.94620000000000004]
[null,null,null,null,null,null,null,null,null,null,null,2220,1,null,null,null,null,11134820208,68031516,0.28260000000000002]
[null,null,null,null,null,null,null,null,null,null,null,2221,1,null,null,null,null,22701266213,68031559,1.1786000000000001]
[null,null,null,null,null,null,null,null,null,null,null,2222,1,null,null,null,null,10691964217,68032762,0.36309999999999998]
[null,null,null,null,null,null,null,null,null,null,null,2225,4,null,null,null,null,12520189243,68033319,0.86470000000000002]
[null,null,null,null,null,null,null,null,null,null,null,2230,5,null,null,null,null,28070157242,68033335,1.0319]
[null,null,null,null,null,null,null,null,null,null,null,2233,1,null,null,null,null,13921882113,68033378,0.9002]
[null,null,null,null,null,null,null,null,null,null,null,2234,1,null,null,null,null,14167142241,68033458,0.94689999999999996]
[null,null,null,null,null,null,null,null,null,null,null,2235,1,null,null,null,null,12924064241,68033482,0.95389999999999997]
[null,null,null,null,null,null,null,null,null,null,null,2241,5,null,null,null,null,10678547208,68033570,0.54149999999999998]
[null,null,null,null,null,null,null,null,null,null,null,2242,5,null,null,null,null,11950916210,68033757,0.55679999999999996]
[null,null,null,null,null,null,null,null,null,null,null,2243,5,null,null,null,null,19004105242,68033917,0.79269999999999996]
[null,null,null,null,null,null,null,null,null,null,null,2244,5,null,null,null,null,11981646243,68034338,1.1037999999999999]
[null,null,null,null,null,null,null,null,null,null,null,2251,5,null,null,null,null,10586224244,68035154,0.88990000000000002]
[null,null,null,null,null,null,null,null,null,null,null,2252,5,null,null,null,null,10833375241,68035218,0.96299999999999997]
[null,null,null,null,null,null,null,null,null,null,null,2253,5,null,null,null,null,11861689241,68035277,0.88349999999999995]
[null,null,null,null,null,null,null,null,null,null,null,2254,5,null,null,null,null,10384431242,68035314,0.87739999999999996]
[null,null,null,null,null,null,null,null,null,null,null,2255,5,null,null,null,null,11190961211,68035410,0.49430000000000002]
[null,null,null,null,null,null,null,null,null,null,null,2300,4,null,null,null,null,10948015242,68035592,0.83699999999999997]
[null,null,null,null,null,null,null,null,null,null,null,2301,4,null,null,null,null,13128625213,68035728,0.98960000000000004]
[null,null,null,null,null,null,null,null,null,null,null,2309,5,null,null,null,null,10437247241,68038902,0.87580000000000002]
[null,null,null,null,null,null,null,null,null,null,null,2310,1,null,null,null,null,13809799243,68038929,0.86470000000000002]
[null,null,null,null,null,null,null,null,null,null,null,2311,1,null,null,null,null,14077340244,68039083,0.87819999999999998]
[null,null,null,null,null,null,null,null,null,null,null,2312,1,null,null,null,null,10576500244,68039171,0.48120000000000002]
[null,null,null,null,null,null,null,null,null,null,null,2313,1,null,null,null,null,10310180211,68039307,0.52569999999999995]
[null,null,null,null,null,null,null,null,null,null,null,2314,1,null,null,null,null,11323776219,68039462,0.6542]
[null,null,null,null,null,null,null,null,null,null,null,2315,1,null,null,null,null,11333036219,68039489,0.60409999999999997]
[null,null,null,null,null,null,null,null,null,null,null,2316,1,null,null,null,null,13224972203,68039497,0.78449999999999998]
[null,null,null,null,null,null,null,null,null,null,null,2317,5,null,null,null,null,13292760213,68039518,0.69030000000000002]
[null,null,null,null,null,null,null,null,null,null,null,2318,5,null,null,null,null,71857338226,68039681,0.50439999999999996]
[null,null,null,null,null,null,null,null,null,null,null,2319,5,null,null,null,null,10240616242,68040711,0.86529999999999996]
[null,null,null,null,null,null,null,null,null,null,null,2321,5,null,null,null,null,10278587244,68046865,0.9839]
[null,null,null,null,null,null,null,null,null,null,null,2322,5,null,null,null,null,11182751211,68047518,0.43009999999999998]
[null,null,null,null,null,null,null,null,null,null,null,2330,1,null,null,null,null,13016359242,68047673,0.87460000000000004]
[null,null,null,null,null,null,null,null,null,null,null,2331,1,null,null,null,null,10636367241,68047913,0.86719999999999997]
[null,null,null,null,null,null,null,null,null,null,null,2332,1,null,null,null,null,10263002244,68048967,0.754]
[null,null,null,null,null,null,null,null,null,null,null,2335,1,null,null,null,null,12657496241,68049505,0.91420000000000001]
[null,null,null,null,null,null,null,null,null,null,null,2336,4,null,null,null,null,10819957243,68049740,0.92359999999999998]
[null,null,null,null,null,null,null,null,null,null,null,2337,5,null,null,null,null,12256600215,68050231,0.82569999999999999]
[null,null,null,null,null,null,null,null,null,null,null,2338,5,null,null,null,null,19013213142,68052472,0.96809999999999996]
[null,null,null,null,null,null,null,null,null,null,null,2339,5,null,null,null,null,12150470242,68054603,0.86160000000000003]
[null,null,null,null,null,null,null,null,null,null,null,2340,5,null,null,null,null,12233159243,68054726,0.85189999999999999]
[null,null,null,null,null,null,null,null,null,null,null,2341,5,null,null,null,null,11052843204,68054750,0.49359999999999998]
[null,null,null,null,null,null,null,null,null,null,null,2342,5,null,null,null,null,13579980213,68055016,0.87070000000000003]
[null,null,null,null,null,null,null,null,null,null,null,2344,5,null,null,null,null,10966925244,68060173,0.89180000000000004]
[null,null,null,null,null,null,null,null,null,null,null,2345,5,null,null,null,null,10798748244,68062312,0.93720000000000003]
[null,null,null,null,null,null,null,null,null,null,null,2347,5,null,null,null,null,10895986241,68065257,0.8871]
[null,null,null,null,null,null,null,null,null,null,null,2351,5,null,null,null,null,23076990243,68065505,0.90839999999999999]
[null,null,null,null,null,null,null,null,null,null,null,2360,1,null,null,null,null,10368877241,68065724,1.0866]
[null,null,null,null,null,null,null,null,null,null,null,2363,5,null,null,null,null,10223257241,68068263,0.92249999999999999]
[null,null,null,null,null,null,null,null,null,null,null,2364,4,null,null,null,null,10490811244,68068319,0.85680000000000001]
[null,null,null,null,null,null,null,null,null,null,null,2365,5,null,null,null,null,11087120244,68069290,0.86429999999999996]
[null,null,null,null,null,null,null,null,null,null,null,2366,5,null,null,null,null,10752959213,68070961,0.87450000000000006]
[null,null,null,null,null,null,null,null,null,null,null,2367,5,null,null,null,null,13535894216,68071024,0.55740000000000001]
[null,null,null,null,null,null,null,null,null,null,null,2370,4,null,null,null,null,12963409243,68071120,0.87860000000000005]
[null,null,null,null,null,null,null,null,null,null,null,2371,4,null,null,null,null,12038284242,68072027,0.86499999999999999]
[null,null,null,null,null,null,null,null,null,null,null,2372,4,null,null,null,null,13212414213,68072780,0.57769999999999999]
[null,null,null,null,null,null,null,null,null,null,null,2373,4,null,null,null,null,11015895202,68073230,0.50860000000000005]
[null,null,null,null,null,null,null,null,null,null,null,2374,5,null,null,null,null,47624676229,68073353,0.44490000000000002]
[null,null,null,null,null,null,null,null,null,null,null,2375,6,null,null,null,null,12555820209,68073636,0.28649999999999998]
[null,null,null,null,null,null,null,null,null,null,null,2376,5,null,null,null,null,12903704213,68073695,0.74419999999999997]
[null,null,null,null,null,null,null,null,null,null,null,2377,5,null,null,null,null,12767818213,68073732,0.97260000000000002]
[null,null,null,null,null,null,null,null,null,null,null,2378,5,null,null,null,null,13606022241,68074188,0.93879999999999997]
[null,null,null,null,null,null,null,null,null,null,null,2381,5,null,null,null,null,12036172242,68074399,0.85350000000000004]
[null,null,null,null,null,null,null,null,null,null,null,2400,4,null,null,null,null,13690986209,68075447,0.81200000000000006]
[null,null,null,null,null,null,null,null,null,null,null,2401,4,null,null,null,null,10771255242,68075770,0.86529999999999996]
[null,null,null,null,null,null,null,null,null,null,null,2402,4,null,null,null,null,10446795242,68075930,0.65169999999999995]
[null,null,null,null,null,null,null,null,null,null,null,2403,4,null,null,null,null,13554640243,68076108,0.86419999999999997]
[null,null,null,null,null,null,null,null,null,null,null,2404,4,null,null,null,null,60611345124,68076845,0.73270000000000002]
[null,null,null,null,null,null,null,null,null,null,null,2405,4,null,null,null,null,23428270202,68077338,0.77170000000000005]
[null,null,null,null,null,null,null,null,null,null,null,2406,4,null,null,null,null,15332367102,68077725,0.53410000000000002]
[null,null,null,null,null,null,null,null,null,null,null,2407,4,null,null,null,null,19113832208,68079528,0.55259999999999998]
[null,null,null,null,null,null,null,null,null,null,null,2408,4,null,null,null,null,12280838241,68081943,0.87860000000000005]
[null,null,null,null,null,null,null,null,null,null,null,2421,6,null,null,null,null,11143110209,68082612,0.39610000000000001]
[null,null,null,null,null,null,null,null,null,null,null,2422,6,null,null,null,null,10220553242,68083447,0.873]
[null,null,null,null,null,null,null,null,null,null,null,2423,6,null,null,null,null,10532328208,68083738,0.60570000000000002]
[null,null,null,null,null,null,null,null,null,null,null,2424,6,null,null,null,null,11768490202,68083770,0.73109999999999997]
[null,null,null,null,null,null,null,null,null,null,null,2425,6,null,null,null,null,12957253202,68083797,0.53320000000000001]
[null,null,null,null,null,null,null,null,null,null,null,2426,4,null,null,null,null,10946817242,68089582,0.9375]
[null,null,null,null,null,null,null,null,null,null,null,2427,4,null,null,null,null,12141269213,68101916,0.88200000000000001]
[null,null,null,null,null,null,null,null,null,null,null,2428,6,null,null,null,null,15390747213,68101940,0.52949999999999997]
[null,null,null,null,null,null,null,null,null,null,null,2431,6,null,null,null,null,10803684213,68103495,0.46250000000000002]
[null,null,null,null,null,null,null,null,null,null,null,2432,6,null,null,null,null,10784147213,68107947,0.53610000000000002]
[null,null,null,null,null,null,null,null,null,null,null,2433,6,null,null,null,null,47789012229,68108579,0.36359999999999998]
[null,null,null,null,null,null,null,null,null,null,null,2434,6,null,null,null,null,26851363218,68108632,0.62370000000000003]
[null,null,null,null,null,null,null,null,null,null,null,2435,6,null,null,null,null,11300421208,68108739,0.73129999999999995]
[null,null,null,null,null,null,null,null,null,null,null,2440,1,null,null,null,null,13537913207,68108835,0.40460000000000002]
[null,null,null,null,null,null,null,null,null,null,null,2441,1,null,null,null,null,10454871241,68108894,0.95330000000000004]
[null,null,null,null,null,null,null,null,null,null,null,2443,1,null,null,null,null,10825859241,68108958,0.91439999999999999]
[null,null,null,null,null,null,null,null,null,null,null,2451,4,null,null,null,null,12817133203,68109184,0.57630000000000003]
[null,null,null,null,null,null,null,null,null,null,null,2452,4,null,null,null,null,10517394216,68109256,0.48139999999999999]
[null,null,null,null,null,null,null,null,null,null,null,2453,4,null,null,null,null,64587992231,68110943,0.44130000000000003]
[null,null,null,null,null,null,null,null,null,null,null,2454,6,null,null,null,null,13115393211,68111305,0.51700000000000002]
[null,null,null,null,null,null,null,null,null,null,null,2455,6,null,null,null,null,10839388213,68111575,0.58579999999999999]
[null,null,null,null,null,null,null,null,null,null,null,2456,6,null,null,null,null,12008218213,68111807,0.62370000000000003]
[null,null,null,null,null,null,null,null,null,null,null,2457,6,null,null,null,null,11817288215,68112009,0.28810000000000002]
[null,null,null,null,null,null,null,null,null,null,null,2458,6,null,null,null,null,10907087243,68112308,0.77810000000000001]
[null,null,null,null,null,null,null,null,null,null,null,2459,5,null,null,null,null,12245301213,68112324,0.55100000000000005]
[null,null,null,null,null,null,null,null,null,null,null,2461,1,null,null,null,null,10359350241,68112463,0.94189999999999996]
[null,null,null,null,null,null,null,null,null,null,null,2462,4,null,null,null,null,13397346215,68113001,0.83199999999999996]
[null,null,null,null,null,null,null,null,null,null,null,2463,4,null,null,null,null,11575612203,68113298,0.37259999999999999]
[null,null,null,null,null,null,null,null,null,null,null,2464,4,null,null,null,null,11426776203,68113343,0.52810000000000001]
[null,null,null,null,null,null,null,null,null,null,null,2465,6,null,null,null,null,10640652203,68113386,0.3397]
[null,null,null,null,null,null,null,null,null,null,null,2471,6,null,null,null,null,10908253241,68113423,1.4128000000000001]
[null,null,null,null,null,null,null,null,null,null,null,2472,4,null,null,null,null,11111111111,68113474,0.86939999999999995]
[null,null,null,null,null,null,null,null,null,null,null,2473,6,null,null,null,null,11046374204,68113503,1.0026999999999999]
[null,null,null,null,null,null,null,null,null,null,null,2475,6,null,null,null,null,13576114211,68115816,0.52090000000000003]
[null,null,null,null,null,null,null,null,null,null,null,2476,4,null,null,null,null,12766264243,68115904,0.873]
[null,null,null,null,null,null,null,null,null,null,null,2477,6,null,null,null,null,15325770219,68116034,0.3967]
[null,null,null,null,null,null,null,null,null,null,null,2481,4,null,null,null,null,12200568241,68116106,0.78439999999999999]
[null,null,null,null,null,null,null,null,null,null,null,2482,4,null,null,null,null,12352476241,68116202,1.0411999999999999]
[null,null,null,null,null,null,null,null,null,null,null,2483,4,null,null,null,null,10302475205,68116253,0.46879999999999999]
[null,null,null,null,null,null,null,null,null,null,null,2484,4,null,null,null,null,13777212213,68116325,0.97330000000000005]
[null,null,null,null,null,null,null,null,null,null,null,2485,4,null,null,null,null,13121996241,68117168,0.82930000000000004]
[null,null,null,null,null,null,null,null,null,null,null,2490,6,null,null,null,null,11933681213,68123947,0.25480000000000003]
[null,null,null,null,null,null,null,null,null,null,null,2500,5,null,null,null,null,12206894243,68124034,1.0121]
[null,null,null,null,null,null,null,null,null,null,null,2501,5,null,null,null,null,12197129242,68124106,0.83099999999999996]
[null,null,null,null,null,null,null,null,null,null,null,2502,5,null,null,null,null,13234957241,68124499,0.93359999999999999]
[null,null,null,null,null,null,null,null,null,null,null,2503,5,null,null,null,null,14098208209,68124931,0.63500000000000001]
[null,null,null,null,null,null,null,null,null,null,null,2508,5,null,null,null,null,12896316241,68126056,0.85629999999999995]
[null,null,null,null,null,null,null,null,null,null,null,2509,5,null,null,null,null,23045765241,68126611,0.51729999999999998]
[null,null,null,null,null,null,null,null,null,null,null,2510,5,null,null,null,null,13505378243,68126689,0.86099999999999999]
[null,null,null,null,null,null,null,null,null,null,null,2511,5,null,null,null,null,10747632242,68126785,1.0868]
[null,null,null,null,null,null,null,null,null,null,null,2512,5,null,null,null,null,12223466241,68127366,0.86960000000000004]
[null,null,null,null,null,null,null,null,null,null,null,2517,5,null,null,null,null,10612736241,68127411,0.92249999999999999]
[null,null,null,null,null,null,null,null,null,null,null,2518,5,null,null,null,null,10836237241,68127470,1.0838000000000001]
[null,null,null,null,null,null,null,null,null,null,null,2519,5,null,null,null,null,13092371213,68127585,0.73060000000000003]
[null,null,null,null,null,null,null,null,null,null,null,2521,5,null,null,null,null,50900022234,68127681,0.47499999999999998]
[null,null,null,null,null,null,null,null,null,null,null,2522,5,null,null,null,null,11810236241,68127753,0.95109999999999995]
[null,null,null,null,null,null,null,null,null,null,null,2523,5,null,null,null,null,12292657243,68128449,0.85509999999999997]
[null,null,null,null,null,null,null,null,null,null,null,2524,5,null,null,null,null,12052585241,68129556,0.97899999999999998]
[null,null,null,null,null,null,null,null,null,null,null,2525,5,null,null,null,null,50102925233,68131162,0.51959999999999995]
[null,null,null,null,null,null,null,null,null,null,null,2526,5,null,null,null,null,10471539215,68132018,0.78510000000000002]
[null,null,null,null,null,null,null,null,null,null,null,2527,5,null,null,null,null,12804083213,68133897,0.47960000000000003]
[null,null,null,null,null,null,null,null,null,null,null,2528,5,null,null,null,null,10862340244,68135120,0.91390000000000005]
[null,null,null,null,null,null,null,null,null,null,null,2529,5,null,null,null,null,10769656243,68135497,0.86519999999999997]
[null,null,null,null,null,null,null,null,null,null,null,2531,5,null,null,null,null,10543359241,68137353,0.89180000000000004]
[null,null,null,null,null,null,null,null,null,null,null,2532,5,null,null,null,null,21877180208,68137433,0.60009999999999997]
[null,null,null,null,null,null,null,null,null,null,null,2533,5,null,null,null,null,11130967208,68137628,0.6089]
[null,null,null,null,null,null,null,null,null,null,null,2534,5,null,null,null,null,11835198212,68137687,0.38700000000000001]
[null,null,null,null,null,null,null,null,null,null,null,2535,5,null,null,null,null,11160524210,68138911,0.45400000000000001]
[null,null,null,null,null,null,null,null,null,null,null,2536,5,null,null,null,null,11756420242,68138954,0.79400000000000004]
[null,null,null,null,null,null,null,null,null,null,null,2537,5,null,null,null,null,12391309444,68139412,0.44180000000000003]
[null,null,null,null,null,null,null,null,null,null,null,2541,5,null,null,null,null,12583083242,68139578,0.96299999999999997]
[null,null,null,null,null,null,null,null,null,null,null,2542,5,null,null,null,null,13101314243,68140077,1.8940999999999999]
[null,null,null,null,null,null,null,null,null,null,null,2543,5,null,null,null,null,12085509242,68140114,0.57799999999999996]
[null,null,null,null,null,null,null,null,null,null,null,2544,5,null,null,null,null,12632321241,68140157,0.86990000000000001]
[null,null,null,null,null,null,null,null,null,null,null,2545,5,null,null,null,null,12081457241,68140181,1.1807000000000001]
[null,null,null,null,null,null,null,null,null,null,null,2600,3,null,null,null,null,12294910241,68143219,0.88100000000000001]
[null,null,null,null,null,null,null,null,null,null,null,2601,3,null,null,null,null,12450835241,68143817,0.51880000000000004]
[null,null,null,null,null,null,null,null,null,null,null,2602,3,null,null,null,null,10275821207,68144094,0.63660000000000005]
[null,null,null,null,null,null,null,null,null,null,null,2603,3,null,null,null,null,13767749241,68144457,1.1572]
[null,null,null,null,null,null,null,null,null,null,null,2610,6,null,null,null,null,10684528205,68149290,0.54579999999999995]
[null,null,null,null,null,null,null,null,null,null,null,2611,6,null,null,null,null,13251172209,68150152,0.47020000000000001]
[null,null,null,null,null,null,null,null,null,null,null,2612,5,null,null,null,null,13923994202,68152377,0.93640000000000001]
[null,null,null,null,null,null,null,null,null,null,null,2613,5,null,null,null,null,22781134213,68152430,0.88660000000000005]
[null,null,null,null,null,null,null,null,null,null,null,2614,5,null,null,null,null,10677027242,68152588,0.87050000000000005]
[null,null,null,null,null,null,null,null,null,null,null,2615,5,null,null,null,null,11831015211,68153337,0.59140000000000004]
[null,null,null,null,null,null,null,null,null,null,null,2616,6,null,null,null,null,13287539219,68154428,0.53720000000000001]
[null,null,null,null,null,null,null,null,null,null,null,2617,6,null,null,null,null,10481143142,68154495,0.90169999999999995]
[null,null,null,null,null,null,null,null,null,null,null,2618,6,null,null,null,null,11815798213,68154831,0.87309999999999999]
[null,null,null,null,null,null,null,null,null,null,null,2619,6,null,null,null,null,12543238216,68154866,0.58640000000000003]
[null,null,null,null,null,null,null,null,null,null,null,2621,5,null,null,null,null,12108772243,68154970,0.95130000000000003]
[null,null,null,null,null,null,null,null,null,null,null,2623,5,null,null,null,null,12210488242,68155236,0.87790000000000001]
[null,null,null,null,null,null,null,null,null,null,null,2624,5,null,null,null,null,11069674205,68155789,0.50309999999999999]
[null,null,null,null,null,null,null,null,null,null,null,2625,5,null,null,null,null,12278923213,68158293,0.79310000000000003]
[null,null,null,null,null,null,null,null,null,null,null,2626,5,null,null,null,null,12636332244,68158357,0.52290000000000003]
[null,null,null,null,null,null,null,null,null,null,null,2627,5,null,null,null,null,12658387244,68158859,0.63100000000000001]
[null,null,null,null,null,null,null,null,null,null,null,2628,5,null,null,null,null,12461110213,68158939,0.53269999999999995]
[null,null,null,null,null,null,null,null,null,null,null,2629,5,null,null,null,null,11454609207,68159130,0.69340000000000002]
[null,null,null,null,null,null,null,null,null,null,null,2631,5,null,null,null,null,10364134241,68159384,0.83850000000000002]
[null,null,null,null,null,null,null,null,null,null,null,2632,5,null,null,null,null,28459273243,68159392,0.84799999999999998]
[null,null,null,null,null,null,null,null,null,null,null,2633,5,null,null,null,null,10300703220,68159448,0.51649999999999996]
[null,null,null,null,null,null,null,null,null,null,null,2634,5,null,null,null,null,13783152242,68159501,0.84099999999999997]
[null,null,null,null,null,null,null,null,null,null,null,2635,5,null,null,null,null,11752945203,68159587,0.96430000000000005]
[null,null,null,null,null,null,null,null,null,null,null,2636,6,null,null,null,null,10522415243,68159624,0.86970000000000003]
[null,null,null,null,null,null,null,null,null,null,null,2637,6,null,null,null,null,12730065242,68159683,0.86450000000000005]
[null,null,null,null,null,null,null,null,null,null,null,2638,5,null,null,null,null,11464749208,68161337,0.56040000000000001]
[null,null,null,null,null,null,null,null,null,null,null,2639,6,null,null,null,null,45886168226,68161900,0.54210000000000003]
[null,null,null,null,null,null,null,null,null,null,null,2640,6,null,null,null,null,11968858113,68163041,0.52729999999999999]
[null,null,null,null,null,null,null,null,null,null,null,2641,4,null,null,null,null,13434353242,68163260,0.69130000000000003]
[null,null,null,null,null,null,null,null,null,null,null,2642,6,null,null,null,null,10863530243,68164896,0.77859999999999996]
[null,null,null,null,null,null,null,null,null,null,null,2643,4,null,null,null,null,10858134242,68165442,0.89949999999999997]
[null,null,null,null,null,null,null,null,null,null,null,2644,4,null,null,null,null,11155056209,68167472,0.43340000000000001]
[null,null,null,null,null,null,null,null,null,null,null,2645,6,null,null,null,null,13128364241,68167966,0.85850000000000004]
[null,null,null,null,null,null,null,null,null,null,null,2646,6,null,null,null,null,10859489243,68168002,0.85519999999999996]
[null,null,null,null,null,null,null,null,null,null,null,2647,6,null,null,null,null,13167950242,68168299,0.87450000000000006]
[null,null,null,null,null,null,null,null,null,null,null,2648,6,null,null,null,null,13027191213,68168416,0.51400000000000001]
[null,null,null,null,null,null,null,null,null,null,null,2649,6,null,null,null,null,10061264209,68168475,0.40039999999999998]
[null,null,null,null,null,null,null,null,null,null,null,2651,6,null,null,null,null,10921027242,68171201,1.0462]
[null,null,null,null,null,null,null,null,null,null,null,2652,6,null,null,null,null,10394193244,68171287,0.52849999999999997]
[null,null,null,null,null,null,null,null,null,null,null,2653,4,null,null,null,null,10391262243,68174090,0.87519999999999998]
[null,null,null,null,null,null,null,null,null,null,null,2654,6,null,null,null,null,12996708243,68174103,0.8679]
[null,null,null,null,null,null,null,null,null,null,null,2655,4,null,null,null,null,28602873241,68174138,1.8729]
[null,null,null,null,null,null,null,null,null,null,null,2656,6,null,null,null,null,10983755243,68174197,0.85099999999999998]
[null,null,null,null,null,null,null,null,null,null,null,2657,6,null,null,null,null,12543331244,68174250,0.501]
[null,null,null,null,null,null,null,null,null,null,null,2658,6,null,null,null,null,12258657242,68174314,0.85850000000000004]
[null,null,null,null,null,null,null,null,null,null,null,2659,6,null,null,null,null,10842768213,68174429,0.88919999999999999]
[null,null,null,null,null,null,null,null,null,null,null,2660,6,null,null,null,null,10573648217,68174525,0.4592]
[null,null,null,null,null,null,null,null,null,null,null,2661,6,null,null,null,null,12284069242,68175958,0.86329999999999996]
[null,null,null,null,null,null,null,null,null,null,null,2662,6,null,null,null,null,11791373241,68176168,0.95709999999999995]
[null,null,null,null,null,null,null,null,null,null,null,2668,6,null,null,null,null,11881735242,68177013,0.87209999999999999]
[null,null,null,null,null,null,null,null,null,null,null,2669,6,null,null,null,null,45841631206,68178462,0.25850000000000001]
[null,null,null,null,null,null,null,null,null,null,null,2671,6,null,null,null,null,"NULL",68178972,0.51349999999999996]
[null,null,null,null,null,null,null,null,null,null,null,2672,6,null,null,null,null,10651126208,68180167,0.48859999999999998]
[null,null,null,null,null,null,null,null,null,null,null,2673,6,null,null,null,null,11571814203,68180300,0.62329999999999997]
[null,null,null,null,null,null,null,null,null,null,null,2675,6,null,null,null,null,13770040241,68180335,0.83409999999999995]
[null,null,null,null,null,null,null,null,null,null,null,2676,6,null,null,null,null,13063375241,68180554,0.93049999999999999]
[null,null,null,null,null,null,null,null,null,null,null,2677,6,null,null,null,null,12279144241,68180618,0.93310000000000004]
[null,null,null,null,null,null,null,null,null,null,null,2678,6,null,null,null,null,12099014243,68180773,0.95030000000000003]
[null,null,null,null,null,null,null,null,null,null,null,2681,5,null,null,null,null,12582800243,68180810,0.88839999999999997]
[null,null,null,null,null,null,null,null,null,null,null,2682,5,null,null,null,null,44321446224,68181602,0.46310000000000001]
[null,null,null,null,null,null,null,null,null,null,null,2683,5,null,null,null,null,52010457236,68181629,0.48480000000000001]
[null,null,null,null,null,null,null,null,null,null,null,2685,6,null,null,null,null,10406940241,68181725,1.24]
[null,null,null,null,null,null,null,null,null,null,null,2686,6,null,null,null,null,13955845243,68181768,0.87470000000000003]
[null,null,null,null,null,null,null,null,null,null,null,2687,6,null,null,null,null,12067541213,68181784,0.5131]
[null,null,null,null,null,null,null,null,null,null,null,2688,6,null,null,null,null,10078428209,68182947,0.43959999999999999]
[null,null,null,null,null,null,null,null,null,null,null,2691,6,null,null,null,null,13062776243,68183114,0.88400000000000001]
[null,null,null,null,null,null,null,null,null,null,null,2692,6,null,null,null,null,10941908242,68183253,0.78149999999999997]
[null,null,null,null,null,null,null,null,null,null,null,2693,6,null,null,null,null,12697667243,68183405,0.85970000000000002]
[null,null,null,null,null,null,null,null,null,null,null,2694,6,null,null,null,null,14800195213,68183472,0.61199999999999999]
[null,null,null,null,null,null,null,null,null,null,null,2696,6,null,null,null,null,11344036241,68193523,1.0232000000000001]
[null,null,null,null,null,null,null,null,null,null,null,2697,6,null,null,null,null,10482041241,68266753,1.1151]
[null,null,null,null,null,null,null,null,null,null,null,2698,6,null,null,null,null,12504147243,68307404,0.87770000000000004]
[null,null,null,null,null,null,null,null,null,null,null,2699,6,null,null,null,null,13302395216,68307455,0.55759999999999998]
[null,null,null,null,null,null,null,null,null,null,null,2700,6,null,null,null,null,14246614206,68307965,0.46560000000000001]
[null,null,null,null,null,null,null,null,null,null,null,2701,6,null,null,null,null,20359643316,68307981,0.26950000000000002]
[null,null,null,null,null,null,null,null,null,null,null,2702,6,null,null,null,null,14050091243,68308052,1.0748]
[null,null,null,null,null,null,null,null,null,null,null,2703,6,null,null,null,null,10397354211,68308116,0.70650000000000002]
[null,null,null,null,null,null,null,null,null,null,null,2704,6,null,null,null,null,24448783213,68308263,0.61890000000000001]
[null,null,null,null,null,null,null,null,null,null,null,2711,5,null,null,null,null,10806515241,68308511,0.87709999999999999]
[null,null,null,null,null,null,null,null,null,null,null,2712,6,null,null,null,null,11879349243,68308650,0.72940000000000005]
[null,null,null,null,null,null,null,null,null,null,null,2713,6,null,null,null,null,12367559441,68309696,0.88070000000000004]
[null,null,null,null,null,null,null,null,null,null,null,2721,5,null,null,null,null,13298962244,68309725,0.92600000000000005]
[null,null,null,null,null,null,null,null,null,null,null,2723,5,null,null,null,null,12141843244,68309944,0.95340000000000003]
[null,null,null,null,null,null,null,null,null,null,null,2724,5,null,null,null,null,10255799243,68309987,0.86780000000000002]
[null,null,null,null,null,null,null,null,null,null,null,2730,5,null,null,null,null,23106877217,68310312,0.22159999999999999]
[null,null,null,null,null,null,null,null,null,null,null,2735,5,null,null,null,null,10377875242,68311286,0.98470000000000002]
[null,null,null,null,null,null,null,null,null,null,null,2736,5,null,null,null,null,11979463207,68340108,0.56899999999999995]
[null,null,null,null,null,null,null,null,null,null,null,2737,5,null,null,null,null,11588346205,68353398,0.59970000000000001]
[null,null,null,null,null,null,null,null,null,null,null,2738,6,null,null,null,null,12655418243,68353478,0.85109999999999997]
[null,null,null,null,null,null,null,null,null,null,null,2740,6,null,null,null,null,13953094242,68365911,1.7052]
[null,null,null,null,null,null,null,null,null,null,null,2745,6,null,null,null,null,10598799220,68379168,0.51900000000000002]
[null,null,null,null,null,null,null,null,null,null,null,2746,6,null,null,null,null,10835016241,68383191,0.79530000000000001]
[null,null,null,null,null,null,null,null,null,null,null,2747,6,null,null,null,null,23133345202,68460644,0.54149999999999998]
[null,null,null,null,null,null,null,null,null,null,null,2750,6,null,null,null,null,15342311204,68462906,0.52910000000000001]
[null,null,null,null,null,null,null,null,null,null,null,2751,6,null,null,null,null,14127108242,68462965,1.0250999999999999]
[null,null,null,null,null,null,null,null,null,null,null,2752,6,null,null,null,null,10626296242,68504854,0.88219999999999998]
[null,null,null,null,null,null,null,null,null,null,null,2755,6,null,null,null,null,10982620203,68505646,0.9022]
[null,null,null,null,null,null,null,null,null,null,null,2760,5,null,null,null,null,10514652216,68559492,0.57030000000000003]
[null,null,null,null,null,null,null,null,null,null,null,2764,5,null,null,null,null,13309828213,68560514,0.80049999999999999]
[null,null,null,null,null,null,null,null,null,null,null,2765,5,null,null,null,null,10678200201,68602315,0.93689999999999996]
[null,null,null,null,null,null,null,null,null,null,null,2766,6,null,null,null,null,22988544243,68619301,1.4175]
[null,null,null,null,null,null,null,null,null,null,null,2767,6,null,null,null,null,10118304213,68619360,0.60150000000000003]
[null,null,null,null,null,null,null,null,null,null,null,2768,6,null,null,null,null,22751254204,68643010,0.39229999999999998]
[null,null,null,null,null,null,null,null,null,null,null,2769,5,null,null,null,null,23127546213,68643061,1.258]
[null,null,null,null,null,null,null,null,null,null,null,2800,5,null,null,null,null,13573544243,68801955,0.87439999999999996]
[null,null,null,null,null,null,null,null,null,null,null,2801,5,null,null,null,null,13295251218,68854627,1.1724000000000001]
[null,null,null,null,null,null,null,null,null,null,null,2802,5,null,null,null,null,12755075242,68874847,0.94469999999999998]
[null,null,null,null,null,null,null,null,null,null,null,2803,5,null,null,null,null,12650420216,68892332,0.73929999999999996]
[null,null,null,null,null,null,null,null,null,null,null,2804,5,null,null,null,null,11266754243,68892535,0.89410000000000001]
[null,null,null,null,null,null,null,null,null,null,null,2805,5,null,null,null,null,10493560243,68896894,0.8891]
[null,null,null,null,null,null,null,null,null,null,null,2807,5,null,null,null,null,23424874242,69000842,0.90590000000000004]
[null,null,null,null,null,null,null,null,null,null,null,2808,5,null,null,null,null,10857968242,69010223,0.83440000000000003]
[null,null,null,null,null,null,null,null,null,null,null,2809,5,null,null,null,null,23848300241,69014136,0.83599999999999997]
[null,null,null,null,null,null,null,null,null,null,null,2821,5,null,null,null,null,10820115213,69015120,0.76429999999999998]
[null,null,null,null,null,null,null,null,null,null,null,2822,5,null,null,null,null,22934552241,69074681,0.91749999999999998]
[null,null,null,null,null,null,null,null,null,null,null,2823,5,null,null,null,null,13551427141,69077516,1.113]
[null,null,null,null,null,null,null,null,null,null,null,2824,5,null,null,null,null,23461853241,80019245,0.87870000000000004]
[null,null,null,null,null,null,null,null,null,null,null,2831,5,null,null,null,null,14828342243,80019317,0.92059999999999997]
[null,null,null,null,null,null,null,null,null,null,null,2832,5,null,null,null,null,11111111111,80020422,0.87390000000000001]
[null,null,null,null,null,null,null,null,null,null,null,2833,5,null,null,null,null,13978798241,80095133,0.92159999999999997]
[null,null,null,null,null,null,null,null,null,null,null,2834,5,null,null,null,null,23537574242,80102188,0.85670000000000002]
[null,null,null,null,null,null,null,null,null,null,null,2835,5,null,null,null,null,23950188209,80151465,0.85540000000000005]
[null,null,null,null,null,null,null,null,null,null,null,2836,5,null,null,null,null,13825047213,80167379,0.48930000000000001]
[null,null,null,null,null,null,null,null,null,null,null,2837,5,null,null,null,null,23979886241,80234252,0.90849999999999997]
[null,null,null,null,null,null,null,null,null,null,null,2840,5,null,null,null,null,23848070205,80273657,0.64280000000000004]
[null,null,null,null,null,null,null,null,null,null,null,2841,5,null,null,null,null,14434174213,80277180,1.9105000000000001]
[null,null,null,null,null,null,null,null,null,null,null,2842,5,null,null,null,null,18205994204,80296867,0.49259999999999998]
[null,null,null,null,null,null,null,null,null,null,null,2851,5,null,null,null,null,15735760241,80317752,0.77470000000000006]
[null,null,null,null,null,null,null,null,null,null,null,2852,5,null,null,null,null,12480265205,80336881,0.48870000000000002]
[null,null,null,null,null,null,null,null,null,null,null,2853,5,null,null,null,null,14114601243,80337307,0.9587]
[null,null,null,null,null,null,null,null,null,null,null,2854,5,null,null,null,null,14921555203,80412266,0.53059999999999996]
[null,null,null,null,null,null,null,null,null,null,null,2855,5,null,null,null,null,14114704243,80435265,0.877]
[null,null,null,null,null,null,null,null,null,null,null,2856,5,null,null,null,null,24090816218,80439370,0.51980000000000004]
[null,null,null,null,null,null,null,null,null,null,null,2858,5,null,null,null,null,23996654243,80520443,0.85670000000000002]
[null,null,null,null,null,null,null,null,null,null,null,2859,5,null,null,null,null,14332151213,80528234,0.52629999999999999]
[null,null,null,null,null,null,null,null,null,null,null,2861,5,null,null,null,null,14290558213,80528285,1.1472]
[null,null,null,null,null,null,null,null,null,null,null,2862,5,null,null,null,null,13893062215,80539136,0.76490000000000002]
[null,null,null,null,null,null,null,null,null,null,null,2870,5,null,null,null,null,11031387203,80638345,0.49540000000000001]
[null,null,null,null,null,null,null,null,null,null,null,2879,5,null,null,null,null,24085214242,80657562,0.9778]
[null,null,null,null,null,null,null,null,null,null,null,2881,5,null,null,null,null,24069100213,80658071,0.55410000000000004]
[null,null,null,null,null,null,null,null,null,null,null,2882,5,null,null,null,null,23095100209,80658290,0.59340000000000004]
[null,null,null,null,null,null,null,null,null,null,null,2883,5,null,null,null,null,23815331203,80673677,0.39]
[null,null,null,null,null,null,null,null,null,null,null,2884,5,null,null,null,null,23481325204,80683349,0.57010000000000005]
[null,null,null,null,null,null,null,null,null,null,null,2885,5,null,null,null,null,18264825143,80683808,1.7969999999999999]
[null,null,null,null,null,null,null,null,null,null,null,2886,5,null,null,null,null,23928646241,80833677,0.93740000000000001]
[null,null,null,null,null,null,null,null,null,null,null,2887,5,null,null,null,null,23976333242,80834266,0.94189999999999996]
[null,null,null,null,null,null,null,null,null,null,null,2888,5,null,null,null,null,23758759241,80836050,0.95669999999999999]
[null,null,null,null,null,null,null,null,null,null,null,2889,5,null,null,null,null,14024830206,80851963,0.49340000000000001]
[null,null,null,null,null,null,null,null,null,null,null,2890,5,null,null,null,null,14447877211,80856123,0.7046]
[null,null,null,null,null,null,null,null,null,null,null,2891,5,null,null,null,null,14243556241,81089296,0.92720000000000002]
[null,null,null,null,null,null,null,null,null,null,null,2892,5,null,null,null,null,11242941125,81135504,0.53879999999999995]
[null,null,null,null,null,null,null,null,null,null,null,2893,5,null,null,null,null,10731084244,81144427,0.89100000000000001]
[null,null,null,null,null,null,null,null,null,null,null,2894,5,null,null,null,null,13978774241,81146545,0.94210000000000005]
[null,null,null,null,null,null,null,null,null,null,null,2896,5,null,null,null,null,12084182241,81155716,0.93579999999999997]
[null,null,null,null,null,null,null,null,null,null,null,2897,5,null,null,null,null,12311383243,81155759,0.68010000000000004]
[null,null,null,null,null,null,null,null,null,null,null,2898,5,null,null,null,null,62112282233,81155804,0.53659999999999997]
[null,null,null,null,null,null,null,null,null,null,null,2899,5,null,null,null,null,13638887210,81155847,0.59260000000000002]
[null,null,null,null,null,null,null,null,null,null,null,2900,5,null,null,null,null,12296723241,81155935,0.94189999999999996]
[null,null,null,null,null,null,null,null,null,null,null,2901,5,null,null,null,null,11003959202,81155943,0.72389999999999999]
[null,null,null,null,null,null,null,null,null,null,null,2903,5,null,null,null,null,10318164243,81155986,0.96909999999999996]
[null,null,null,null,null,null,null,null,null,null,null,2904,5,null,null,null,null,13835462242,81156524,1.1091]
[null,null,null,null,null,null,null,null,null,null,null,2911,5,null,null,null,null,13085241217,81157674,0.5716]
[null,null,null,null,null,null,null,null,null,null,null,2921,5,null,null,null,null,14919200213,81158212,1.5654999999999999]
[null,null,null,null,null,null,null,null,null,null,null,2922,5,null,null,null,null,14711480213,81158423,0.56659999999999999]
[null,null,null,null,null,null,null,null,null,null,null,2931,5,null,null,null,null,12577507202,81159776,0.80640000000000001]
[null,null,null,null,null,null,null,null,null,null,null,2932,5,null,null,null,null,10799079244,81160283,0.84719999999999995]
[null,null,null,null,null,null,null,null,null,null,null,2941,5,null,null,null,null,23711426241,81160304,0.94189999999999996]
[null,null,null,null,null,null,null,null,null,null,null,2942,5,null,null,null,null,12249312143,81160312,0.53820000000000001]
[null,null,null,null,null,null,null,null,null,null,null,2943,5,null,null,null,null,12639366218,81160347,0.53600000000000003]
[null,null,null,null,null,null,null,null,null,null,null,2944,5,null,null,null,null,12855113241,81160355,0.9536]
[null,null,null,null,null,null,null,null,null,null,null,2945,5,null,null,null,null,28650474241,81160398,0.99760000000000004]
[null,null,null,null,null,null,null,null,null,null,null,2946,5,null,null,null,null,10400229204,81160419,0.40670000000000001]
[null,null,null,null,null,null,null,null,null,null,null,2947,5,null,null,null,null,12910638241,81160443,0.97309999999999997]
[null,null,null,null,null,null,null,null,null,null,null,2948,5,null,null,null,null,14349308208,81160451,1.1487000000000001]
[null,null,null,null,null,null,null,null,null,null,null,2949,5,null,null,null,null,10276509244,81160478,0.54]
[null,null,null,null,null,null,null,null,null,null,null,3000,5,null,null,null,null,10920394244,81160515,1.0218]
[null,null,null,null,null,null,null,null,null,null,null,3001,5,null,null,null,null,15306993204,81160531,0.5696]
[null,null,null,null,null,null,null,null,null,null,null,3002,5,null,null,null,null,"NULL",81160574,0.2928]
[null,null,null,null,null,null,null,null,null,null,null,3003,5,null,null,null,null,"NULL",81160611,1.0206999999999999]
[null,null,null,null,null,null,null,null,null,null,null,3008,5,null,null,null,null,43648793223,81206288,0.30020000000000002]
[null,null,null,null,null,null,null,null,null,null,null,3009,5,null,null,null,null,13413622203,81207264,0.36009999999999998]
[null,null,null,null,null,null,null,null,null,null,null,3011,5,null,null,null,null,11377524203,81207838,0.54690000000000005]
[null,null,null,null,null,null,null,null,null,null,null,3012,5,null,null,null,null,12237294243,81208013,1.7191000000000001]
[null,null,null,null,null,null,null,null,null,null,null,3013,6,null,null,null,null,14770342242,81213023,1.2766]
[null,null,null,null,null,null,null,null,null,null,null,3014,6,null,null,null,null,12559415242,81213680,0.95189999999999997]
[null,null,null,null,null,null,null,null,null,null,null,3015,6,null,null,null,null,12021965243,81214843,0.97799999999999998]
[null,null,null,null,null,null,null,null,null,null,null,3016,5,null,null,null,null,14312421241,81214886,0.89400000000000002]
[null,null,null,null,null,null,null,null,null,null,null,3021,5,null,null,null,null,11766371241,81214931,0.86899999999999999]
[null,null,null,null,null,null,null,null,null,null,null,3022,5,null,null,null,null,10244830242,81215096,0.96479999999999999]
[null,null,null,null,null,null,null,null,null,null,null,3023,5,null,null,null,null,28582933212,81215109,0.70640000000000003]
[null,null,null,null,null,null,null,null,null,null,null,3024,5,null,null,null,null,14355554243,81215133,0.89280000000000004]
[null,null,null,null,null,null,null,null,null,null,null,3031,5,null,null,null,null,23896994213,81215168,0.3]
[null,null,null,null,null,null,null,null,null,null,null,3032,5,null,null,null,null,22975085219,81331687,0.81279999999999997]
[null,null,null,null,null,null,null,null,null,null,null,3033,5,null,null,null,null,18922060219,81331767,0.54749999999999999]
[null,null,null,null,null,null,null,null,null,null,null,3034,6,null,null,null,null,12064452243,81331812,0.83450000000000002]
[null,null,null,null,null,null,null,null,null,null,null,3035,6,null,null,null,null,11128997208,81332057,0.55369999999999997]
[null,null,null,null,null,null,null,null,null,null,null,3036,5,null,null,null,null,11771148241,81332073,0.96499999999999997]
[null,null,null,null,null,null,null,null,null,null,null,3041,6,null,null,null,null,13424653213,81332196,0.70069999999999999]
[null,null,null,null,null,null,null,null,null,null,null,3042,6,null,null,null,null,12234019242,81332508,0.93510000000000004]
[null,null,null,null,null,null,null,null,null,null,null,3043,4,null,null,null,null,12061624241,81332559,0.95]
[null,null,null,null,null,null,null,null,null,null,null,3044,6,null,null,null,null,10808050213,81333076,0.57430000000000003]
[null,null,null,null,null,null,null,null,null,null,null,3045,6,null,null,null,null,12460906242,81333623,0.89319999999999999]
[null,null,null,null,null,null,null,null,null,null,null,3046,6,null,null,null,null,11797898242,81334597,0.95550000000000002]
[null,null,null,null,null,null,null,null,null,null,null,3047,6,null,null,null,null,23980862219,81335274,0.62160000000000004]
[null,null,null,null,null,null,null,null,null,null,null,3051,6,null,null,null,null,10624957244,81336648,1.0163]
[null,null,null,null,null,null,null,null,null,null,null,3052,6,null,null,null,null,12820465213,81337886,0.55610000000000004]
[null,null,null,null,null,null,null,null,null,null,null,3053,6,null,null,null,null,12530274213,81340241,0.64829999999999999]
[null,null,null,null,null,null,null,null,null,null,null,3060,6,null,null,null,null,12832569213,81340786,1.381]
[null,null,null,null,null,null,null,null,null,null,null,3061,6,null,null,null,null,13054047243,81340831,0.94089999999999996]
[null,null,null,null,null,null,null,null,null,null,null,3062,6,null,null,null,null,13552583243,81340882,0.88990000000000002]
[null,null,null,null,null,null,null,null,null,null,null,3063,6,null,null,null,null,12765713242,81341260,0.9456]
[null,null,null,null,null,null,null,null,null,null,null,3064,6,null,null,null,null,10557905213,81341949,0.67600000000000005]
[null,null,null,null,null,null,null,null,null,null,null,3065,6,null,null,null,null,11245786215,81362969,0.72189999999999999]
[null,null,null,null,null,null,null,null,null,null,null,3066,6,null,null,null,null,12057944243,81363005,0.94750000000000001]
[null,null,null,null,null,null,null,null,null,null,null,3067,6,null,null,null,null,14029581208,81363072,0.89049999999999996]
[null,null,null,null,null,null,null,null,null,null,null,3068,6,null,null,null,null,10804757244,81363689,0.5625]
[null,null,null,null,null,null,null,null,null,null,null,3069,6,null,null,null,null,13532774244,81363769,0.58709999999999996]
[null,null,null,null,null,null,null,null,null,null,null,3070,6,null,null,null,null,13346137241,81363814,0.95369999999999999]
[null,null,null,null,null,null,null,null,null,null,null,3071,6,null,null,null,null,13104386213,81363830,0.92149999999999999]
[null,null,null,null,null,null,null,null,null,null,null,3072,6,null,null,null,null,10517923213,81363988,0.60489999999999999]
[null,null,null,null,null,null,null,null,null,null,null,3073,6,null,null,null,null,10527300219,81364147,0.28499999999999998]
[null,null,null,null,null,null,null,null,null,null,null,3074,6,null,null,null,null,14916331213,81364251,0.59689999999999999]
[null,null,null,null,null,null,null,null,null,null,null,3075,6,null,null,null,null,10699144244,81364585,0.9143]
[null,null,null,null,null,null,null,null,null,null,null,3077,6,null,null,null,null,23183034244,81364673,0.98540000000000005]
[null,null,null,null,null,null,null,null,null,null,null,3078,6,null,null,null,null,13982227213,81364729,0.85140000000000005]
[null,null,null,null,null,null,null,null,null,null,null,3082,6,null,null,null,null,12525122213,81364761,0.70640000000000003]
[null,null,null,null,null,null,null,null,null,null,null,3100,5,null,null,null,null,12351451242,81364913,0.9728]
[null,null,null,null,null,null,null,null,null,null,null,3101,5,null,null,null,null,12194432241,81365035,0.96060000000000001]
[null,null,null,null,null,null,null,null,null,null,null,3102,5,null,null,null,null,10839041243,81365078,0.96240000000000003]
[null,null,null,null,null,null,null,null,null,null,null,3103,5,null,null,null,null,10959118241,81365270,0.93700000000000006]
[null,null,null,null,null,null,null,null,null,null,null,3104,5,null,null,null,null,13491196241,81365377,1]
[null,null,null,null,null,null,null,null,null,null,null,3109,5,null,null,null,null,11807179241,81365481,0.99219999999999997]
[null,null,null,null,null,null,null,null,null,null,null,3110,5,null,null,null,null,14498598213,81384922,0.55559999999999998]
[null,null,null,null,null,null,null,null,null,null,null,3121,5,null,null,null,null,23397354444,81391276,1.2324999999999999]
[null,null,null,null,null,null,null,null,null,null,null,3123,6,null,null,null,null,11818629241,81391364,1.1861999999999999]
[null,null,null,null,null,null,null,null,null,null,null,3124,6,null,null,null,null,11895336241,81391647,1.2255]
[null,null,null,null,null,null,null,null,null,null,null,3125,6,null,null,null,null,10361966241,81392375,1.6636]
[null,null,null,null,null,null,null,null,null,null,null,3126,6,null,null,null,null,10197879444,81442715,1.5226999999999999]
[null,null,null,null,null,null,null,null,null,null,null,3127,6,null,null,null,null,10802353213,81443646,0.54169999999999996]
[null,null,null,null,null,null,null,null,null,null,null,3128,6,null,null,null,null,12374799243,81443726,0.94189999999999996]
[null,null,null,null,null,null,null,null,null,null,null,3129,6,null,null,null,null,18178924242,81443793,0.9577]
[null,null,null,null,null,null,null,null,null,null,null,3131,6,null,null,null,null,10598146203,81443830,0.47910000000000003]
[null,null,null,null,null,null,null,null,null,null,null,3132,6,null,null,null,null,11895453242,81443953,0.94899999999999995]
[null,null,null,null,null,null,null,null,null,null,null,3133,6,null,null,null,null,10460883243,81444008,1.244]
[null,null,null,null,null,null,null,null,null,null,null,3134,6,null,null,null,null,12017560242,81444067,0.98019999999999996]
[null,null,null,null,null,null,null,null,null,null,null,3135,6,null,null,null,null,46320843227,81444083,0.72030000000000005]
[null,null,null,null,null,null,null,null,null,null,null,3136,6,null,null,null,null,11352679220,81444868,0.35630000000000001]
[null,null,null,null,null,null,null,null,null,null,null,3137,6,null,null,null,null,13734440213,81445051,1.0623]
[null,null,null,null,null,null,null,null,null,null,null,3138,6,null,null,null,null,14033261242,81445289,0.47499999999999998]
[null,null,null,null,null,null,null,null,null,null,null,3141,5,null,null,null,null,14970346210,81445588,0.28499999999999998]
[null,null,null,null,null,null,null,null,null,null,null,3142,6,null,null,null,null,11317661218,81445748,0.5736]
[null,null,null,null,null,null,null,null,null,null,null,3143,6,null,null,null,null,15307114218,81445983,0.53080000000000005]
[null,null,null,null,null,null,null,null,null,null,null,3144,6,null,null,null,null,11316385218,81446070,0.47710000000000002]
[null,null,null,null,null,null,null,null,null,null,null,3145,6,null,null,null,null,14032466218,81446134,0.96450000000000002]
[null,null,null,null,null,null,null,null,null,null,null,3146,6,null,null,null,null,11893176141,81446214,1.0803]
[null,null,null,null,null,null,null,null,null,null,null,3147,6,null,null,null,null,12630367216,81446345,0.57169999999999999]
[null,null,null,null,null,null,null,null,null,null,null,3151,6,null,null,null,null,10852891243,81446396,0.95979999999999999]
[null,null,null,null,null,null,null,null,null,null,null,3152,6,null,null,null,null,10633759203,81454927,0.78180000000000005]
[null,null,null,null,null,null,null,null,null,null,null,3153,6,null,null,null,null,14158807243,81456199,0.83640000000000003]
[null,null,null,null,null,null,null,null,null,null,null,3154,6,null,null,null,null,24605960213,81456877,0.54559999999999997]
[null,null,null,null,null,null,null,null,null,null,null,3155,6,null,null,null,null,11841416207,81458303,0.56310000000000004]
[null,null,null,null,null,null,null,null,null,null,null,3161,6,null,null,null,null,12102886243,81458653,0.47499999999999998]
[null,null,null,null,null,null,null,null,null,null,null,3162,6,null,null,null,null,11524616219,81459015,0.4904]
[null,null,null,null,null,null,null,null,null,null,null,3163,6,null,null,null,null,10751460243,81459082,0.94899999999999995]
[null,null,null,null,null,null,null,null,null,null,null,3165,6,null,null,null,null,10497210241,81459170,0.98499999999999999]
[null,null,null,null,null,null,null,null,null,null,null,3170,6,null,null,null,null,11716747241,81459306,2.5421999999999998]
[null,null,null,null,null,null,null,null,null,null,null,3175,6,null,null,null,null,12696484217,81459381,0.53859999999999997]
[null,null,null,null,null,null,null,null,null,null,null,3176,6,null,null,null,null,22492724208,81459699,0.432]
[null,null,null,null,null,null,null,null,null,null,null,3177,6,null,null,null,null,11593955206,81459728,0.49409999999999998]
[null,null,null,null,null,null,null,null,null,null,null,3178,6,null,null,null,null,10692020217,81459736,0.44350000000000001]
[null,null,null,null,null,null,null,null,null,null,null,3179,6,null,null,null,null,13398440206,81460032,0.64129999999999998]
[null,null,null,null,null,null,null,null,null,null,null,3181,6,null,null,null,null,12941777219,81460403,0.86299999999999999]
[null,null,null,null,null,null,null,null,null,null,null,3182,6,null,null,null,null,52210619236,81460411,0.59509999999999996]
[null,null,null,null,null,null,null,null,null,null,null,3183,6,null,null,null,null,51113313234,81460788,0.52449999999999997]
[null,null,null,null,null,null,null,null,null,null,null,3184,6,null,null,null,null,"NULL",81462302,0.5534]
[null,null,null,null,null,null,null,null,null,null,null,3185,6,null,null,null,null,10491551242,81463874,0.61750000000000005]
[null,null,null,null,null,null,null,null,null,null,null,3186,6,null,null,null,null,12941777219,81463954,0.87]
[null,null,null,null,null,null,null,null,null,null,null,3187,6,null,null,null,null,24151241243,81484106,1.0423]
[null,null,null,null,null,null,null,null,null,null,null,3188,6,null,null,null,null,"NULL",81488692,0.53910000000000002]
[null,null,null,null,null,null,null,null,null,null,null,3200,6,null,null,null,null,13627289442,81492704,0.91010000000000002]
[null,null,null,null,null,null,null,null,null,null,null,3201,6,null,null,null,null,10811478243,81500962,0.9536]
[null,null,null,null,null,null,null,null,null,null,null,3202,6,null,null,null,null,22396240243,81516235,1.8795999999999999]
[null,null,null,null,null,null,null,null,null,null,null,3211,6,null,null,null,null,12125090242,81516278,0.97230000000000005]
[null,null,null,null,null,null,null,null,null,null,null,3212,6,null,null,null,null,12138982243,81516534,0.99860000000000004]
[null,null,null,null,null,null,null,null,null,null,null,3213,5,null,null,null,null,10305337242,81516606,0.92059999999999997]
[null,null,null,null,null,null,null,null,null,null,null,3214,5,null,null,null,null,12600638242,81516622,0.49780000000000002]
[null,null,null,null,null,null,null,null,null,null,null,3221,6,null,null,null,null,10728491207,81516673,0.56430000000000002]
[null,null,null,null,null,null,null,null,null,null,null,3225,6,null,null,null,null,11275422216,81516729,0.58740000000000003]
[null,null,null,null,null,null,null,null,null,null,null,3231,5,null,null,null,null,24097239208,81516825,0.94640000000000002]
[null,null,null,null,null,null,null,null,null,null,null,3232,6,null,null,null,null,24528768213,81516876,0.51780000000000004]
[null,null,null,null,null,null,null,null,null,null,null,3233,6,null,null,null,null,10719321242,81524171,1.7383]
[null,null,null,null,null,null,null,null,null,null,null,3234,5,null,null,null,null,11802428243,81525588,0.89549999999999996]
[null,null,null,null,null,null,null,null,null,null,null,3235,5,null,null,null,null,14482270220,81525684,0.82520000000000004]
[null,null,null,null,null,null,null,null,null,null,null,3240,6,null,null,null,null,15734446220,81526054,0.57579999999999998]
[null,null,null,null,null,null,null,null,null,null,null,3242,6,null,null,null,null,12691922213,81526572,0.68069999999999997]
[null,null,null,null,null,null,null,null,null,null,null,3243,6,null,null,null,null,12558191207,81528009,0.56989999999999996]
[null,null,null,null,null,null,null,null,null,null,null,3244,6,null,null,null,null,12106323213,81528279,0.93879999999999997]
[null,null,null,null,null,null,null,null,null,null,null,3245,6,null,null,null,null,12758054243,81528420,1]
[null,null,null,null,null,null,null,null,null,null,null,3246,6,null,null,null,null,50400838233,81528535,0.8841]
[null,null,null,null,null,null,null,null,null,null,null,3247,6,null,null,null,null,440445014223,81528658,0.46589999999999998]
[null,null,null,null,null,null,null,null,null,null,null,3248,6,null,null,null,null,10174328213,81528711,0.91239999999999999]
[null,null,null,null,null,null,null,null,null,null,null,3250,6,null,null,null,null,12449189212,81528834,1.9073]
[null,null,null,null,null,null,null,null,null,null,null,3252,6,null,null,null,null,23947083202,81528922,0.56440000000000001]
[null,null,null,null,null,null,null,null,null,null,null,3253,6,null,null,null,null,12497883219,81528981,0.41789999999999999]
[null,null,null,null,null,null,null,null,null,null,null,3254,6,null,null,null,null,10821745243,81529060,0.97209999999999996]
[null,null,null,null,null,null,null,null,null,null,null,3255,6,null,null,null,null,13201005208,81529116,0.57269999999999999]
[null,null,null,null,null,null,null,null,null,null,null,3256,6,null,null,null,null,14074440243,81542169,0.39779999999999999]
[null,null,null,null,null,null,null,null,null,null,null,3257,6,null,null,null,null,10585560244,81542329,0.94289999999999996]
[null,null,null,null,null,null,null,null,null,null,null,3258,6,null,null,null,null,12240980241,81542345,0.93759999999999999]
[null,null,null,null,null,null,null,null,null,null,null,3259,6,null,null,null,null,11960922242,81542353,0.95920000000000005]
[null,null,null,null,null,null,null,null,null,null,null,3261,6,null,null,null,null,12907681217,81542361,0.28499999999999998]
[null,null,null,null,null,null,null,null,null,null,null,3262,6,null,null,null,null,73309051233,81542388,0.5333]
[null,null,null,null,null,null,null,null,null,null,null,3263,6,null,null,null,null,10900107244,81543495,0.94089999999999996]
[null,null,null,null,null,null,null,null,null,null,null,3264,6,null,null,null,null,10313516203,81543612,0.67300000000000004]
[null,null,null,null,null,null,null,null,null,null,null,3265,6,null,null,null,null,13448095213,81543727,1.034]
[null,null,null,null,null,null,null,null,null,null,null,3271,6,null,null,null,null,20785307213,81543831,0.622]
[null,null,null,null,null,null,null,null,null,null,null,3272,6,null,null,null,null,62313311233,81543954,1.0606]
[null,null,null,null,null,null,null,null,null,null,null,3273,6,null,null,null,null,13906810213,81544260,1.0167999999999999]
[null,null,null,null,null,null,null,null,null,null,null,3274,6,null,null,null,null,14094503213,81544295,1.0179]
[null,null,null,null,null,null,null,null,null,null,null,3275,6,null,null,null,null,13899336207,81544332,0.40670000000000001]
[null,null,null,null,null,null,null,null,null,null,null,3281,6,null,null,null,null,10957013213,81565598,0.40679999999999999]
[null,null,null,null,null,null,null,null,null,null,null,3282,6,null,null,null,null,11788144243,81565707,0.90900000000000003]
[null,null,null,null,null,null,null,null,null,null,null,3283,6,null,null,null,null,10722464219,81565846,0.67490000000000006]
[null,null,null,null,null,null,null,null,null,null,null,3284,6,null,null,null,null,12058880213,81565926,0.98860000000000003]
[null,null,null,null,null,null,null,null,null,null,null,3291,6,null,null,null,null,13046545218,81566312,0.49320000000000003]
[null,null,null,null,null,null,null,null,null,null,null,3292,5,null,null,null,null,10716902218,81566398,1.0146999999999999]
[null,null,null,null,null,null,null,null,null,null,null,3293,6,null,null,null,null,12977251213,81566494,0.61319999999999997]
[null,null,null,null,null,null,null,null,null,null,null,3294,6,null,null,null,null,14717118219,81566662,0.76]
[null,null,null,null,null,null,null,null,null,null,null,3295,6,null,null,null,null,12175239244,81566777,0.97540000000000004]
[null,null,null,null,null,null,null,null,null,null,null,3296,6,null,null,null,null,10512612241,81566865,0.94359999999999999]
[null,null,null,null,null,null,null,null,null,null,null,3300,3,null,null,null,null,12749544243,81566953,1.7916000000000001]
[null,null,null,null,null,null,null,null,null,null,null,3301,3,null,null,null,null,11117409217,81567016,0.28499999999999998]
[null,null,null,null,null,null,null,null,null,null,null,3302,3,null,null,null,null,46081201237,81567104,0.28499999999999998]
[null,null,null,null,null,null,null,null,null,null,null,3303,3,null,null,null,null,23037490242,81568174,0.90810000000000002]
[null,null,null,null,null,null,null,null,null,null,null,3304,3,null,null,null,null,10949621244,81568246,1.7221]
[null,null,null,null,null,null,null,null,null,null,null,3321,5,null,null,null,null,10888038243,81568262,0.94710000000000005]
[null,null,null,null,null,null,null,null,null,null,null,3322,5,null,null,null,null,12504305217,81568385,0.3286]
[null,null,null,null,null,null,null,null,null,null,null,3323,6,null,null,null,null,11855268204,81568457,0.42449999999999999]
[null,null,null,null,null,null,null,null,null,null,null,3324,5,null,null,null,null,22278797202,81568537,0.70640000000000003]
[null,null,null,null,null,null,null,null,null,null,null,3325,5,null,null,null,null,22922245202,81568609,0.70640000000000003]
[null,null,null,null,null,null,null,null,null,null,null,3326,5,null,null,null,null,13079356241,81572667,0.93459999999999999]
[null,null,null,null,null,null,null,null,null,null,null,3327,6,null,null,null,null,11345240244,81572886,0.83140000000000003]
[null,null,null,null,null,null,null,null,null,null,null,3328,6,null,null,null,null,12076518242,81573889,0.88829999999999998]
[null,null,null,null,null,null,null,null,null,null,null,3331,6,null,null,null,null,11495895215,81578655,0.3296]
[null,null,null,null,null,null,null,null,null,null,null,3332,6,null,null,null,null,23460333244,81578727,0.84279999999999999]
[null,null,null,null,null,null,null,null,null,null,null,3333,6,null,null,null,null,14477362243,81580093,2.6242999999999999]
[null,null,null,null,null,null,null,null,null,null,null,3334,6,null,null,null,null,12788532208,81582662,0.71430000000000005]
[null,null,null,null,null,null,null,null,null,null,null,3335,6,null,null,null,null,10982596213,81582689,0.75339999999999996]
[null,null,null,null,null,null,null,null,null,null,null,3336,6,null,null,null,null,12172164241,81582697,0.94899999999999995]
[null,null,null,null,null,null,null,null,null,null,null,3337,6,null,null,null,null,10814646242,81582726,0.94289999999999996]
[null,null,null,null,null,null,null,null,null,null,null,3338,6,null,null,null,null,11893231243,81582734,1.3]
[null,null,null,null,null,null,null,null,null,null,null,3341,5,null,null,null,null,12064641213,81582814,0.47499999999999998]
[null,null,null,null,null,null,null,null,null,null,null,3342,5,null,null,null,null,12688425242,81582822,0.95899999999999996]
[null,null,null,null,null,null,null,null,null,null,null,3343,6,null,null,null,null,10342433243,81582849,0.94499999999999995]
[null,null,null,null,null,null,null,null,null,null,null,3344,6,null,null,null,null,11851202242,81582857,0.93920000000000003]
[null,null,null,null,null,null,null,null,null,null,null,3345,6,null,null,null,null,13142225243,81582873,0.89659999999999995]
[null,null,null,null,null,null,null,null,null,null,null,3346,6,null,null,null,null,23747450243,81582902,0.85919999999999996]
[null,null,null,null,null,null,null,null,null,null,null,3347,6,null,null,null,null,13809366243,81582910,0.54800000000000004]
[null,null,null,null,null,null,null,null,null,null,null,3348,6,null,null,null,null,13918835241,81582937,0.95179999999999998]
[null,null,null,null,null,null,null,null,null,null,null,3349,6,null,null,null,null,10325029242,81583024,0.93579999999999997]
[null,null,null,null,null,null,null,null,null,null,null,3350,6,null,null,null,null,12624197242,81583059,0.91369999999999996]
[null,null,null,null,null,null,null,null,null,null,null,3351,6,null,null,null,null,21549397210,81583083,0.80530000000000002]
[null,null,null,null,null,null,null,null,null,null,null,3352,6,null,null,null,null,61144044233,81583147,0.62609999999999999]
[null,null,null,null,null,null,null,null,null,null,null,3353,6,null,null,null,null,12874103208,81583227,0.58340000000000003]
[null,null,null,null,null,null,null,null,null,null,null,3354,6,null,null,null,null,10380949218,81583315,0.5373]
[null,null,null,null,null,null,null,null,null,null,null,3355,6,null,null,null,null,12071623243,81583366,0.98560000000000003]
[null,null,null,null,null,null,null,null,null,null,null,3356,6,null,null,null,null,10436428218,81583526,0.59550000000000003]
[null,null,null,null,null,null,null,null,null,null,null,3357,6,null,null,null,null,11941884213,81583630,0.41849999999999998]
[null,null,null,null,null,null,null,null,null,null,null,3358,6,null,null,null,null,20933713243,81583702,0.97199999999999998]
[null,null,null,null,null,null,null,null,null,null,null,3359,6,null,null,null,null,10637959244,81583809,0.97009999999999996]
[null,null,null,null,null,null,null,null,null,null,null,3360,6,null,null,null,null,13034283242,81583913,0.93149999999999999]
[null,null,null,null,null,null,null,null,null,null,null,3368,6,null,null,null,null,12964493209,81583980,0.70089999999999997]
[null,null,null,null,null,null,null,null,null,null,null,3369,6,null,null,null,null,13824084209,81584078,0.59150000000000003]
[null,null,null,null,null,null,null,null,null,null,null,3371,6,null,null,null,null,52104222236,81584115,0.95760000000000001]
[null,null,null,null,null,null,null,null,null,null,null,3372,6,null,null,null,null,12070732244,81591315,0.94410000000000005]
[null,null,null,null,null,null,null,null,null,null,null,3373,6,null,null,null,null,12868490243,81591681,0.47499999999999998]
[null,null,null,null,null,null,null,null,null,null,null,3374,6,null,null,null,null,13555232112,81598971,1.024]
[null,null,null,null,null,null,null,null,null,null,null,3375,6,null,null,null,null,11430528204,81599253,0.47220000000000001]
[null,null,null,null,null,null,null,null,null,null,null,3377,6,null,null,null,null,14346343220,81599296,1.0714999999999999]
[null,null,null,null,null,null,null,null,null,null,null,3378,6,null,null,null,null,14541122215,81599309,0.57889999999999997]
[null,null,null,null,null,null,null,null,null,null,null,3379,6,null,null,null,null,10323292244,81599325,0.93379999999999996]
[null,null,null,null,null,null,null,null,null,null,null,3381,6,null,null,null,null,12791864207,81599333,1.0264]
[null,null,null,null,null,null,null,null,null,null,null,3382,6,null,null,null,null,13629676220,81599341,1.0172000000000001]
[null,null,null,null,null,null,null,null,null,null,null,3383,6,null,null,null,null,11178662210,81599376,0.28499999999999998]
[null,null,null,null,null,null,null,null,null,null,null,3384,6,null,null,null,null,10772823241,81599472,0.99199999999999999]
[null,null,null,null,null,null,null,null,null,null,null,3385,6,null,null,null,null,14971127241,81599544,1.6491]
[null,null,null,null,null,null,null,null,null,null,null,3386,6,null,null,null,null,10603233243,81599587,1.7787999999999999]
[null,null,null,null,null,null,null,null,null,null,null,3387,6,null,null,null,null,44573124224,81599659,0.6]
[null,null,null,null,null,null,null,null,null,null,null,3388,6,null,null,null,null,50059401233,81599667,0.58599999999999997]
[null,null,null,null,null,null,null,null,null,null,null,3390,6,null,null,null,null,44433358224,81599720,0.55720000000000003]
[null,null,null,null,null,null,null,null,null,null,null,3394,5,null,null,null,null,73178640225,81599771,0.53139999999999998]
[null,null,null,null,null,null,null,null,null,null,null,3395,5,null,null,null,null,54317286239,81600509,0.56969999999999998]
[null,null,null,null,null,null,null,null,null,null,null,3396,6,null,null,null,null,12623244213,81601843,0.7036]
[null,null,null,null,null,null,null,null,null,null,null,3397,5,null,null,null,null,61555286229,81602483,0.55220000000000002]
[null,null,null,null,null,null,null,null,null,null,null,3398,5,null,null,null,null,11855165243,81605027,0.82799999999999996]
[null,null,null,null,null,null,null,null,null,null,null,3399,5,null,null,null,null,22729798218,81606353,0.6]
[null,null,null,null,null,null,null,null,null,null,null,3400,6,null,null,null,null,14672976204,81608068,0.53349999999999997]
[null,null,null,null,null,null,null,null,null,null,null,3411,6,null,null,null,null,11796330213,81608252,0.96699999999999997]
[null,null,null,null,null,null,null,null,null,null,null,3412,6,null,null,null,null,24659385208,81608383,0.5222]
[null,null,null,null,null,null,null,null,null,null,null,3413,6,null,null,null,null,10352487242,81610838,0.98329999999999995]
[null,null,null,null,null,null,null,null,null,null,null,3414,6,null,null,null,null,12329799213,81610889,0.72130000000000005]
[null,null,null,null,null,null,null,null,null,null,null,3416,6,null,null,null,null,12639469211,81610942,1.0723]
[null,null,null,null,null,null,null,null,null,null,null,3417,6,null,null,null,null,12700460213,81611101,0.72509999999999997]
[null,null,null,null,null,null,null,null,null,null,null,3418,6,null,null,null,null,11050126204,81611582,0.51480000000000004]
[null,null,null,null,null,null,null,null,null,null,null,3421,6,null,null,null,null,10669044243,81611646,0.95950000000000002]
[null,null,null,null,null,null,null,null,null,null,null,3422,6,null,null,null,null,12210316206,81611734,0.56610000000000005]
[null,null,null,null,null,null,null,null,null,null,null,3423,6,null,null,null,null,11577140203,81611793,0.28949999999999998]
[null,null,null,null,null,null,null,null,null,null,null,3424,6,null,null,null,null,11993953213,81611902,0.28499999999999998]
[null,null,null,null,null,null,null,null,null,null,null,3425,6,null,null,null,null,44304740224,81612112,0.4662]
[null,null,null,null,null,null,null,null,null,null,null,3426,6,null,null,null,null,11200943212,81612278,0.59470000000000001]
[null,null,null,null,null,null,null,null,null,null,null,3431,6,null,null,null,null,13301583243,81612358,0.95679999999999998]
[null,null,null,null,null,null,null,null,null,null,null,3432,6,null,null,null,null,10941719242,81614177,1.7250000000000001]
[null,null,null,null,null,null,null,null,null,null,null,3433,4,null,null,null,null,13364827243,81614492,0.89359999999999995]
[null,null,null,null,null,null,null,null,null,null,null,3434,6,null,null,null,null,12066526243,81614660,1.0477000000000001]
[null,null,null,null,null,null,null,null,null,null,null,3441,6,null,null,null,null,12021563243,81614804,0.89490000000000003]
[null,null,null,null,null,null,null,null,null,null,null,3442,6,null,null,null,null,12493872243,81614863,0.93769999999999998]
[null,null,null,null,null,null,null,null,null,null,null,3443,6,null,null,null,null,12646410243,81614951,0.92510000000000003]
[null,null,null,null,null,null,null,null,null,null,null,3444,6,null,null,null,null,15725228204,81615161,0.62060000000000004]
[null,null,null,null,null,null,null,null,null,null,null,3450,6,null,null,null,null,10518869244,81615241,0.69740000000000002]
[null,null,null,null,null,null,null,null,null,null,null,3458,6,null,null,null,null,10975765242,81615348,0.89800000000000002]
[null,null,null,null,null,null,null,null,null,null,null,3459,6,null,null,null,null,11694692208,81615540,1.0798000000000001]
[null,null,null,null,null,null,null,null,null,null,null,3461,6,null,null,null,null,12686595208,81615604,0.59860000000000002]
[null,null,null,null,null,null,null,null,null,null,null,3462,6,null,null,null,null,11407676208,81615647,0.59440000000000004]
[null,null,null,null,null,null,null,null,null,null,null,3463,6,null,null,null,null,11890915211,81615735,0.3281]
[null,null,null,null,null,null,null,null,null,null,null,3464,6,null,null,null,null,12990142208,81615815,0.59030000000000005]
[null,null,null,null,null,null,null,null,null,null,null,3465,6,null,null,null,null,11785756243,81615874,0.95899999999999996]
[null,null,null,null,null,null,null,null,null,null,null,3466,6,null,null,null,null,13556707242,81615946,0.95469999999999999]
[null,null,null,null,null,null,null,null,null,null,null,3467,6,null,null,null,null,61332669237,81616041,0.46970000000000001]
[null,null,null,null,null,null,null,null,null,null,null,3500,4,null,null,null,null,11100609207,81629686,0.51849999999999996]
[null,null,null,null,null,null,null,null,null,null,null,3501,4,null,null,null,null,15733579117,81662662,0.56950000000000001]
[null,null,null,null,null,null,null,null,null,null,null,3502,4,null,null,null,null,13979414241,81681740,0.52349999999999997]
[null,null,null,null,null,null,null,null,null,null,null,3503,4,null,null,null,null,"NULL",81681820,0.48459999999999998]
[null,null,null,null,null,null,null,null,null,null,null,3504,4,null,null,null,null,13956066241,81681898,0.98429999999999995]
[null,null,null,null,null,null,null,null,null,null,null,3507,4,null,null,null,null,10489165204,81682612,0.40360000000000001]
[null,null,null,null,null,null,null,null,null,null,null,3508,4,null,null,null,null,10225761213,81687392,0.44330000000000003]
[null,null,null,null,null,null,null,null,null,null,null,3509,4,null,null,null,null,10835449242,81687528,0.9385]
[null,null,null,null,null,null,null,null,null,null,null,3510,4,null,null,null,null,22227784213,81695026,0.84770000000000001]
[null,null,null,null,null,null,null,null,null,null,null,3511,4,null,null,null,null,11574848203,81695050,0.57989999999999997]
[null,null,null,null,null,null,null,null,null,null,null,3512,4,null,null,null,null,18764686114,81695093,0.81289999999999996]
[null,null,null,null,null,null,null,null,null,null,null,3515,4,null,null,null,null,11882035209,81695798,0.35630000000000001]
[null,null,null,null,null,null,null,null,null,null,null,3516,4,null,null,null,null,13519649208,81696598,0.56999999999999995]
[null,null,null,null,null,null,null,null,null,null,null,3517,4,null,null,null,null,14644328206,81699035,0.6]
[null,null,null,null,null,null,null,null,null,null,null,3518,4,null,null,null,null,13597821208,81699166,0.72519999999999996]
[null,null,null,null,null,null,null,null,null,null,null,3519,4,null,null,null,null,11882200209,81725440,0.85770000000000002]
[null,null,null,null,null,null,null,null,null,null,null,3521,4,null,null,null,null,14413254242,81729695,1.0251999999999999]
[null,null,null,null,null,null,null,null,null,null,null,3523,4,null,null,null,null,14198391241,81773143,0.94979999999999998]
[null,null,null,null,null,null,null,null,null,null,null,3524,4,null,null,null,null,12344424213,81773944,0.95240000000000002]
[null,null,null,null,null,null,null,null,null,null,null,3525,4,null,null,null,null,11450894242,81801984,1.2588999999999999]
[null,null,null,null,null,null,null,null,null,null,null,3526,4,null,null,null,null,23460333244,81805360,0.82969999999999999]
[null,null,null,null,null,null,null,null,null,null,null,3527,4,null,null,null,null,14705588208,81828677,0.6]
[null,null,null,null,null,null,null,null,null,null,null,3528,4,null,null,null,null,10310939220,81829733,0.73329999999999995]
[null,null,null,null,null,null,null,null,null,null,null,3529,4,null,null,null,null,10387355242,81842321,0.8337]
[null,null,null,null,null,null,null,null,null,null,null,3530,4,null,null,null,null,23994889243,81884687,0.92669999999999997]
[null,null,null,null,null,null,null,null,null,null,null,3531,4,null,null,null,null,23762934214,82067427,0.59309999999999996]
[null,null,null,null,null,null,null,null,null,null,null,3532,4,null,null,null,null,11397089206,82099998,0.28499999999999998]
[null,null,null,null,null,null,null,null,null,null,null,3533,4,null,null,null,null,12751222241,82100338,0.9758]
[null,null,null,null,null,null,null,null,null,null,null,3534,4,null,null,null,null,23972119243,82101330,0.47499999999999998]
[null,null,null,null,null,null,null,null,null,null,null,3535,4,null,null,null,null,12748141212,82106270,0.46729999999999999]
[null,null,null,null,null,null,null,null,null,null,null,3542,4,null,null,null,null,14571820242,82121171,0.56510000000000005]
[null,null,null,null,null,null,null,null,null,null,null,3543,4,null,null,null,null,14735808243,82121331,0.9546]
[null,null,null,null,null,null,null,null,null,null,null,3544,4,null,null,null,null,"NULL",82147670,0.50880000000000003]
[null,null,null,null,null,null,null,null,null,null,null,3545,4,null,null,null,null,21083914204,82177028,0.59950000000000003]
[null,null,null,null,null,null,null,null,null,null,null,3546,4,null,null,null,null,24189576242,82182804,1.6317999999999999]
[null,null,null,null,null,null,null,null,null,null,null,3548,4,null,null,null,null,21807314206,82184105,0.35630000000000001]
[null,null,null,null,null,null,null,null,null,null,null,3551,6,null,null,null,null,22793410209,82216664,0.73340000000000005]
[null,null,null,null,null,null,null,null,null,null,null,3552,6,null,null,null,null,11392613306,82218264,0.58050000000000002]
[null,null,null,null,null,null,null,null,null,null,null,3553,6,null,null,null,null,22660729217,82234221,0.28499999999999998]
[null,null,null,null,null,null,null,null,null,null,null,3554,6,null,null,null,null,24259837243,82234512,0.94220000000000004]
[null,null,null,null,null,null,null,null,null,null,null,3555,6,null,null,null,null,11401223208,82234600,0.58120000000000005]
[null,null,null,null,null,null,null,null,null,null,null,3556,6,null,null,null,null,23505128242,82234678,1.7108000000000001]
[null,null,null,null,null,null,null,null,null,null,null,3557,4,null,null,null,null,23926046213,82245692,0.95]
[null,null,null,null,null,null,null,null,null,null,null,3558,4,null,null,null,null,12950603241,82355699,0.9032]
[null,null,null,null,null,null,null,null,null,null,null,3559,6,null,null,null,null,10216945244,82435840,0.66810000000000003]
[null,null,null,null,null,null,null,null,null,null,null,3561,6,null,null,null,null,23740800211,82436413,0.58430000000000004]
[null,null,null,null,null,null,null,null,null,null,null,3562,6,null,null,null,null,23196081205,82436739,0.56510000000000005]
[null,null,null,null,null,null,null,null,null,null,null,3563,6,null,null,null,null,14805509242,82443074,1.4128000000000001]
[null,null,null,null,null,null,null,null,null,null,null,3564,6,null,null,null,null,14755923213,82452624,0.28499999999999998]
[null,null,null,null,null,null,null,null,null,null,null,3565,6,null,null,null,null,11846322213,82454750,0.6]
[null,null,null,null,null,null,null,null,null,null,null,3571,6,null,null,null,null,13324223242,82516202,0.68840000000000001]
[null,null,null,null,null,null,null,null,null,null,null,3572,6,null,null,null,null,23345601213,82516624,0.71]
[null,null,null,null,null,null,null,null,null,null,null,3573,6,null,null,null,null,13662338213,82516704,0.47499999999999998]
[null,null,null,null,null,null,null,null,null,null,null,3574,6,null,null,null,null,23021598219,82516851,0.6]
[null,null,null,null,null,null,null,null,null,null,null,3575,6,null,null,null,null,23519327213,82545767,0.47499999999999998]
[null,null,null,null,null,null,null,null,null,null,null,3576,6,null,null,null,null,15726573206,82673099,0.55830000000000002]
[null,null,null,null,null,null,null,null,null,null,null,3577,6,null,null,null,null,10908844241,82745515,0.56479999999999997]
[null,null,null,null,null,null,null,null,null,null,null,3578,6,null,null,null,null,12876992244,82758973,0.86660000000000004]
[null,null,null,null,null,null,null,null,null,null,null,3579,6,null,null,null,null,23932027213,82787029,1.08]
[null,null,null,null,null,null,null,null,null,null,null,3580,6,null,null,null,null,12225633243,82794472,0.9042]
[null,null,null,null,null,null,null,null,null,null,null,3581,6,null,null,null,null,21816161203,82810997,0.30020000000000002]
[null,null,null,null,null,null,null,null,null,null,null,3582,6,null,null,null,null,22652124213,82925540,0.89319999999999999]
[null,null,null,null,null,null,null,null,null,null,null,3585,6,null,null,null,null,23497454243,83046097,0.97070000000000001]
[null,null,null,null,null,null,null,null,null,null,null,3586,6,null,null,null,null,14513608243,83047006,0.9456]
[null,null,null,null,null,null,null,null,null,null,null,3587,6,null,null,null,null,14641545242,83047620,1.9476]
[null,null,null,null,null,null,null,null,null,null,null,3588,6,null,null,null,null,12499397242,83054353,0.95040000000000002]
[null,null,null,null,null,null,null,null,null,null,null,3589,6,null,null,null,null,24186119213,83129706,0.56510000000000005]
[null,null,null,null,null,null,null,null,null,null,null,3591,6,null,null,null,null,14303368213,83137896,1.5]
[null,null,null,null,null,null,null,null,null,null,null,3592,6,null,null,null,null,10339307243,38124578,0.62119999999999997]
[null,null,null,null,null,null,null,null,null,null,null,3593,6,null,null,null,null,22214483241,38454585,0.94069999999999998]
[null,null,null,null,null,null,null,null,null,null,null,3594,6,null,null,null,null,10870828241,38489446,0.84699999999999998]
[null,null,null,null,null,null,null,null,null,null,null,3595,6,null,null,null,null,10491496241,61041420,0.82720000000000005]
[null,null,null,null,null,null,null,null,null,null,null,3596,6,null,null,null,null,10366727242,61378736,0.6512]
[null,null,null,null,null,null,null,null,null,null,null,3597,6,null,null,null,null,10827569244,61379384,0.67500000000000004]
[null,null,null,null,null,null,null,null,null,null,null,3598,6,null,null,null,null,10491582242,61381513,0.83520000000000005]
[null,null,null,null,null,null,null,null,null,null,null,3599,6,null,null,null,null,10848599213,61459624,0.78539999999999999]
[null,null,null,null,null,null,null,null,null,null,null,3600,5,null,null,null,null,12193053241,61461396,0.82969999999999999]
[null,null,null,null,null,null,null,null,null,null,null,3601,5,null,null,null,null,12196214213,61510901,1.5370999999999999]
[null,null,null,null,null,null,null,null,null,null,null,3603,5,null,null,null,null,12662067243,61546883,0.75449999999999995]
[null,null,null,null,null,null,null,null,null,null,null,3604,5,null,null,null,null,19179894113,61785980,1.0428999999999999]
[null,null,null,null,null,null,null,null,null,null,null,3608,6,null,null,null,null,10227718213,61796575,1.6702999999999999]
[null,null,null,null,null,null,null,null,null,null,null,3620,6,null,null,null,null,14394236243,61984998,0.78569999999999995]
[null,null,null,null,null,null,null,null,null,null,null,3621,6,null,null,null,null,22633866243,62869000,0.58609999999999995]
[null,null,null,null,null,null,null,null,null,null,null,3622,6,null,null,null,null,12665431243,63062284,0.82679999999999998]
[null,null,null,null,null,null,null,null,null,null,null,3623,6,null,null,null,null,12292767241,64536701,0.754]
[null,null,null,null,null,null,null,null,null,null,null,3625,6,null,null,null,null,22260336242,64542212,0.63639999999999997]
[null,null,null,null,null,null,null,null,null,null,null,3626,6,null,null,null,null,11075129205,65210738,0.56969999999999998]
[null,null,null,null,null,null,null,null,null,null,null,3627,6,null,null,null,null,10855399243,65222261,0.64949999999999997]
[null,null,null,null,null,null,null,null,null,null,null,3630,6,null,null,null,null,"NULL",65222325,0.5252]
[null,null,null,null,null,null,null,null,null,null,null,3635,6,null,null,null,null,13005823213,65222341,0.65269999999999995]
[null,null,null,null,null,null,null,null,null,null,null,3636,6,null,null,null,null,12216178242,65242422,0.90029999999999999]
[null,null,null,null,null,null,null,null,null,null,null,3641,6,null,null,null,null,12316539242,65243513,0.65690000000000004]
[null,null,null,null,null,null,null,null,null,null,null,3642,6,null,null,null,null,10841547243,67299991,0.76280000000000003]
[null,null,null,null,null,null,null,null,null,null,null,3643,6,null,null,null,null,10523021243,67384264,0.85240000000000005]
[null,null,null,null,null,null,null,null,null,null,null,3644,6,null,null,null,null,10662968243,67497613,0.8306]
[null,null,null,null,null,null,null,null,null,null,null,3645,6,null,null,null,null,12232330243,67688671,0.82809999999999995]
[null,null,null,null,null,null,null,null,null,null,null,3646,6,null,null,null,null,10334577213,67688911,0.5262]
[null,null,null,null,null,null,null,null,null,null,null,3647,6,null,null,null,null,11403328212,67733225,0.42080000000000001]
[null,null,null,null,null,null,null,null,null,null,null,3648,6,null,null,null,null,14126767204,67744012,0.48299999999999998]
[null,null,null,null,null,null,null,null,null,null,null,3651,5,null,null,null,null,10361863241,67747133,0.82069999999999999]
[null,null,null,null,null,null,null,null,null,null,null,3652,6,null,null,null,null,11048053213,67747205,0.51049999999999995]
[null,null,null,null,null,null,null,null,null,null,null,3653,6,null,null,null,null,11809360242,67749788,0.93400000000000005]
[null,null,null,null,null,null,null,null,null,null,null,3654,6,null,null,null,null,12758975242,67751810,0.80700000000000005]
[null,null,null,null,null,null,null,null,null,null,null,3655,6,null,null,null,null,12281248243,67758094,0.89939999999999998]
[null,null,null,null,null,null,null,null,null,null,null,3656,6,null,null,null,null,10409132243,67813946,0.78779999999999994]
[null,null,null,null,null,null,null,null,null,null,null,3657,6,null,null,null,null,11741914216,67821567,0.4824]
[null,null,null,null,null,null,null,null,null,null,null,3658,6,null,null,null,null,12197837241,67824573,0.90129999999999999]
[null,null,null,null,null,null,null,null,null,null,null,3659,6,null,null,null,null,11129400208,67872786,0.33689999999999998]
[null,null,null,null,null,null,null,null,null,null,null,3661,5,null,null,null,null,11131298208,67872882,0.43690000000000001]
[null,null,null,null,null,null,null,null,null,null,null,3662,6,null,null,null,null,14279250213,67911319,0.77680000000000005]
[null,null,null,null,null,null,null,null,null,null,null,3663,6,null,null,null,null,13324072243,67958432,0.88129999999999997]
[null,null,null,null,null,null,null,null,null,null,null,3664,6,null,null,null,null,10507326242,67958483,0.82950000000000002]
[null,null,null,null,null,null,null,null,null,null,null,3671,6,null,null,null,null,10423763207,67984104,0.57310000000000005]
[null,null,null,null,null,null,null,null,null,null,null,3672,6,null,null,null,null,12396270243,67985430,0.77380000000000004]
[null,null,null,null,null,null,null,null,null,null,null,3700,6,null,null,null,null,10788110243,68038750,0.85840000000000005]
[null,null,null,null,null,null,null,null,null,null,null,3701,6,null,null,null,null,12172951244,68044982,1.016]
[null,null,null,null,null,null,null,null,null,null,null,3702,6,null,null,null,null,12108129243,68046443,1.0671999999999999]
[null,null,null,null,null,null,null,null,null,null,null,3704,6,null,null,null,null,12201923444,68047796,0.81850000000000001]
[null,null,null,null,null,null,null,null,null,null,null,3710,6,null,null,null,null,10229105211,68062347,0.48380000000000001]
[null,null,null,null,null,null,null,null,null,null,null,3711,6,null,null,null,null,20783185243,68067391,0.94499999999999995]
[null,null,null,null,null,null,null,null,null,null,null,3712,6,null,null,null,null,11104270244,68070312,0.4763]
[null,null,null,null,null,null,null,null,null,null,null,3713,6,null,null,null,null,13291068219,68073775,0.79590000000000005]
[null,null,null,null,null,null,null,null,null,null,null,3714,6,null,null,null,null,10820270241,68075586,0.86729999999999996]
[null,null,null,null,null,null,null,null,null,null,null,3715,6,null,null,null,null,13499431244,68108448,0.79100000000000004]
[null,null,null,null,null,null,null,null,null,null,null,3716,6,null,null,null,null,10884979242,68113466,0.85129999999999995]
[null,null,null,null,null,null,null,null,null,null,null,3717,6,null,null,null,null,10593756243,68152510,0.84079999999999999]
[null,null,null,null,null,null,null,null,null,null,null,3718,6,null,null,null,null,11030269203,68154372,0.49490000000000001]
[null,null,null,null,null,null,null,null,null,null,null,3720,6,null,null,null,null,12643228243,68158509,0.86729999999999996]
[null,null,null,null,null,null,null,null,null,null,null,3721,6,null,null,null,null,11111111111,68175827,0.4874]
[null,null,null,null,null,null,null,null,null,null,null,3722,6,null,null,null,null,10352315241,68177208,0.74580000000000002]
[null,null,null,null,null,null,null,null,null,null,null,3723,6,null,null,null,null,12786248203,68179422,0.48170000000000002]
[null,null,null,null,null,null,null,null,null,null,null,3724,6,null,null,null,null,15307121213,68180685,0.91359999999999997]
[null,null,null,null,null,null,null,null,null,null,null,3725,6,null,null,null,null,11978682242,68182867,1.0159]
[null,null,null,null,null,null,null,null,null,null,null,3726,6,null,null,null,null,10752210251,68308343,0.81869999999999998]
[null,null,null,null,null,null,null,null,null,null,null,3728,6,null,null,null,null,10353581242,68309784,0.74950000000000006]
[null,null,null,null,null,null,null,null,null,null,null,3729,6,null,null,null,null,11301109244,68380345,0.48270000000000002]
[null,null,null,null,null,null,null,null,null,null,null,3731,6,null,null,null,null,14061060206,68528012,0.52339999999999998]
[null,null,null,null,null,null,null,null,null,null,null,3732,6,null,null,null,null,23039090213,68802106,0.51290000000000002]
[null,null,null,null,null,null,null,null,null,null,null,3733,6,null,null,null,null,23584277241,68923020,0.80710000000000004]
[null,null,null,null,null,null,null,null,null,null,null,3734,6,null,null,null,null,13281870243,80019464,0.80710000000000004]
[null,null,null,null,null,null,null,null,null,null,null,3735,6,null,null,null,null,13322788213,1901458649,0.63]
[null,null,null,null,null,null,null,null,null,null,null,3741,6,null,null,null,null,13348995243,1901609511,0.74]
[null,null,null,null,null,null,null,null,null,null,null,3742,6,null,null,null,null,13135858208,1901609512,0.51]
[null,null,null,null,null,null,null,null,null,null,null,3743,6,null,null,null,null,13084460211,1901609514,0.48]
[null,null,null,null,null,null,null,null,null,null,null,3744,6,null,null,null,null,12631753213,1901052549,0.28000000000000003]
[null,null,null,null,null,null,null,null,null,null,null,3751,6,null,null,null,null,12559068213,1901609515,0.35]
[null,null,null,null,null,null,null,null,null,null,null,3752,6,null,null,null,null,11105862207,1900644803,0.3]
[null,null,null,null,null,null,null,null,null,null,null,3753,6,null,null,null,null,10531011220,1901609516,0.216]
[null,null,null,null,null,null,null,null,null,null,null,3754,6,null,null,null,null,14021583420,1901560354,0.33]
[null,null,null,null,null,null,null,null,null,null,null,3755,6,null,null,null,null,10893850244,1901081595,0.35]
[null,null,null,null,null,null,null,null,null,null,null,3756,6,null,null,null,null,10819067213,1901411020,0.35]
[null,null,null,null,null,null,null,null,null,null,null,3757,6,null,null,null,null,23921917213,1901411021,0.35]
[null,null,null,null,null,null,null,null,null,null,null,3758,6,null,null,null,null,12634048206,1901411023,0.35]
[null,null,null,null,null,null,null,null,null,null,null,3759,6,null,null,null,null,12181502243,1901411025,0.35]
[null,null,null,null,null,null,null,null,null,null,null,3761,6,null,null,null,null,12055825211,1901402329,0.45]
[null,null,null,null,null,null,null,null,null,null,null,3762,6,null,null,null,null,10645217213,1900541069,0.3]
[null,null,null,null,null,null,null,null,null,null,null,3763,6,null,null,null,null,13984614203,1901609610,0.25]
[null,null,null,null,null,null,null,null,null,null,null,3764,6,null,null,null,null,11563192202,1901609647,0.49]
[null,null,null,null,null,null,null,null,null,null,null,3765,6,null,null,null,null,11043924204,1901609680,0.38]
[null,null,null,null,null,null,null,null,null,null,null,3767,6,null,null,null,null,11611226208,1901609685,0.21]
[null,null,null,null,null,null,null,null,null,null,null,3768,6,null,null,null,null,15307114218,1901609686,0.39]
[null,null,null,null,null,null,null,null,null,null,null,3769,6,null,null,null,null,13980335218,1901609687,0.42]
[null,null,null,null,null,null,null,null,null,null,null,3770,4,null,null,null,null,11127855208,1901609688,0.49]
[null,null,null,null,null,null,null,null,null,null,null,3773,6,null,null,null,null,12154481444,1901411026,0.86799999999999999]
[null,null,null,null,null,null,null,null,null,null,null,3775,6,null,null,null,null,10898659244,1900820782,0.56000000000000005]
[null,null,null,null,null,null,null,null,null,null,null,3776,6,null,null,null,null,11376956203,1900078935,0.55000000000000004]
[null,null,null,null,null,null,null,null,null,null,null,3777,6,null,null,null,null,12651823203,1901609689,0.33]
[null,null,null,null,null,null,null,null,null,null,null,3778,6,null,null,null,null,10856417244,1901410869,0.21]
[null,null,null,null,null,null,null,null,null,null,null,3779,4,null,null,null,null,13632740241,1900742134,0.72]
[null,null,null,null,null,null,null,null,null,null,null,3780,6,null,null,null,null,10303720244,1900906419,0.57999999999999996]
[null,null,null,null,null,null,null,null,null,null,null,3783,6,null,null,null,null,10942624244,1901609674,0.96]
[null,null,null,null,null,null,null,null,null,null,null,3786,6,null,null,null,null,11300919218,1901609675,0.39300000000000002]
[null,null,null,null,null,null,null,null,null,null,null,3787,6,null,null,null,null,10366868211,1900707326,0.44]
[null,null,null,null,null,null,null,null,null,null,null,3791,6,null,null,null,null,12109618218,1901609676,0.45]
[null,null,null,null,null,null,null,null,null,null,null,3792,6,null,null,null,null,11571285203,1900497920,0.5]
[null,null,null,null,null,null,null,null,null,null,null,3793,6,null,null,null,null,13716736213,1901609678,0.45]
[null,null,null,null,null,null,null,null,null,null,null,3794,6,null,null,null,null,11423216203,1900561956,0.6]
[null,null,null,null,null,null,null,null,null,null,null,3795,6,null,null,null,null,10756582243,1901609679,0.64]
[null,null,null,null,null,null,null,null,null,null,null,3796,6,null,null,null,null,12135044242,1900831447,0.62]
[null,null,null,null,null,null,null,null,null,null,null,3800,6,null,null,null,null,11379014203,1901609740,0.62]
[null,null,null,null,null,null,null,null,null,null,null,3809,6,null,null,null,null,13325901203,1901609741,0.62]
[null,null,null,null,null,null,null,null,null,null,null,3811,6,null,null,null,null,12601763203,1901609742,0.62]
[null,null,null,null,null,null,null,null,null,null,null,3812,6,null,null,null,null,12131136213,1901609743,0.53]
[null,null,null,null,null,null,null,null,null,null,null,3813,6,null,null,null,null,10983157213,1900936263,0.8]
[null,null,null,null,null,null,null,null,null,null,null,3814,6,null,null,null,null,13021803209,1901463747,0.45]
[null,null,null,null,null,null,null,null,null,null,null,3815,6,null,null,null,null,11882035209,1901480054,0.48]
[null,null,null,null,null,null,null,null,null,null,null,3816,6,null,null,null,null,11817185209,1901515535,0.48]
[null,null,null,null,null,null,null,null,null,null,null,3817,6,null,null,null,null,10395510244,1900424504,0.68]
[null,null,null,null,null,null,null,null,null,null,null,3821,6,null,null,null,null,12460377206,1901609746,0.6]
[null,null,null,null,null,null,null,null,null,null,null,3825,6,null,null,null,null,15484990206,1901609748,0.6]
[null,null,null,null,null,null,null,null,null,null,null,3826,6,null,null,null,null,15735629206,1901609761,0.6]
[null,null,null,null,null,null,null,null,null,null,null,3831,6,null,null,null,null,18455058206,1901609762,0.6]
[null,null,null,null,null,null,null,null,null,null,null,3832,6,null,null,null,null,11092612206,1900725743,0.6]
[null,null,null,null,null,null,null,null,null,null,null,3833,6,null,null,null,null,15484828206,1901609763,0.6]
[null,null,null,null,null,null,null,null,null,null,null,3834,6,null,null,null,null,11090081206,1901609766,0.6]
[null,null,null,null,null,null,null,null,null,null,null,3836,6,null,null,null,null,23565524206,1901609767,0.6]
[null,null,null,null,null,null,null,null,null,null,null,3837,6,null,null,null,null,12532410206,1901609768,0.6]
[null,null,null,null,null,null,null,null,null,null,null,3841,6,null,null,null,null,11829519243,1901610494,0.67]
[null,null,null,null,null,null,null,null,null,null,null,3842,6,null,null,null,null,12891067211,1901610495,0.23]
[null,null,null,null,null,null,null,null,null,null,null,3843,6,null,null,null,null,11002525202,1901610496,0.5]
[null,null,null,null,null,null,null,null,null,null,null,3844,6,null,null,null,null,10269651202,1901610497,0.4]
[null,null,null,null,null,null,null,null,null,null,null,3846,6,null,null,null,null,11366201202,1901610498,1]
[null,null,null,null,null,null,null,null,null,null,null,3847,6,null,null,null,null,11283807217,1901610499,0.55000000000000004]
[null,null,null,null,null,null,null,null,null,null,null,3848,6,null,null,null,null,10529467211,1901610510,0.95]
[null,null,null,null,null,null,null,null,null,null,null,3849,6,null,null,null,null,13077543202,1901610511,0.9]
[null,null,null,null,null,null,null,null,null,null,null,3851,6,null,null,null,null,10402757206,1901567828,0.7]
[null,null,null,null,null,null,null,null,null,null,null,3852,6,null,null,null,null,11081492206,1900079768,0.7]
[null,null,null,null,null,null,null,null,null,null,null,3853,6,null,null,null,null,11090799206,1901610512,1]
[null,null,null,null,null,null,null,null,null,null,null,3854,6,null,null,null,null,10589605241,1901610513,1]
[null,null,null,null,null,null,null,null,null,null,null,3855,6,null,null,null,null,12932944209,1900573445,0.53]
[null,null,null,null,null,null,null,null,null,null,null,3860,6,null,null,null,null,12402502441,1901610514,1.05]
[null,null,null,null,null,null,null,null,null,null,null,3863,6,null,null,null,null,12217595444,1901610516,1.05]
[null,null,null,null,null,null,null,null,null,null,null,3864,6,null,null,null,null,10677508213,1900371764,0.45]
[null,null,null,null,null,null,null,null,null,null,null,3865,6,null,null,null,null,12063444213,1900588432,0.45]
[null,null,null,null,null,null,null,null,null,null,null,3866,6,null,null,null,null,11072140205,1900491104,0.5]
[null,null,null,null,null,null,null,null,null,null,null,3867,6,null,null,null,null,12738867241,1901611656,1]
[null,null,null,null,null,null,null,null,null,null,null,3868,6,null,null,null,null,12208542241,1900501997,0.82950000000000002]
[null,null,null,null,null,null,null,null,null,null,null,3871,6,null,null,null,null,12308556213,1900729611,0.4]
[null,null,null,null,null,null,null,null,null,null,null,3872,6,null,null,null,null,11341088220,1900811469,0.37]
[null,null,null,null,null,null,null,null,null,null,null,3873,6,null,null,null,null,12500909220,1901610449,0.62]
[null,null,null,null,null,null,null,null,null,null,null,3874,6,null,null,null,null,11340908220,1901610448,0.5]
[null,null,null,null,null,null,null,null,null,null,null,3875,6,null,null,null,null,11395843206,1900611812,0.5]
[null,null,null,null,null,null,null,null,null,null,null,3876,6,null,null,null,null,22305372209,1901610447,0.41]
[null,null,null,null,null,null,null,null,null,null,null,3877,6,null,null,null,null,11359762220,1900392220,0.65]
[null,null,null,null,null,null,null,null,null,null,null,3881,6,null,null,null,null,12294769213,1901610446,0.6]
[null,null,null,null,null,null,null,null,null,null,null,3882,6,null,null,null,null,13749619214,1900429180,0.76500000000000001]
[null,null,null,null,null,null,null,null,null,null,null,3884,6,null,null,null,null,12267064242,1900705819,1]
[null,null,null,null,null,null,null,null,null,null,null,3885,6,null,null,null,null,54827077240,1900295325,0.42]
[null,null,null,null,null,null,null,null,null,null,null,3886,6,null,null,null,null,75260608240,1901610445,0.42]
[null,null,null,null,null,null,null,null,null,null,null,3887,6,null,null,null,null,14208919220,1901610443,0.42]
[null,null,null,null,null,null,null,null,null,null,null,3888,6,null,null,null,null,11353931220,1901253782,0.56000000000000005]
[null,null,null,null,null,null,null,null,null,null,null,3890,6,null,null,null,null,11819022220,1901610442,0.33]
[null,null,null,null,null,null,null,null,null,null,null,3891,6,null,null,null,null,12949115243,1900007204,0.93]
[null,null,null,null,null,null,null,null,null,null,null,3892,6,null,null,null,null,10773381244,1900979236,0.62]
[null,null,null,null,null,null,null,null,null,null,null,3893,6,null,null,null,null,12503421244,1900579887,0.62]
[null,null,null,null,null,null,null,null,null,null,null,3894,6,null,null,null,null,12928099244,1901360935,0.62]
[null,null,null,null,null,null,null,null,null,null,null,3895,6,null,null,null,null,11919531241,1900579859,0.62]
[null,null,null,null,null,null,null,null,null,null,null,3896,6,null,null,null,null,54413313240,1901615541,0.63]
[null,null,null,null,null,null,null,null,null,null,null,3897,6,null,null,null,null,12249336243,1901615542,1.2]
[null,null,null,null,null,null,null,null,null,null,null,3898,6,null,null,null,null,10307078244,1900056877,2.5]
[null,null,null,null,null,null,null,null,null,null,null,3899,6,null,null,null,null,10485824207,1900707239,2.5]
[null,null,null,null,null,null,null,null,null,null,null,3900,6,null,null,null,null,12258523213,1901317358,0.56999999999999995]
[null,null,null,null,null,null,null,null,null,null,null,3901,6,null,null,null,null,11143110209,1901275713,0.56999999999999995]
[null,null,null,null,null,null,null,null,null,null,null,3902,6,null,null,null,null,11535719220,1901615545,0.56999999999999995]
[null,null,null,null,null,null,null,null,null,null,null,3903,6,null,null,null,null,10008676208,1901301757,1]
[null,null,null,null,null,null,null,null,null,null,null,3904,6,null,null,null,null,11462400208,1900724561,0.34]
[null,null,null,null,null,null,null,null,null,null,null,3905,6,null,null,null,null,12949115243,1901615957,0.74]
[null,null,null,null,null,null,null,null,null,null,null,3906,6]
[null,null,null,null,null,null,null,null,null,null,null,3907,6]
[null,null,null,null,null,null,null,null,null,null,null,3908,6]
[null,null,null,null,null,null,null,null,null,null,null,3909,6]
[null,null,null,null,null,null,null,null,null,null,null,3910,6]
[null,null,null,null,null,null,null,null,null,null,null,3911,6]
[null,null,null,null,null,null,null,null,null,null,null,3915,6]
[null,null,null,null,null,null,null,null,null,null,null,3916,6]
[null,null,null,null,null,null,null,null,null,null,null,3917,6]
[null,null,null,null,null,null,null,null,null,null,null,3918,6]
[null,null,null,null,null,null,null,null,null,null,null,3921,6]
[null,null,null,null,null,null,null,null,null,null,null,3922,6]
[null,null,null,null,null,null,null,null,null,null,null,3923,4]
[null,null,null,null,null,null,null,null,null,null,null,3924,6]
[null,null,null,null,null,null,null,null,null,null,null,3925,6]
[null,null,null,null,null,null,null,null,null,null,null,3926,6]
[null,null,null,null,null,null,null,null,null,null,null,3927,6]
[null,null,null,null,null,null,null,null,null,null,null,3928,6]
[null,null,null,null,null,null,null,null,null,null,null,3929,6]
[null,null,null,null,null,null,null,null,null,null,null,3931,6]
[null,null,null,null,null,null,null,null,null,null,null,3932,6]
[null,null,null,null,null,null,null,null,null,null,null,3933,6]
[null,null,null,null,null,null,null,null,null,null,null,3934,6]
[null,null,null,null,null,null,null,null,null,null,null,3935,6]
[null,null,null,null,null,null,null,null,null,null,null,3936,6]
[null,null,null,null,null,null,null,null,null,null,null,3937,6]
[null,null,null,null,null,null,null,null,null,null,null,3941,6]
[null,null,null,null,null,null,null,null,null,null,null,3942,6]
[null,null,null,null,null,null,null,null,null,null,null,3943,6]
[null,null,null,null,null,null,null,null,null,null,null,3944,6]
[null,null,null,null,null,null,null,null,null,null,null,3945,6]
[null,null,null,null,null,null,null,null,null,null,null,3950,6]
[null,null,null,null,null,null,null,null,null,null,null,3952,6]
[null,null,null,null,null,null,null,null,null,null,null,3953,6]
[null,null,null,null,null,null,null,null,null,null,null,3954,6]
[null,null,null,null,null,null,null,null,null,null,null,3955,6]
[null,null,null,null,null,null,null,null,null,null,null,3956,6]
[null,null,null,null,null,null,null,null,null,null,null,3957,6]
[null,null,null,null,null,null,null,null,null,null,null,3958,6]
[null,null,null,null,null,null,null,null,null,null,null,3959,6]
[null,null,null,null,null,null,null,null,null,null,null,3961,6]
[null,null,null,null,null,null,null,null,null,null,null,3962,6]
[null,null,null,null,null,null,null,null,null,null,null,3963,6]
[null,null,null,null,null,null,null,null,null,null,null,3964,6]
[null,null,null,null,null,null,null,null,null,null,null,3965,6]
[null,null,null,null,null,null,null,null,null,null,null,3967,6]
[null,null,null,null,null,null,null,null,null,null,null,3971,6]
[null,null,null,null,null,null,null,null,null,null,null,3972,6]
[null,null,null,null,null,null,null,null,null,null,null,3973,6]
[null,null,null,null,null,null,null,null,null,null,null,3974,6]
[null,null,null,null,null,null,null,null,null,null,null,3976,6]
[null,null,null,null,null,null,null,null,null,null,null,3977,6]
[null,null,null,null,null,null,null,null,null,null,null,3978,6]
[null,null,null,null,null,null,null,null,null,null,null,3980,6]
[null,null,null,null,null,null,null,null,null,null,null,3981,6]
[null,null,null,null,null,null,null,null,null,null,null,3985,6]
[null,null,null,null,null,null,null,null,null,null,null,3987,6]
[null,null,null,null,null,null,null,null,null,null,null,3988,6]
[null,null,null,null,null,null,null,null,null,null,null,3989,6]
[null,null,null,null,null,null,null,null,null,null,null,3991,6]
[null,null,null,null,null,null,null,null,null,null,null,3992,6]
[null,null,null,null,null,null,null,null,null,null,null,3993,6]
[null,null,null,null,null,null,null,null,null,null,null,3994,6]
[null,null,null,null,null,null,null,null,null,null,null,3995,6]
[null,null,null,null,null,null,null,null,null,null,null,3996,6]
[null,null,null,null,null,null,null,null,null,null,null,3997,6]
[null,null,null,null,null,null,null,null,null,null,null,3998,6]
[null,null,null,null,null,null,null,null,null,null,null,3999,6]
[null,null,null,null,null,null,null,null,null,null,null,4000,3]
[null,null,null,null,null,null,null,null,null,null,null,4001,3]
[null,null,null,null,null,null,null,null,null,null,null,4002,3]
[null,null,null,null,null,null,null,null,null,null,null,4003,3]
[null,null,null,null,null,null,null,null,null,null,null,4005,3]
[null,null,null,null,null,null,null,null,null,null,null,4008,3]
[null,null,null,null,null,null,null,null,null,null,null,4009,3]
[null,null,null,null,null,null,null,null,null,null,null,4010,3]
[null,null,null,null,null,null,null,null,null,null,null,4011,3]
[null,null,null,null,null,null,null,null,null,null,null,4012,3]
[null,null,null,null,null,null,null,null,null,null,null,4013,3]
[null,null,null,null,null,null,null,null,null,null,null,4014,3]
[null,null,null,null,null,null,null,null,null,null,null,4015,3]
[null,null,null,null,null,null,null,null,null,null,null,4017,3]
[null,null,null,null,null,null,null,null,null,null,null,4018,3]
[null,null,null,null,null,null,null,null,null,null,null,4021,3]
[null,null,null,null,null,null,null,null,null,null,null,4022,3]
[null,null,null,null,null,null,null,null,null,null,null,4023,3]
[null,null,null,null,null,null,null,null,null,null,null,4024,3]
[null,null,null,null,null,null,null,null,null,null,null,4025,3]
[null,null,null,null,null,null,null,null,null,null,null,4026,3]
[null,null,null,null,null,null,null,null,null,null,null,4027,3]
[null,null,null,null,null,null,null,null,null,null,null,4028,3]
[null,null,null,null,null,null,null,null,null,null,null,4029,3]
[null,null,null,null,null,null,null,null,null,null,null,4030,3]
[null,null,null,null,null,null,null,null,null,null,null,4031,3]
[null,null,null,null,null,null,null,null,null,null,null,4032,3]
[null,null,null,null,null,null,null,null,null,null,null,4033,3]
[null,null,null,null,null,null,null,null,null,null,null,4034,3]
[null,null,null,null,null,null,null,null,null,null,null,4035,3]
[null,null,null,null,null,null,null,null,null,null,null,4038,3]
[null,null,null,null,null,null,null,null,null,null,null,4042,3]
[null,null,null,null,null,null,null,null,null,null,null,4051,3]
[null,null,null,null,null,null,null,null,null,null,null,4060,5]
[null,null,null,null,null,null,null,null,null,null,null,4063,3]
[null,null,null,null,null,null,null,null,null,null,null,4064,5]
[null,null,null,null,null,null,null,null,null,null,null,4065,5]
[null,null,null,null,null,null,null,null,null,null,null,4066,5]
[null,null,null,null,null,null,null,null,null,null,null,4067,5]
[null,null,null,null,null,null,null,null,null,null,null,4069,5]
[null,null,null,null,null,null,null,null,null,null,null,4071,5]
[null,null,null,null,null,null,null,null,null,null,null,4074,5]
[null,null,null,null,null,null,null,null,null,null,null,4075,5]
[null,null,null,null,null,null,null,null,null,null,null,4077,3]
[null,null,null,null,null,null,null,null,null,null,null,4078,3]
[null,null,null,null,null,null,null,null,null,null,null,4079,3]
[null,null,null,null,null,null,null,null,null,null,null,4080,5]
[null,null,null,null,null,null,null,null,null,null,null,4081,5]
[null,null,null,null,null,null,null,null,null,null,null,4085,5]
[null,null,null,null,null,null,null,null,null,null,null,4086,5]
[null,null,null,null,null,null,null,null,null,null,null,4087,5]
[null,null,null,null,null,null,null,null,null,null,null,4090,5]
[null,null,null,null,null,null,null,null,null,null,null,4095,5]
[null,null,null,null,null,null,null,null,null,null,null,4096,5]
[null,null,null,null,null,null,null,null,null,null,null,4097,5]
[null,null,null,null,null,null,null,null,null,null,null,4100,5]
[null,null,null,null,null,null,null,null,null,null,null,4103,5]
[null,null,null,null,null,null,null,null,null,null,null,4110,5]
[null,null,null,null,null,null,null,null,null,null,null,4114,5]
[null,null,null,null,null,null,null,null,null,null,null,4115,5]
[null,null,null,null,null,null,null,null,null,null,null,4116,5]
[null,null,null,null,null,null,null,null,null,null,null,4117,5]
[null,null,null,null,null,null,null,null,null,null,null,4118,5]
[null,null,null,null,null,null,null,null,null,null,null,4119,5]
[null,null,null,null,null,null,null,null,null,null,null,4121,5]
[null,null,null,null,null,null,null,null,null,null,null,4122,5]
[null,null,null,null,null,null,null,null,null,null,null,4123,5]
[null,null,null,null,null,null,null,null,null,null,null,4124,5]
[null,null,null,null,null,null,null,null,null,null,null,4125,5]
[null,null,null,null,null,null,null,null,null,null,null,4126,5]
[null,null,null,null,null,null,null,null,null,null,null,4127,5]
[null,null,null,null,null,null,null,null,null,null,null,4128,5]
[null,null,null,null,null,null,null,null,null,null,null,4130,5]
[null,null,null,null,null,null,null,null,null,null,null,4132,5]
[null,null,null,null,null,null,null,null,null,null,null,4133,5]
[null,null,null,null,null,null,null,null,null,null,null,4134,5]
[null,null,null,null,null,null,null,null,null,null,null,4135,5]
[null,null,null,null,null,null,null,null,null,null,null,4136,5]
[null,null,null,null,null,null,null,null,null,null,null,4137,5]
[null,null,null,null,null,null,null,null,null,null,null,4138,5]
[null,null,null,null,null,null,null,null,null,null,null,4141,5]
[null,null,null,null,null,null,null,null,null,null,null,4142,5]
[null,null,null,null,null,null,null,null,null,null,null,4143,5]
[null,null,null,null,null,null,null,null,null,null,null,4144,5]
[null,null,null,null,null,null,null,null,null,null,null,4145,5]
[null,null,null,null,null,null,null,null,null,null,null,4146,5]
[null,null,null,null,null,null,null,null,null,null,null,4150,5]
[null,null,null,null,null,null,null,null,null,null,null,4161,5]
[null,null,null,null,null,null,null,null,null,null,null,4162,5]
[null,null,null,null,null,null,null,null,null,null,null,4163,5]
[null,null,null,null,null,null,null,null,null,null,null,4164,5]
[null,null,null,null,null,null,null,null,null,null,null,4171,5]
[null,null,null,null,null,null,null,null,null,null,null,4172,5]
[null,null,null,null,null,null,null,null,null,null,null,4173,5]
[null,null,null,null,null,null,null,null,null,null,null,4174,5]
[null,null,null,null,null,null,null,null,null,null,null,4175,5]
[null,null,null,null,null,null,null,null,null,null,null,4176,5]
[null,null,null,null,null,null,null,null,null,null,null,4177,5]
[null,null,null,null,null,null,null,null,null,null,null,4181,5]
[null,null,null,null,null,null,null,null,null,null,null,4183,5]
[null,null,null,null,null,null,null,null,null,null,null,4184,5]
[null,null,null,null,null,null,null,null,null,null,null,4200,5]
[null,null,null,null,null,null,null,null,null,null,null,4201,5]
[null,null,null,null,null,null,null,null,null,null,null,4211,5]
[null,null,null,null,null,null,null,null,null,null,null,4212,5]
[null,null,null,null,null,null,null,null,null,null,null,4220,5]
[null,null,null,null,null,null,null,null,null,null,null,4221,5]
[null,null,null,null,null,null,null,null,null,null,null,4224,5]
[null,null,null,null,null,null,null,null,null,null,null,4225,3]
[null,null,null,null,null,null,null,null,null,null,null,4231,6]
[null,null,null,null,null,null,null,null,null,null,null,4232,6]
[null,null,null,null,null,null,null,null,null,null,null,4233,6]
[null,null,null,null,null,null,null,null,null,null,null,4234,6]
[null,null,null,null,null,null,null,null,null,null,null,4235,6]
[null,null,null,null,null,null,null,null,null,null,null,4241,4]
[null,null,null,null,null,null,null,null,null,null,null,4242,5]
[null,null,null,null,null,null,null,null,null,null,null,4243,5]
[null,null,null,null,null,null,null,null,null,null,null,4244,6]
[null,null,null,null,null,null,null,null,null,null,null,4245,6]
[null,null,null,null,null,null,null,null,null,null,null,4246,3]
[null,null,null,null,null,null,null,null,null,null,null,4251,4]
[null,null,null,null,null,null,null,null,null,null,null,4252,5]
[null,null,null,null,null,null,null,null,null,null,null,4253,5]
[null,null,null,null,null,null,null,null,null,null,null,4254,5]
[null,null,null,null,null,null,null,null,null,null,null,4255,5]
[null,null,null,null,null,null,null,null,null,null,null,4262,5]
[null,null,null,null,null,null,null,null,null,null,null,4263,5]
[null,null,null,null,null,null,null,null,null,null,null,4264,5]
[null,null,null,null,null,null,null,null,null,null,null,4266,5]
[null,null,null,null,null,null,null,null,null,null,null,4267,6]
[null,null,null,null,null,null,null,null,null,null,null,4271,5]
[null,null,null,null,null,null,null,null,null,null,null,4272,5]
[null,null,null,null,null,null,null,null,null,null,null,4273,5]
[null,null,null,null,null,null,null,null,null,null,null,4274,5]
[null,null,null,null,null,null,null,null,null,null,null,4275,5]
[null,null,null,null,null,null,null,null,null,null,null,4281,4]
[null,null,null,null,null,null,null,null,null,null,null,4283,4]
[null,null,null,null,null,null,null,null,null,null,null,4284,5]
[null,null,null,null,null,null,null,null,null,null,null,4285,5]
[null,null,null,null,null,null,null,null,null,null,null,4286,5]
[null,null,null,null,null,null,null,null,null,null,null,4287,5]
[null,null,null,null,null,null,null,null,null,null,null,4288,5]
[null,null,null,null,null,null,null,null,null,null,null,4300,6]
[null,null,null,null,null,null,null,null,null,null,null,4301,6]
[null,null,null,null,null,null,null,null,null,null,null,4311,6]
[null,null,null,null,null,null,null,null,null,null,null,4320,6]
[null,null,null,null,null,null,null,null,null,null,null,4321,6]
[null,null,null,null,null,null,null,null,null,null,null,4324,6]
[null,null,null,null,null,null,null,null,null,null,null,4325,6]
[null,null,null,null,null,null,null,null,null,null,null,4326,6]
[null,null,null,null,null,null,null,null,null,null,null,4327,6]
[null,null,null,null,null,null,null,null,null,null,null,4331,6]
[null,null,null,null,null,null,null,null,null,null,null,4332,6]
[null,null,null,null,null,null,null,null,null,null,null,4333,6]
[null,null,null,null,null,null,null,null,null,null,null,4334,6]
[null,null,null,null,null,null,null,null,null,null,null,4335,6]
[null,null,null,null,null,null,null,null,null,null,null,4336,6]
[null,null,null,null,null,null,null,null,null,null,null,4337,6]
[null,null,null,null,null,null,null,null,null,null,null,4338,4]
[null,null,null,null,null,null,null,null,null,null,null,4341,6]
[null,null,null,null,null,null,null,null,null,null,null,4342,6]
[null,null,null,null,null,null,null,null,null,null,null,4343,6]
[null,null,null,null,null,null,null,null,null,null,null,4351,6]
[null,null,null,null,null,null,null,null,null,null,null,4352,6]
[null,null,null,null,null,null,null,null,null,null,null,4353,6]
[null,null,null,null,null,null,null,null,null,null,null,4354,6]
[null,null,null,null,null,null,null,null,null,null,null,4355,6]
[null,null,null,null,null,null,null,null,null,null,null,4356,6]
[null,null,null,null,null,null,null,null,null,null,null,4361,6]
[null,null,null,null,null,null,null,null,null,null,null,4362,6]
[null,null,null,null,null,null,null,null,null,null,null,4363,6]
[null,null,null,null,null,null,null,null,null,null,null,4371,6]
[null,null,null,null,null,null,null,null,null,null,null,4372,6]
[null,null,null,null,null,null,null,null,null,null,null,4373,6]
[null,null,null,null,null,null,null,null,null,null,null,4374,6]
[null,null,null,null,null,null,null,null,null,null,null,4375,6]
[null,null,null,null,null,null,null,null,null,null,null,4376,6]
[null,null,null,null,null,null,null,null,null,null,null,4400,3]
[null,null,null,null,null,null,null,null,null,null,null,4401,3]
[null,null,null,null,null,null,null,null,null,null,null,4402,3]
[null,null,null,null,null,null,null,null,null,null,null,4403,3]
[null,null,null,null,null,null,null,null,null,null,null,4404,3]
[null,null,null,null,null,null,null,null,null,null,null,4405,3]
[null,null,null,null,null,null,null,null,null,null,null,4407,3]
[null,null,null,null,null,null,null,null,null,null,null,4413,3]
[null,null,null,null,null,null,null,null,null,null,null,4431,3]
[null,null,null,null,null,null,null,null,null,null,null,4432,3]
[null,null,null,null,null,null,null,null,null,null,null,4433,3]
[null,null,null,null,null,null,null,null,null,null,null,4434,6]
[null,null,null,null,null,null,null,null,null,null,null,4435,3]
[null,null,null,null,null,null,null,null,null,null,null,4440,6]
[null,null,null,null,null,null,null,null,null,null,null,4441,6]
[null,null,null,null,null,null,null,null,null,null,null,4444,6]
[null,null,null,null,null,null,null,null,null,null,null,4445,6]
[null,null,null,null,null,null,null,null,null,null,null,4446,6]
[null,null,null,null,null,null,null,null,null,null,null,4447,6]
[null,null,null,null,null,null,null,null,null,null,null,4450,6]
[null,null,null,null,null,null,null,null,null,null,null,4451,3]
[null,null,null,null,null,null,null,null,null,null,null,4455,6]
[null,null,null,null,null,null,null,null,null,null,null,4456,6]
[null,null,null,null,null,null,null,null,null,null,null,4461,6]
[null,null,null,null,null,null,null,null,null,null,null,4462,6]
[null,null,null,null,null,null,null,null,null,null,null,4463,6]
[null,null,null,null,null,null,null,null,null,null,null,4464,6]
[null,null,null,null,null,null,null,null,null,null,null,4465,6]
[null,null,null,null,null,null,null,null,null,null,null,4466,6]
[null,null,null,null,null,null,null,null,null,null,null,4467,6]
[null,null,null,null,null,null,null,null,null,null,null,4468,6]
[null,null,null,null,null,null,null,null,null,null,null,4471,6]
[null,null,null,null,null,null,null,null,null,null,null,4472,6]
[null,null,null,null,null,null,null,null,null,null,null,4474,6]
[null,null,null,null,null,null,null,null,null,null,null,4475,6]
[null,null,null,null,null,null,null,null,null,null,null,4481,3]
[null,null,null,null,null,null,null,null,null,null,null,4482,6]
[null,null,null,null,null,null,null,null,null,null,null,4483,6]
[null,null,null,null,null,null,null,null,null,null,null,4484,6]
[null,null,null,null,null,null,null,null,null,null,null,4485,6]
[null,null,null,null,null,null,null,null,null,null,null,4486,6]
[null,null,null,null,null,null,null,null,null,null,null,4487,6]
[null,null,null,null,null,null,null,null,null,null,null,4488,6]
[null,null,null,null,null,null,null,null,null,null,null,4491,6]
[null,null,null,null,null,null,null,null,null,null,null,4492,6]
[null,null,null,null,null,null,null,null,null,null,null,4493,6]
[null,null,null,null,null,null,null,null,null,null,null,4494,6]
[null,null,null,null,null,null,null,null,null,null,null,4495,6]
[null,null,null,null,null,null,null,null,null,null,null,4496,6]
[null,null,null,null,null,null,null,null,null,null,null,4501,6]
[null,null,null,null,null,null,null,null,null,null,null,4502,6]
[null,null,null,null,null,null,null,null,null,null,null,4503,6]
[null,null,null,null,null,null,null,null,null,null,null,4511,4]
[null,null,null,null,null,null,null,null,null,null,null,4515,6]
[null,null,null,null,null,null,null,null,null,null,null,4516,6]
[null,null,null,null,null,null,null,null,null,null,null,4517,6]
[null,null,null,null,null,null,null,null,null,null,null,4521,6]
[null,null,null,null,null,null,null,null,null,null,null,4522,6]
[null,null,null,null,null,null,null,null,null,null,null,4523,6]
[null,null,null,null,null,null,null,null,null,null,null,4524,6]
[null,null,null,null,null,null,null,null,null,null,null,4525,6]
[null,null,null,null,null,null,null,null,null,null,null,4531,6]
[null,null,null,null,null,null,null,null,null,null,null,4532,6]
[null,null,null,null,null,null,null,null,null,null,null,4533,6]
[null,null,null,null,null,null,null,null,null,null,null,4534,6]
[null,null,null,null,null,null,null,null,null,null,null,4535,6]
[null,null,null,null,null,null,null,null,null,null,null,4536,6]
[null,null,null,null,null,null,null,null,null,null,null,4537,4]
[null,null,null,null,null,null,null,null,null,null,null,4541,6]
[null,null,null,null,null,null,null,null,null,null,null,4542,6]
[null,null,null,null,null,null,null,null,null,null,null,4543,6]
[null,null,null,null,null,null,null,null,null,null,null,4544,6]
[null,null,null,null,null,null,null,null,null,null,null,4545,6]
[null,null,null,null,null,null,null,null,null,null,null,4546,6]
[null,null,null,null,null,null,null,null,null,null,null,4547,6]
[null,null,null,null,null,null,null,null,null,null,null,4551,3]
[null,null,null,null,null,null,null,null,null,null,null,4552,6]
[null,null,null,null,null,null,null,null,null,null,null,4553,6]
[null,null,null,null,null,null,null,null,null,null,null,4554,6]
[null,null,null,null,null,null,null,null,null,null,null,4555,6]
[null,null,null,null,null,null,null,null,null,null,null,4556,6]
[null,null,null,null,null,null,null,null,null,null,null,4557,6]
[null,null,null,null,null,null,null,null,null,null,null,4558,6]
[null,null,null,null,null,null,null,null,null,null,null,4561,6]
[null,null,null,null,null,null,null,null,null,null,null,4562,6]
[null,null,null,null,null,null,null,null,null,null,null,4563,6]
[null,null,null,null,null,null,null,null,null,null,null,4564,6]
[null,null,null,null,null,null,null,null,null,null,null,4565,6]
[null,null,null,null,null,null,null,null,null,null,null,4566,6]
[null,null,null,null,null,null,null,null,null,null,null,4567,6]
[null,null,null,null,null,null,null,null,null,null,null,4600,6]
[null,null,null,null,null,null,null,null,null,null,null,4611,6]
[null,null,null,null,null,null,null,null,null,null,null,4621,6]
[null,null,null,null,null,null,null,null,null,null,null,4622,6]
[null,null,null,null,null,null,null,null,null,null,null,4623,6]
[null,null,null,null,null,null,null,null,null,null,null,4624,6]
[null,null,null,null,null,null,null,null,null,null,null,4625,6]
[null,null,null,null,null,null,null,null,null,null,null,4627,6]
[null,null,null,null,null,null,null,null,null,null,null,4628,6]
[null,null,null,null,null,null,null,null,null,null,null,4631,6]
[null,null,null,null,null,null,null,null,null,null,null,4632,6]
[null,null,null,null,null,null,null,null,null,null,null,4633,6]
[null,null,null,null,null,null,null,null,null,null,null,4634,6]
[null,null,null,null,null,null,null,null,null,null,null,4635,6]
[null,null,null,null,null,null,null,null,null,null,null,4641,6]
[null,null,null,null,null,null,null,null,null,null,null,4642,6]
[null,null,null,null,null,null,null,null,null,null,null,4643,6]
[null,null,null,null,null,null,null,null,null,null,null,4644,6]
[null,null,null,null,null,null,null,null,null,null,null,4645,6]
[null,null,null,null,null,null,null,null,null,null,null,4646,6]
[null,null,null,null,null,null,null,null,null,null,null,4700,6]
[null,null,null,null,null,null,null,null,null,null,null,4702,6]
[null,null,null,null,null,null,null,null,null,null,null,4721,6]
[null,null,null,null,null,null,null,null,null,null,null,4722,6]
[null,null,null,null,null,null,null,null,null,null,null,4731,6]
[null,null,null,null,null,null,null,null,null,null,null,4732,6]
[null,null,null,null,null,null,null,null,null,null,null,4733,6]
[null,null,null,null,null,null,null,null,null,null,null,4734,6]
[null,null,null,null,null,null,null,null,null,null,null,4735,6]
[null,null,null,null,null,null,null,null,null,null,null,4737,6]
[null,null,null,null,null,null,null,null,null,null,null,4741,6]
[null,null,null,null,null,null,null,null,null,null,null,4742,6]
[null,null,null,null,null,null,null,null,null,null,null,4743,6]
[null,null,null,null,null,null,null,null,null,null,null,4745,6]
[null,null,null,null,null,null,null,null,null,null,null,4746,6]
[null,null,null,null,null,null,null,null,null,null,null,4751,6]
[null,null,null,null,null,null,null,null,null,null,null,4752,6]
[null,null,null,null,null,null,null,null,null,null,null,4753,6]
[null,null,null,null,null,null,null,null,null,null,null,4754,6]
[null,null,null,null,null,null,null,null,null,null,null,4755,6]
[null,null,null,null,null,null,null,null,null,null,null,4756,6]
[null,null,null,null,null,null,null,null,null,null,null,4761,6]
[null,null,null,null,null,null,null,null,null,null,null,4762,6]
[null,null,null,null,null,null,null,null,null,null,null,4763,6]
[null,null,null,null,null,null,null,null,null,null,null,4764,6]
[null,null,null,null,null,null,null,null,null,null,null,4765,6]
[null,null,null,null,null,null,null,null,null,null,null,4766,6]
[null,null,null,null,null,null,null,null,null,null,null,4767,6]
[null,null,null,null,null,null,null,null,null,null,null,4800,6]
[null,null,null,null,null,null,null,null,null,null,null,4803,6]
[null,null,null,null,null,null,null,null,null,null,null,4804,6]
[null,null,null,null,null,null,null,null,null,null,null,4811,6]
[null,null,null,null,null,null,null,null,null,null,null,4812,6]
[null,null,null,null,null,null,null,null,null,null,null,4813,6]
[null,null,null,null,null,null,null,null,null,null,null,4821,6]
[null,null,null,null,null,null,null,null,null,null,null,4822,6]
[null,null,null,null,null,null,null,null,null,null,null,4823,6]
[null,null,null,null,null,null,null,null,null,null,null,4824,6]
[null,null,null,null,null,null,null,null,null,null,null,4826,6]
[null,null,null,null,null,null,null,null,null,null,null,4831,6]
[null,null,null,null,null,null,null,null,null,null,null,4832,6]
[null,null,null,null,null,null,null,null,null,null,null,4833,6]
[null,null,null,null,null,null,null,null,null,null,null,4834,6]
[null,null,null,null,null,null,null,null,null,null,null,4835,6]
[null,null,null,null,null,null,null,null,null,null,null,4836,6]
[null,null,null,null,null,null,null,null,null,null,null,4841,6]
[null,null,null,null,null,null,null,null,null,null,null,4842,6]
[null,null,null,null,null,null,null,null,null,null,null,4843,6]
[null,null,null,null,null,null,null,null,null,null,null,4844,6]
[null,null,null,null,null,null,null,null,null,null,null,4845,6]
[null,null,null,null,null,null,null,null,null,null,null,4900,6]
[null,null,null,null,null,null,null,null,null,null,null,4901,6]
[null,null,null,null,null,null,null,null,null,null,null,4911,6]
[null,null,null,null,null,null,null,null,null,null,null,4912,6]
[null,null,null,null,null,null,null,null,null,null,null,4913,6]
[null,null,null,null,null,null,null,null,null,null,null,4914,6]
[null,null,null,null,null,null,null,null,null,null,null,4921,6]
[null,null,null,null,null,null,null,null,null,null,null,4922,6]
[null,null,null,null,null,null,null,null,null,null,null,4931,6]
[null,null,null,null,null,null,null,null,null,null,null,4932,6]
[null,null,null,null,null,null,null,null,null,null,null,4933,6]
[null,null,null,null,null,null,null,null,null,null,null,4934,6]
[null,null,null,null,null,null,null,null,null,null,null,4935,6]
[null,null,null,null,null,null,null,null,null,null,null,4936,6]
[null,null,null,null,null,null,null,null,null,null,null,4937,6]
[null,null,null,null,null,null,null,null,null,null,null,4941,6]
[null,null,null,null,null,null,null,null,null,null,null,4942,6]
[null,null,null,null,null,null,null,null,null,null,null,4943,6]
[null,null,null,null,null,null,null,null,null,null,null,4944,6]
[null,null,null,null,null,null,null,null,null,null,null,4945,6]
[null,null,null,null,null,null,null,null,null,null,null,4946,6]
[null,null,null,null,null,null,null,null,null,null,null,4947,6]
[null,null,null,null,null,null,null,null,null,null,null,4948,6]
[null,null,null,null,null,null,null,null,null,null,null,4951,6]
[null,null,null,null,null,null,null,null,null,null,null,4952,6]
[null,null,null,null,null,null,null,null,null,null,null,4953,6]
[null,null,null,null,null,null,null,null,null,null,null,4954,6]
[null,null,null,null,null,null,null,null,null,null,null,4955,6]
[null,null,null,null,null,null,null,null,null,null,null,4956,6]
[null,null,null,null,null,null,null,null,null,null,null,4961,6]
[null,null,null,null,null,null,null,null,null,null,null,4962,6]
[null,null,null,null,null,null,null,null,null,null,null,4963,6]
[null,null,null,null,null,null,null,null,null,null,null,4964,6]
[null,null,null,null,null,null,null,null,null,null,null,4965,6]
[null,null,null,null,null,null,null,null,null,null,null,4966,6]
[null,null,null,null,null,null,null,null,null,null,null,4967,6]
[null,null,null,null,null,null,null,null,null,null,null,4968,6]
[null,null,null,null,null,null,null,null,null,null,null,4969,6]
[null,null,null,null,null,null,null,null,null,null,null,4971,6]
[null,null,null,null,null,null,null,null,null,null,null,4972,6]
[null,null,null,null,null,null,null,null,null,null,null,4973,6]
[null,null,null,null,null,null,null,null,null,null,null,4974,6]
[null,null,null,null,null,null,null,null,null,null,null,4975,6]
[null,null,null,null,null,null,null,null,null,null,null,4976,6]
[null,null,null,null,null,null,null,null,null,null,null,4977,6]
[null,null,null,null,null,null,null,null,null,null,null,5000,4]
[null,null,null,null,null,null,null,null,null,null,null,5001,4]
[null,null,null,null,null,null,null,null,null,null,null,5002,4]
[null,null,null,null,null,null,null,null,null,null,null,5004,4]
[null,null,null,null,null,null,null,null,null,null,null,5005,4]
[null,null,null,null,null,null,null,null,null,null,null,5006,4]
[null,null,null,null,null,null,null,null,null,null,null,5007,4]
[null,null,null,null,null,null,null,null,null,null,null,5008,4]
[null,null,null,null,null,null,null,null,null,null,null,5009,4]
[null,null,null,null,null,null,null,null,null,null,null,5051,6]
[null,null,null,null,null,null,null,null,null,null,null,5052,6]
[null,null,null,null,null,null,null,null,null,null,null,5053,6]
[null,null,null,null,null,null,null,null,null,null,null,5054,6]
[null,null,null,null,null,null,null,null,null,null,null,5055,6]
[null,null,null,null,null,null,null,null,null,null,null,5061,6]
[null,null,null,null,null,null,null,null,null,null,null,5062,6]
[null,null,null,null,null,null,null,null,null,null,null,5063,6]
[null,null,null,null,null,null,null,null,null,null,null,5064,6]
[null,null,null,null,null,null,null,null,null,null,null,5065,6]
[null,null,null,null,null,null,null,null,null,null,null,5071,6]
[null,null,null,null,null,null,null,null,null,null,null,5072,6]
[null,null,null,null,null,null,null,null,null,null,null,5081,6]
[null,null,null,null,null,null,null,null,null,null,null,5082,6]
[null,null,null,null,null,null,null,null,null,null,null,5083,6]
[null,null,null,null,null,null,null,null,null,null,null,5084,6]
[null,null,null,null,null,null,null,null,null,null,null,5085,6]
[null,null,null,null,null,null,null,null,null,null,null,5091,6]
[null,null,null,null,null,null,null,null,null,null,null,5092,6]
[null,null,null,null,null,null,null,null,null,null,null,5093,6]
[null,null,null,null,null,null,null,null,null,null,null,5094,6]
[null,null,null,null,null,null,null,null,null,null,null,5095,6]
[null,null,null,null,null,null,null,null,null,null,null,5100,6]
[null,null,null,null,null,null,null,null,null,null,null,5111,6]
[null,null,null,null,null,null,null,null,null,null,null,5121,6]
[null,null,null,null,null,null,null,null,null,null,null,5122,6]
[null,null,null,null,null,null,null,null,null,null,null,5123,6]
[null,null,null,null,null,null,null,null,null,null,null,5124,6]
[null,null,null,null,null,null,null,null,null,null,null,5125,6]
[null,null,null,null,null,null,null,null,null,null,null,5126,6]
[null,null,null,null,null,null,null,null,null,null,null,5130,6]
[null,null,null,null,null,null,null,null,null,null,null,5135,6]
[null,null,null,null,null,null,null,null,null,null,null,5136,6]
[null,null,null,null,null,null,null,null,null,null,null,5137,6]
[null,null,null,null,null,null,null,null,null,null,null,5141,6]
[null,null,null,null,null,null,null,null,null,null,null,5142,6]
[null,null,null,null,null,null,null,null,null,null,null,5143,6]
[null,null,null,null,null,null,null,null,null,null,null,5144,6]
[null,null,null,null,null,null,null,null,null,null,null,5151,6]
[null,null,null,null,null,null,null,null,null,null,null,5152,6]
[null,null,null,null,null,null,null,null,null,null,null,5200,5]
[null,null,null,null,null,null,null,null,null,null,null,5211,5]
[null,null,null,null,null,null,null,null,null,null,null,5212,5]
[null,null,null,null,null,null,null,null,null,null,null,5213,6]
[null,null,null,null,null,null,null,null,null,null,null,5222,6]
[null,null,null,null,null,null,null,null,null,null,null,5231,6]
[null,null,null,null,null,null,null,null,null,null,null,5232,6]
[null,null,null,null,null,null,null,null,null,null,null,5233,6]
[null,null,null,null,null,null,null,null,null,null,null,5234,6]
[null,null,null,null,null,null,null,null,null,null,null,5235,6]
[null,null,null,null,null,null,null,null,null,null,null,5241,6]
[null,null,null,null,null,null,null,null,null,null,null,5243,6]
[null,null,null,null,null,null,null,null,null,null,null,5244,6]
[null,null,null,null,null,null,null,null,null,null,null,5300,6]
[null,null,null,null,null,null,null,null,null,null,null,5301,6]
[null,null,null,null,null,null,null,null,null,null,null,5308,6]
[null,null,null,null,null,null,null,null,null,null,null,5309,6]
[null,null,null,null,null,null,null,null,null,null,null,5310,6]
[null,null,null,null,null,null,null,null,null,null,null,5321,6]
[null,null,null,null,null,null,null,null,null,null,null,5322,6]
[null,null,null,null,null,null,null,null,null,null,null,5323,6]
[null,null,null,null,null,null,null,null,null,null,null,5324,6]
[null,null,null,null,null,null,null,null,null,null,null,5331,6]
[null,null,null,null,null,null,null,null,null,null,null,5340,6]
[null,null,null,null,null,null,null,null,null,null,null,5349,6]
[null,null,null,null,null,null,null,null,null,null,null,5350,6]
[null,null,null,null,null,null,null,null,null,null,null,5358,6]
[null,null,null,null,null,null,null,null,null,null,null,5359,6]
[null,null,null,null,null,null,null,null,null,null,null,5361,6]
[null,null,null,null,null,null,null,null,null,null,null,5362,6]
[null,null,null,null,null,null,null,null,null,null,null,5363,6]
[null,null,null,null,null,null,null,null,null,null,null,5400,6]
[null,null,null,null,null,null,null,null,null,null,null,5401,6]
[null,null,null,null,null,null,null,null,null,null,null,5411,6]
[null,null,null,null,null,null,null,null,null,null,null,5412,6]
[null,null,null,null,null,null,null,null,null,null,null,5420,6]
[null,null,null,null,null,null,null,null,null,null,null,5421,6]
[null,null,null,null,null,null,null,null,null,null,null,5430,6]
[null,null,null,null,null,null,null,null,null,null,null,5431,6]
[null,null,null,null,null,null,null,null,null,null,null,5435,6]
[null,null,null,null,null,null,null,null,null,null,null,5440,6]
[null,null,null,null,null,null,null,null,null,null,null,5449,6]
[null,null,null,null,null,null,null,null,null,null,null,5451,6]
[null,null,null,null,null,null,null,null,null,null,null,5452,6]
[null,null,null,null,null,null,null,null,null,null,null,5453,6]
[null,null,null,null,null,null,null,null,null,null,null,5461,6]
[null,null,null,null,null,null,null,null,null,null,null,5462,6]
[null,null,null,null,null,null,null,null,null,null,null,5463,6]
[null,null,null,null,null,null,null,null,null,null,null,5464,6]
[null,null,null,null,null,null,null,null,null,null,null,5465,6]
[null,null,null,null,null,null,null,null,null,null,null,5471,6]
[null,null,null,null,null,null,null,null,null,null,null,5472,6]
[null,null,null,null,null,null,null,null,null,null,null,5473,6]
[null,null,null,null,null,null,null,null,null,null,null,5474,6]
[null,null,null,null,null,null,null,null,null,null,null,5475,6]
[null,null,null,null,null,null,null,null,null,null,null,5476,6]
[null,null,null,null,null,null,null,null,null,null,null,5500,5]
[null,null,null,null,null,null,null,null,null,null,null,5501,5]
[null,null,null,null,null,null,null,null,null,null,null,5502,5]
[null,null,null,null,null,null,null,null,null,null,null,5510,5]
[null,null,null,null,null,null,null,null,null,null,null,5515,5]
[null,null,null,null,null,null,null,null,null,null,null,5516,5]
[null,null,null,null,null,null,null,null,null,null,null,5520,5]
[null,null,null,null,null,null,null,null,null,null,null,5525,5]
[null,null,null,null,null,null,null,null,null,null,null,5526,5]
[null,null,null,null,null,null,null,null,null,null,null,5527,5]
[null,null,null,null,null,null,null,null,null,null,null,5530,5]
[null,null,null,null,null,null,null,null,null,null,null,5534,5]
[null,null,null,null,null,null,null,null,null,null,null,5536,5]
[null,null,null,null,null,null,null,null,null,null,null,5537,5]
[null,null,null,null,null,null,null,null,null,null,null,5538,5]
[null,null,null,null,null,null,null,null,null,null,null,5539,5]
[null,null,null,null,null,null,null,null,null,null,null,5540,5]
[null,null,null,null,null,null,null,null,null,null,null,5541,5]
[null,null,null,null,null,null,null,null,null,null,null,5551,5]
[null,null,null,null,null,null,null,null,null,null,null,5552,5]
[null,null,null,null,null,null,null,null,null,null,null,5553,5]
[null,null,null,null,null,null,null,null,null,null,null,5555,5]
[null,null,null,null,null,null,null,null,null,null,null,5556,5]
[null,null,null,null,null,null,null,null,null,null,null,5561,5]
[null,null,null,null,null,null,null,null,null,null,null,5600,5]
[null,null,null,null,null,null,null,null,null,null,null,5601,5]
[null,null,null,null,null,null,null,null,null,null,null,5609,5]
[null,null,null,null,null,null,null,null,null,null,null,5621,5]
[null,null,null,null,null,null,null,null,null,null,null,5622,5]
[null,null,null,null,null,null,null,null,null,null,null,5623,5]
[null,null,null,null,null,null,null,null,null,null,null,5624,5]
[null,null,null,null,null,null,null,null,null,null,null,5630,5]
[null,null,null,null,null,null,null,null,null,null,null,5631,5]
[null,null,null,null,null,null,null,null,null,null,null,5641,5]
[null,null,null,null,null,null,null,null,null,null,null,5643,5]
[null,null,null,null,null,null,null,null,null,null,null,5650,5]
[null,null,null,null,null,null,null,null,null,null,null,5661,5]
[null,null,null,null,null,null,null,null,null,null,null,5662,5]
[null,null,null,null,null,null,null,null,null,null,null,5663,5]
[null,null,null,null,null,null,null,null,null,null,null,5664,5]
[null,null,null,null,null,null,null,null,null,null,null,5665,5]
[null,null,null,null,null,null,null,null,null,null,null,5666,5]
[null,null,null,null,null,null,null,null,null,null,null,5667,5]
[null,null,null,null,null,null,null,null,null,null,null,5668,5]
[null,null,null,null,null,null,null,null,null,null,null,5671,5]
[null,null,null,null,null,null,null,null,null,null,null,5672,5]
[null,null,null,null,null,null,null,null,null,null,null,5673,5]
[null,null,null,null,null,null,null,null,null,null,null,5674,5]
[null,null,null,null,null,null,null,null,null,null,null,5675,5]
[null,null,null,null,null,null,null,null,null,null,null,5700,5]
[null,null,null,null,null,null,null,null,null,null,null,5701,5]
[null,null,null,null,null,null,null,null,null,null,null,5702,5]
[null,null,null,null,null,null,null,null,null,null,null,5703,5]
[null,null,null,null,null,null,null,null,null,null,null,5711,5]
[null,null,null,null,null,null,null,null,null,null,null,5712,5]
[null,null,null,null,null,null,null,null,null,null,null,5720,5]
[null,null,null,null,null,null,null,null,null,null,null,5721,5]
[null,null,null,null,null,null,null,null,null,null,null,5722,5]
[null,null,null,null,null,null,null,null,null,null,null,5725,5]
[null,null,null,null,null,null,null,null,null,null,null,5726,5]
[null,null,null,null,null,null,null,null,null,null,null,5727,5]
[null,null,null,null,null,null,null,null,null,null,null,5731,5]
[null,null,null,null,null,null,null,null,null,null,null,5732,5]
[null,null,null,null,null,null,null,null,null,null,null,5734,5]
[null,null,null,null,null,null,null,null,null,null,null,5741,5]
[null,null,null,null,null,null,null,null,null,null,null,5742,5]
[null,null,null,null,null,null,null,null,null,null,null,5743,5]
[null,null,null,null,null,null,null,null,null,null,null,5744,5]
[null,null,null,null,null,null,null,null,null,null,null,5745,5]
[null,null,null,null,null,null,null,null,null,null,null,5746,5]
[null,null,null,null,null,null,null,null,null,null,null,5747,5]
[null,null,null,null,null,null,null,null,null,null,null,5751,5]
[null,null,null,null,null,null,null,null,null,null,null,5752,5]
[null,null,null,null,null,null,null,null,null,null,null,5800,5]
[null,null,null,null,null,null,null,null,null,null,null,5811,5]
[null,null,null,null,null,null,null,null,null,null,null,5820,5]
[null,null,null,null,null,null,null,null,null,null,null,5830,5]
[null,null,null,null,null,null,null,null,null,null,null,5836,5]
[null,null,null,null,null,null,null,null,null,null,null,5837,5]
[null,null,null,null,null,null,null,null,null,null,null,5838,5]
[null,null,null,null,null,null,null,null,null,null,null,5900,5]
[null,null,null,null,null,null,null,null,null,null,null,5901,5]
[null,null,null,null,null,null,null,null,null,null,null,5902,5]
[null,null,null,null,null,null,null,null,null,null,null,5903,5]
[null,null,null,null,null,null,null,null,null,null,null,5904,5]
[null,null,null,null,null,null,null,null,null,null,null,5905,5]
[null,null,null,null,null,null,null,null,null,null,null,5908,5]
[null,null,null,null,null,null,null,null,null,null,null,5909,5]
[null,null,null,null,null,null,null,null,null,null,null,5919,5]
[null,null,null,null,null,null,null,null,null,null,null,5920,5]
[null,null,null,null,null,null,null,null,null,null,null,5925,5]
[null,null,null,null,null,null,null,null,null,null,null,5931,5]
[null,null,null,null,null,null,null,null,null,null,null,5932,5]
[null,null,null,null,null,null,null,null,null,null,null,5940,5]
[null,null,null,null,null,null,null,null,null,null,null,5945,5]
[null,null,null,null,null,null,null,null,null,null,null,5946,5]
[null,null,null,null,null,null,null,null,null,null,null,5948,5]
[null,null,null,null,null,null,null,null,null,null,null,5949,5]
[null,null,null,null,null,null,null,null,null,null,null,6000,5]
[null,null,null,null,null,null,null,null,null,null,null,6001,5]
[null,null,null,null,null,null,null,null,null,null,null,6002,5]
[null,null,null,null,null,null,null,null,null,null,null,6004,5]
[null,null,null,null,null,null,null,null,null,null,null,6008,5]
[null,null,null,null,null,null,null,null,null,null,null,6010,5]
[null,null,null,null,null,null,null,null,null,null,null,6031,6]
[null,null,null,null,null,null,null,null,null,null,null,6032,5]
[null,null,null,null,null,null,null,null,null,null,null,6033,6]
[null,null,null,null,null,null,null,null,null,null,null,6034,5]
[null,null,null,null,null,null,null,null,null,null,null,6035,5]
[null,null,null,null,null,null,null,null,null,null,null,6041,6]
[null,null,null,null,null,null,null,null,null,null,null,6042,6]
[null,null,null,null,null,null,null,null,null,null,null,6043,6]
[null,null,null,null,null,null,null,null,null,null,null,6044,5]
[null,null,null,null,null,null,null,null,null,null,null,6045,6]
[null,null,null,null,null,null,null,null,null,null,null,6050,6]
[null,null,null,null,null,null,null,null,null,null,null,6055,6]
[null,null,null,null,null,null,null,null,null,null,null,6060,6]
[null,null,null,null,null,null,null,null,null,null,null,6061,6]
[null,null,null,null,null,null,null,null,null,null,null,6062,6]
[null,null,null,null,null,null,null,null,null,null,null,6064,6]
[null,null,null,null,null,null,null,null,null,null,null,6065,6]
[null,null,null,null,null,null,null,null,null,null,null,6066,6]
[null,null,null,null,null,null,null,null,null,null,null,6067,6]
[null,null,null,null,null,null,null,null,null,null,null,6070,6]
[null,null,null,null,null,null,null,null,null,null,null,6075,6]
[null,null,null,null,null,null,null,null,null,null,null,6076,6]
[null,null,null,null,null,null,null,null,null,null,null,6077,6]
[null,null,null,null,null,null,null,null,null,null,null,6078,6]
[null,null,null,null,null,null,null,null,null,null,null,6080,6]
[null,null,null,null,null,null,null,null,null,null,null,6085,6]
[null,null,null,null,null,null,null,null,null,null,null,6086,6]
[null,null,null,null,null,null,null,null,null,null,null,6087,6]
[null,null,null,null,null,null,null,null,null,null,null,6088,6]
[null,null,null,null,null,null,null,null,null,null,null,6090,5]
[null,null,null,null,null,null,null,null,null,null,null,6095,5]
[null,null,null,null,null,null,null,null,null,null,null,6096,5]
[null,null,null,null,null,null,null,null,null,null,null,6097,6]
[null,null,null,null,null,null,null,null,null,null,null,6098,5]
[null,null,null,null,null,null,null,null,null,null,null,6100,5]
[null,null,null,null,null,null,null,null,null,null,null,6101,5]
[null,null,null,null,null,null,null,null,null,null,null,6111,6]
[null,null,null,null,null,null,null,null,null,null,null,6112,6]
[null,null,null,null,null,null,null,null,null,null,null,6113,6]
[null,null,null,null,null,null,null,null,null,null,null,6114,6]
[null,null,null,null,null,null,null,null,null,null,null,6115,6]
[null,null,null,null,null,null,null,null,null,null,null,6116,6]
[null,null,null,null,null,null,null,null,null,null,null,6120,6]
[null,null,null,null,null,null,null,null,null,null,null,6131,6]
[null,null,null,null,null,null,null,null,null,null,null,6132,6]
[null,null,null,null,null,null,null,null,null,null,null,6133,6]
[null,null,null,null,null,null,null,null,null,null,null,6134,6]
[null,null,null,null,null,null,null,null,null,null,null,6135,6]
[null,null,null,null,null,null,null,null,null,null,null,6136,6]
[null,null,null,null,null,null,null,null,null,null,null,6200,6]
[null,null,null,null,null,null,null,null,null,null,null,6201,6]
[null,null,null,null,null,null,null,null,null,null,null,6211,6]
[null,null,null,null,null,null,null,null,null,null,null,6221,6]
[null,null,null,null,null,null,null,null,null,null,null,6222,6]
[null,null,null,null,null,null,null,null,null,null,null,6223,6]
[null,null,null,null,null,null,null,null,null,null,null,6224,6]
[null,null,null,null,null,null,null,null,null,null,null,6230,6]
[null,null,null,null,null,null,null,null,null,null,null,6235,6]
[null,null,null,null,null,null,null,null,null,null,null,6236,6]
[null,null,null,null,null,null,null,null,null,null,null,6237,6]
[null,null,null,null,null,null,null,null,null,null,null,6238,6]
[null,null,null,null,null,null,null,null,null,null,null,6239,6]
[null,null,null,null,null,null,null,null,null,null,null,6300,6]
[null,null,null,null,null,null,null,null,null,null,null,6301,6]
[null,null,null,null,null,null,null,null,null,null,null,6311,6]
[null,null,null,null,null,null,null,null,null,null,null,6320,6]
[null,null,null,null,null,null,null,null,null,null,null,6321,6]
[null,null,null,null,null,null,null,null,null,null,null,6323,6]
[null,null,null,null,null,null,null,null,null,null,null,6325,6]
[null,null,null,null,null,null,null,null,null,null,null,6326,6]
[null,null,null,null,null,null,null,null,null,null,null,6327,6]
[null,null,null,null,null,null,null,null,null,null,null,6328,6]
[null,null,null,null,null,null,null,null,null,null,null,6329,6]
[null,null,null,null,null,null,null,null,null,null,null,6331,6]
[null,null,null,null,null,null,null,null,null,null,null,6332,6]
[null,null,null,null,null,null,null,null,null,null,null,6333,6]
[null,null,null,null,null,null,null,null,null,null,null,6334,6]
[null,null,null,null,null,null,null,null,null,null,null,6335,6]
[null,null,null,null,null,null,null,null,null,null,null,6336,6]
[null,null,null,null,null,null,null,null,null,null,null,6337,6]
[null,null,null,null,null,null,null,null,null,null,null,6341,6]
[null,null,null,null,null,null,null,null,null,null,null,6342,6]
[null,null,null,null,null,null,null,null,null,null,null,6343,6]
[null,null,null,null,null,null,null,null,null,null,null,6344,6]
[null,null,null,null,null,null,null,null,null,null,null,6345,6]
[null,null,null,null,null,null,null,null,null,null,null,6346,5]
[null,null,null,null,null,null,null,null,null,null,null,6347,5]
[null,null,null,null,null,null,null,null,null,null,null,6348,6]
[null,null,null,null,null,null,null,null,null,null,null,6351,6]
[null,null,null,null,null,null,null,null,null,null,null,6352,6]
[null,null,null,null,null,null,null,null,null,null,null,6353,6]
[null,null,null,null,null,null,null,null,null,null,null,6400,6]
[null,null,null,null,null,null,null,null,null,null,null,6401,6]
[null,null,null,null,null,null,null,null,null,null,null,6411,6]
[null,null,null,null,null,null,null,null,null,null,null,6412,6]
[null,null,null,null,null,null,null,null,null,null,null,6413,6]
[null,null,null,null,null,null,null,null,null,null,null,6414,6]
[null,null,null,null,null,null,null,null,null,null,null,6421,6]
[null,null,null,null,null,null,null,null,null,null,null,6422,6]
[null,null,null,null,null,null,null,null,null,null,null,6423,6]
[null,null,null,null,null,null,null,null,null,null,null,6424,6]
[null,null,null,null,null,null,null,null,null,null,null,6425,6]
[null,null,null,null,null,null,null,null,null,null,null,6430,6]
[null,null,null,null,null,null,null,null,null,null,null,6435,6]
[null,null,null,null,null,null,null,null,null,null,null,6440,6]
[null,null,null,null,null,null,null,null,null,null,null,6444,6]
[null,null,null,null,null,null,null,null,null,null,null,6445,6]
[null,null,null,null,null,null,null,null,null,null,null,6446,6]
[null,null,null,null,null,null,null,null,null,null,null,6447,6]
[null,null,null,null,null,null,null,null,null,null,null,6448,6]
[null,null,null,null,null,null,null,null,null,null,null,6449,6]
[null,null,null,null,null,null,null,null,null,null,null,6451,6]
[null,null,null,null,null,null,null,null,null,null,null,6452,6]
[null,null,null,null,null,null,null,null,null,null,null,6453,6]
[null,null,null,null,null,null,null,null,null,null,null,6454,6]
[null,null,null,null,null,null,null,null,null,null,null,6455,6]
[null,null,null,null,null,null,null,null,null,null,null,6456,6]
[null,null,null,null,null,null,null,null,null,null,null,6500,5]
[null,null,null,null,null,null,null,null,null,null,null,6501,5]
[null,null,null,null,null,null,null,null,null,null,null,6503,5]
[null,null,null,null,null,null,null,null,null,null,null,6511,6]
[null,null,null,null,null,null,null,null,null,null,null,6512,5]
[null,null,null,null,null,null,null,null,null,null,null,6513,6]
[null,null,null,null,null,null,null,null,null,null,null,6521,5]
[null,null,null,null,null,null,null,null,null,null,null,6522,6]
[null,null,null,null,null,null,null,null,null,null,null,6523,6]
[null,null,null,null,null,null,null,null,null,null,null,6524,6]
[null,null,null,null,null,null,null,null,null,null,null,6525,6]
[null,null,null,null,null,null,null,null,null,null,null,6527,6]
[null,null,null,null,null,null,null,null,null,null,null,6528,5]
[null,null,null,null,null,null,null,null,null,null,null,6600,6]
[null,null,null,null,null,null,null,null,null,null,null,6601,6]
[null,null,null,null,null,null,null,null,null,null,null,6602,6]
[null,null,null,null,null,null,null,null,null,null,null,6611,6]
[null,null,null,null,null,null,null,null,null,null,null,6612,6]
[null,null,null,null,null,null,null,null,null,null,null,6613,6]
[null,null,null,null,null,null,null,null,null,null,null,6621,6]
[null,null,null,null,null,null,null,null,null,null,null,6622,6]
[null,null,null,null,null,null,null,null,null,null,null,6623,6]
[null,null,null,null,null,null,null,null,null,null,null,6624,6]
[null,null,null,null,null,null,null,null,null,null,null,6625,6]
[null,null,null,null,null,null,null,null,null,null,null,6630,6]
[null,null,null,null,null,null,null,null,null,null,null,6635,6]
[null,null,null,null,null,null,null,null,null,null,null,6636,6]
[null,null,null,null,null,null,null,null,null,null,null,6640,6]
[null,null,null,null,null,null,null,null,null,null,null,6641,6]
[null,null,null,null,null,null,null,null,null,null,null,6645,6]
[null,null,null,null,null,null,null,null,null,null,null,6646,6]
[null,null,null,null,null,null,null,null,null,null,null,6647,6]
[null,null,null,null,null,null,null,null,null,null,null,6648,6]
[null,null,null,null,null,null,null,null,null,null,null,6700,4]
[null,null,null,null,null,null,null,null,null,null,null,6701,4]
[null,null,null,null,null,null,null,null,null,null,null,6706,4]
[null,null,null,null,null,null,null,null,null,null,null,6710,4]
[null,null,null,null,null,null,null,null,null,null,null,6713,4]
[null,null,null,null,null,null,null,null,null,null,null,6720,4]
[null,null,null,null,null,null,null,null,null,null,null,6721,4]
[null,null,null,null,null,null,null,null,null,null,null,6722,4]
[null,null,null,null,null,null,null,null,null,null,null,6723,4]
[null,null,null,null,null,null,null,null,null,null,null,6724,4]
[null,null,null,null,null,null,null,null,null,null,null,6725,4]
[null,null,null,null,null,null,null,null,null,null,null,6726,4]
[null,null,null,null,null,null,null,null,null,null,null,6727,4]
[null,null,null,null,null,null,null,null,null,null,null,6728,4]
[null,null,null,null,null,null,null,null,null,null,null,6729,4]
[null,null,null,null,null,null,null,null,null,null,null,6750,6]
[null,null,null,null,null,null,null,null,null,null,null,6753,4]
[null,null,null,null,null,null,null,null,null,null,null,6754,6]
[null,null,null,null,null,null,null,null,null,null,null,6755,6]
[null,null,null,null,null,null,null,null,null,null,null,6756,6]
[null,null,null,null,null,null,null,null,null,null,null,6757,4]
[null,null,null,null,null,null,null,null,null,null,null,6758,6]
[null,null,null,null,null,null,null,null,null,null,null,6760,6]
[null,null,null,null,null,null,null,null,null,null,null,6762,6]
[null,null,null,null,null,null,null,null,null,null,null,6763,6]
[null,null,null,null,null,null,null,null,null,null,null,6764,6]
[null,null,null,null,null,null,null,null,null,null,null,6765,6]
[null,null,null,null,null,null,null,null,null,null,null,6766,6]
[null,null,null,null,null,null,null,null,null,null,null,6767,6]
[null,null,null,null,null,null,null,null,null,null,null,6768,6]
[null,null,null,null,null,null,null,null,null,null,null,6769,6]
[null,null,null,null,null,null,null,null,null,null,null,6771,4]
[null,null,null,null,null,null,null,null,null,null,null,6772,6]
[null,null,null,null,null,null,null,null,null,null,null,6773,6]
[null,null,null,null,null,null,null,null,null,null,null,6774,6]
[null,null,null,null,null,null,null,null,null,null,null,6775,6]
[null,null,null,null,null,null,null,null,null,null,null,6781,6]
[null,null,null,null,null,null,null,null,null,null,null,6782,6]
[null,null,null,null,null,null,null,null,null,null,null,6783,6]
[null,null,null,null,null,null,null,null,null,null,null,6784,6]
[null,null,null,null,null,null,null,null,null,null,null,6785,6]
[null,null,null,null,null,null,null,null,null,null,null,6786,6]
[null,null,null,null,null,null,null,null,null,null,null,6787,6]
[null,null,null,null,null,null,null,null,null,null,null,6791,4]
[null,null,null,null,null,null,null,null,null,null,null,6792,6]
[null,null,null,null,null,null,null,null,null,null,null,6793,6]
[null,null,null,null,null,null,null,null,null,null,null,6794,6]
[null,null,null,null,null,null,null,null,null,null,null,6795,6]
[null,null,null,null,null,null,null,null,null,null,null,6800,6]
[null,null,null,null,null,null,null,null,null,null,null,6801,6]
[null,null,null,null,null,null,null,null,null,null,null,6803,6]
[null,null,null,null,null,null,null,null,null,null,null,6805,6]
[null,null,null,null,null,null,null,null,null,null,null,6806,6]
[null,null,null,null,null,null,null,null,null,null,null,6808,6]
[null,null,null,null,null,null,null,null,null,null,null,6821,6]
[null,null,null,null,null,null,null,null,null,null,null,6900,6]
[null,null,null,null,null,null,null,null,null,null,null,6903,6]
[null,null,null,null,null,null,null,null,null,null,null,6911,6]
[null,null,null,null,null,null,null,null,null,null,null,6912,6]
[null,null,null,null,null,null,null,null,null,null,null,6913,6]
[null,null,null,null,null,null,null,null,null,null,null,6914,6]
[null,null,null,null,null,null,null,null,null,null,null,6915,6]
[null,null,null,null,null,null,null,null,null,null,null,6916,6]
[null,null,null,null,null,null,null,null,null,null,null,6917,6]
[null,null,null,null,null,null,null,null,null,null,null,6921,6]
[null,null,null,null,null,null,null,null,null,null,null,6922,6]
[null,null,null,null,null,null,null,null,null,null,null,6923,6]
[null,null,null,null,null,null,null,null,null,null,null,6931,6]
[null,null,null,null,null,null,null,null,null,null,null,6932,6]
[null,null,null,null,null,null,null,null,null,null,null,6933,6]
[null,null,null,null,null,null,null,null,null,null,null,7000,6]
[null,null,null,null,null,null,null,null,null,null,null,7001,6]
[null,null,null,null,null,null,null,null,null,null,null,7003,6]
[null,null,null,null,null,null,null,null,null,null,null,7011,6]
[null,null,null,null,null,null,null,null,null,null,null,7012,6]
[null,null,null,null,null,null,null,null,null,null,null,7013,6]
[null,null,null,null,null,null,null,null,null,null,null,7014,6]
[null,null,null,null,null,null,null,null,null,null,null,7015,6]
[null,null,null,null,null,null,null,null,null,null,null,7016,6]
[null,null,null,null,null,null,null,null,null,null,null,7017,6]
[null,null,null,null,null,null,null,null,null,null,null,7018,6]
[null,null,null,null,null,null,null,null,null,null,null,7019,6]
[null,null,null,null,null,null,null,null,null,null,null,7020,6]
[null,null,null,null,null,null,null,null,null,null,null,7025,6]
[null,null,null,null,null,null,null,null,null,null,null,7026,6]
[null,null,null,null,null,null,null,null,null,null,null,7027,5]
[null,null,null,null,null,null,null,null,null,null,null,7030,5]
[null,null,null,null,null,null,null,null,null,null,null,7031,5]
[null,null,null,null,null,null,null,null,null,null,null,7032,5]
[null,null,null,null,null,null,null,null,null,null,null,7038,6]
[null,null,null,null,null,null,null,null,null,null,null,7039,6]
[null,null,null,null,null,null,null,null,null,null,null,7041,6]
[null,null,null,null,null,null,null,null,null,null,null,7042,6]
[null,null,null,null,null,null,null,null,null,null,null,7043,6]
[null,null,null,null,null,null,null,null,null,null,null,7044,6]
[null,null,null,null,null,null,null,null,null,null,null,7045,6]
[null,null,null,null,null,null,null,null,null,null,null,7047,6]
[null,null,null,null,null,null,null,null,null,null,null,7051,6]
[null,null,null,null,null,null,null,null,null,null,null,7052,6]
[null,null,null,null,null,null,null,null,null,null,null,7054,6]
[null,null,null,null,null,null,null,null,null,null,null,7055,6]
[null,null,null,null,null,null,null,null,null,null,null,7056,6]
[null,null,null,null,null,null,null,null,null,null,null,7057,6]
[null,null,null,null,null,null,null,null,null,null,null,7061,6]
[null,null,null,null,null,null,null,null,null,null,null,7062,6]
[null,null,null,null,null,null,null,null,null,null,null,7063,6]
[null,null,null,null,null,null,null,null,null,null,null,7064,6]
[null,null,null,null,null,null,null,null,null,null,null,7065,6]
[null,null,null,null,null,null,null,null,null,null,null,7066,6]
[null,null,null,null,null,null,null,null,null,null,null,7067,6]
[null,null,null,null,null,null,null,null,null,null,null,7068,6]
[null,null,null,null,null,null,null,null,null,null,null,7071,6]
[null,null,null,null,null,null,null,null,null,null,null,7072,6]
[null,null,null,null,null,null,null,null,null,null,null,7081,6]
[null,null,null,null,null,null,null,null,null,null,null,7082,6]
[null,null,null,null,null,null,null,null,null,null,null,7083,6]
[null,null,null,null,null,null,null,null,null,null,null,7084,6]
[null,null,null,null,null,null,null,null,null,null,null,7085,6]
[null,null,null,null,null,null,null,null,null,null,null,7086,6]
[null,null,null,null,null,null,null,null,null,null,null,7087,6]
[null,null,null,null,null,null,null,null,null,null,null,7090,6]
[null,null,null,null,null,null,null,null,null,null,null,7091,6]
[null,null,null,null,null,null,null,null,null,null,null,7092,6]
[null,null,null,null,null,null,null,null,null,null,null,7093,6]
[null,null,null,null,null,null,null,null,null,null,null,7094,6]
[null,null,null,null,null,null,null,null,null,null,null,7095,6]
[null,null,null,null,null,null,null,null,null,null,null,7097,6]
[null,null,null,null,null,null,null,null,null,null,null,7098,6]
[null,null,null,null,null,null,null,null,null,null,null,7099,6]
[null,null,null,null,null,null,null,null,null,null,null,7100,5]
[null,null,null,null,null,null,null,null,null,null,null,7101,5]
[null,null,null,null,null,null,null,null,null,null,null,7103,5]
[null,null,null,null,null,null,null,null,null,null,null,7121,6]
[null,null,null,null,null,null,null,null,null,null,null,7122,6]
[null,null,null,null,null,null,null,null,null,null,null,7130,5]
[null,null,null,null,null,null,null,null,null,null,null,7131,5]
[null,null,null,null,null,null,null,null,null,null,null,7132,6]
[null,null,null,null,null,null,null,null,null,null,null,7133,6]
[null,null,null,null,null,null,null,null,null,null,null,7134,6]
[null,null,null,null,null,null,null,null,null,null,null,7135,6]
[null,null,null,null,null,null,null,null,null,null,null,7136,6]
[null,null,null,null,null,null,null,null,null,null,null,7140,6]
[null,null,null,null,null,null,null,null,null,null,null,7142,6]
[null,null,null,null,null,null,null,null,null,null,null,7143,6]
[null,null,null,null,null,null,null,null,null,null,null,7144,6]
[null,null,null,null,null,null,null,null,null,null,null,7145,6]
[null,null,null,null,null,null,null,null,null,null,null,7146,6]
[null,null,null,null,null,null,null,null,null,null,null,7147,6]
[null,null,null,null,null,null,null,null,null,null,null,7148,6]
[null,null,null,null,null,null,null,null,null,null,null,7149,6]
[null,null,null,null,null,null,null,null,null,null,null,7150,6]
[null,null,null,null,null,null,null,null,null,null,null,7151,6]
[null,null,null,null,null,null,null,null,null,null,null,7153,6]
[null,null,null,null,null,null,null,null,null,null,null,7158,6]
[null,null,null,null,null,null,null,null,null,null,null,7159,6]
[null,null,null,null,null,null,null,null,null,null,null,7161,6]
[null,null,null,null,null,null,null,null,null,null,null,7162,6]
[null,null,null,null,null,null,null,null,null,null,null,7163,6]
[null,null,null,null,null,null,null,null,null,null,null,7164,6]
[null,null,null,null,null,null,null,null,null,null,null,7165,4]
[null,null,null,null,null,null,null,null,null,null,null,7171,6]
[null,null,null,null,null,null,null,null,null,null,null,7172,6]
[null,null,null,null,null,null,null,null,null,null,null,7173,6]
[null,null,null,null,null,null,null,null,null,null,null,7174,6]
[null,null,null,null,null,null,null,null,null,null,null,7175,6]
[null,null,null,null,null,null,null,null,null,null,null,7176,6]
[null,null,null,null,null,null,null,null,null,null,null,7181,6]
[null,null,null,null,null,null,null,null,null,null,null,7182,4]
[null,null,null,null,null,null,null,null,null,null,null,7183,6]
[null,null,null,null,null,null,null,null,null,null,null,7184,6]
[null,null,null,null,null,null,null,null,null,null,null,7185,6]
[null,null,null,null,null,null,null,null,null,null,null,7186,6]
[null,null,null,null,null,null,null,null,null,null,null,7187,6]
[null,null,null,null,null,null,null,null,null,null,null,7188,6]
[null,null,null,null,null,null,null,null,null,null,null,7191,6]
[null,null,null,null,null,null,null,null,null,null,null,7192,6]
[null,null,null,null,null,null,null,null,null,null,null,7193,6]
[null,null,null,null,null,null,null,null,null,null,null,7194,6]
[null,null,null,null,null,null,null,null,null,null,null,7195,6]
[null,null,null,null,null,null,null,null,null,null,null,7200,6]
[null,null,null,null,null,null,null,null,null,null,null,7201,6]
[null,null,null,null,null,null,null,null,null,null,null,7202,6]
[null,null,null,null,null,null,null,null,null,null,null,7203,6]
[null,null,null,null,null,null,null,null,null,null,null,7211,6]
[null,null,null,null,null,null,null,null,null,null,null,7212,6]
[null,null,null,null,null,null,null,null,null,null,null,7213,6]
[null,null,null,null,null,null,null,null,null,null,null,7214,6]
[null,null,null,null,null,null,null,null,null,null,null,7215,6]
[null,null,null,null,null,null,null,null,null,null,null,7224,6]
[null,null,null,null,null,null,null,null,null,null,null,7225,6]
[null,null,null,null,null,null,null,null,null,null,null,7226,6]
[null,null,null,null,null,null,null,null,null,null,null,7227,6]
[null,null,null,null,null,null,null,null,null,null,null,7228,6]
[null,null,null,null,null,null,null,null,null,null,null,7251,6]
[null,null,null,null,null,null,null,null,null,null,null,7252,4]
[null,null,null,null,null,null,null,null,null,null,null,7253,6]
[null,null,null,null,null,null,null,null,null,null,null,7255,6]
[null,null,null,null,null,null,null,null,null,null,null,7256,6]
[null,null,null,null,null,null,null,null,null,null,null,7257,6]
[null,null,null,null,null,null,null,null,null,null,null,7258,4]
[null,null,null,null,null,null,null,null,null,null,null,7259,4]
[null,null,null,null,null,null,null,null,null,null,null,7261,4]
[null,null,null,null,null,null,null,null,null,null,null,7271,4]
[null,null,null,null,null,null,null,null,null,null,null,7272,6]
[null,null,null,null,null,null,null,null,null,null,null,7273,6]
[null,null,null,null,null,null,null,null,null,null,null,7274,6]
[null,null,null,null,null,null,null,null,null,null,null,7275,6]
[null,null,null,null,null,null,null,null,null,null,null,7276,6]
[null,null,null,null,null,null,null,null,null,null,null,7277,6]
[null,null,null,null,null,null,null,null,null,null,null,7279,6]
[null,null,null,null,null,null,null,null,null,null,null,7281,6]
[null,null,null,null,null,null,null,null,null,null,null,7282,6]
[null,null,null,null,null,null,null,null,null,null,null,7283,6]
[null,null,null,null,null,null,null,null,null,null,null,7284,6]
[null,null,null,null,null,null,null,null,null,null,null,7285,6]
[null,null,null,null,null,null,null,null,null,null,null,7286,6]
[null,null,null,null,null,null,null,null,null,null,null,7300,6]
[null,null,null,null,null,null,null,null,null,null,null,7301,6]
[null,null,null,null,null,null,null,null,null,null,null,7304,6]
[null,null,null,null,null,null,null,null,null,null,null,7305,6]
[null,null,null,null,null,null,null,null,null,null,null,7308,6]
[null,null,null,null,null,null,null,null,null,null,null,7319,6]
[null,null,null,null,null,null,null,null,null,null,null,7331,6]
[null,null,null,null,null,null,null,null,null,null,null,7332,6]
[null,null,null,null,null,null,null,null,null,null,null,7333,6]
[null,null,null,null,null,null,null,null,null,null,null,7334,6]
[null,null,null,null,null,null,null,null,null,null,null,7341,6]
[null,null,null,null,null,null,null,null,null,null,null,7342,6]
[null,null,null,null,null,null,null,null,null,null,null,7343,6]
[null,null,null,null,null,null,null,null,null,null,null,7344,6]
[null,null,null,null,null,null,null,null,null,null,null,7345,6]
[null,null,null,null,null,null,null,null,null,null,null,7346,6]
[null,null,null,null,null,null,null,null,null,null,null,7347,6]
[null,null,null,null,null,null,null,null,null,null,null,7348,6]
[null,null,null,null,null,null,null,null,null,null,null,7349,6]
[null,null,null,null,null,null,null,null,null,null,null,7351,6]
[null,null,null,null,null,null,null,null,null,null,null,7352,6]
[null,null,null,null,null,null,null,null,null,null,null,7353,6]
[null,null,null,null,null,null,null,null,null,null,null,7354,6]
[null,null,null,null,null,null,null,null,null,null,null,7355,6]
[null,null,null,null,null,null,null,null,null,null,null,7356,6]
[null,null,null,null,null,null,null,null,null,null,null,7357,6]
[null,null,null,null,null,null,null,null,null,null,null,7361,6]
[null,null,null,null,null,null,null,null,null,null,null,7362,6]
[null,null,null,null,null,null,null,null,null,null,null,7370,6]
[null,null,null,null,null,null,null,null,null,null,null,7381,6]
[null,null,null,null,null,null,null,null,null,null,null,7383,6]
[null,null,null,null,null,null,null,null,null,null,null,7384,6]
[null,null,null,null,null,null,null,null,null,null,null,7385,6]
[null,null,null,null,null,null,null,null,null,null,null,7386,6]
[null,null,null,null,null,null,null,null,null,null,null,7391,6]
[null,null,null,null,null,null,null,null,null,null,null,7393,6]
[null,null,null,null,null,null,null,null,null,null,null,7394,6]
[null,null,null,null,null,null,null,null,null,null,null,7396,6]
[null,null,null,null,null,null,null,null,null,null,null,7400,3]
[null,null,null,null,null,null,null,null,null,null,null,7401,3]
[null,null,null,null,null,null,null,null,null,null,null,7404,3]
[null,null,null,null,null,null,null,null,null,null,null,7405,3]
[null,null,null,null,null,null,null,null,null,null,null,7406,3]
[null,null,null,null,null,null,null,null,null,null,null,7408,3]
[null,null,null,null,null,null,null,null,null,null,null,7409,3]
[null,null,null,null,null,null,null,null,null,null,null,7431,6]
[null,null,null,null,null,null,null,null,null,null,null,7432,6]
[null,null,null,null,null,null,null,null,null,null,null,7434,6]
[null,null,null,null,null,null,null,null,null,null,null,7435,6]
[null,null,null,null,null,null,null,null,null,null,null,7436,6]
[null,null,null,null,null,null,null,null,null,null,null,7439,4]
[null,null,null,null,null,null,null,null,null,null,null,7441,6]
[null,null,null,null,null,null,null,null,null,null,null,7442,6]
[null,null,null,null,null,null,null,null,null,null,null,7443,6]
[null,null,null,null,null,null,null,null,null,null,null,7444,4]
[null,null,null,null,null,null,null,null,null,null,null,7451,3]
[null,null,null,null,null,null,null,null,null,null,null,7452,6]
[null,null,null,null,null,null,null,null,null,null,null,7453,4]
[null,null,null,null,null,null,null,null,null,null,null,7454,4]
[null,null,null,null,null,null,null,null,null,null,null,7455,4]
[null,null,null,null,null,null,null,null,null,null,null,7456,6]
[null,null,null,null,null,null,null,null,null,null,null,7457,4]
[null,null,null,null,null,null,null,null,null,null,null,7458,6]
[null,null,null,null,null,null,null,null,null,null,null,7461,4]
[null,null,null,null,null,null,null,null,null,null,null,7463,4]
[null,null,null,null,null,null,null,null,null,null,null,7464,6]
[null,null,null,null,null,null,null,null,null,null,null,7465,6]
[null,null,null,null,null,null,null,null,null,null,null,7471,4]
[null,null,null,null,null,null,null,null,null,null,null,7472,4]
[null,null,null,null,null,null,null,null,null,null,null,7473,4]
[null,null,null,null,null,null,null,null,null,null,null,7474,4]
[null,null,null,null,null,null,null,null,null,null,null,7475,6]
[null,null,null,null,null,null,null,null,null,null,null,7476,4]
[null,null,null,null,null,null,null,null,null,null,null,7477,4]
[null,null,null,null,null,null,null,null,null,null,null,7478,6]
[null,null,null,null,null,null,null,null,null,null,null,7479,6]
[null,null,null,null,null,null,null,null,null,null,null,7500,6]
[null,null,null,null,null,null,null,null,null,null,null,7511,6]
[null,null,null,null,null,null,null,null,null,null,null,7512,6]
[null,null,null,null,null,null,null,null,null,null,null,7513,6]
[null,null,null,null,null,null,null,null,null,null,null,7514,6]
[null,null,null,null,null,null,null,null,null,null,null,7515,6]
[null,null,null,null,null,null,null,null,null,null,null,7516,6]
[null,null,null,null,null,null,null,null,null,null,null,7517,6]
[null,null,null,null,null,null,null,null,null,null,null,7521,6]
[null,null,null,null,null,null,null,null,null,null,null,7522,4]
[null,null,null,null,null,null,null,null,null,null,null,7523,6]
[null,null,null,null,null,null,null,null,null,null,null,7524,4]
[null,null,null,null,null,null,null,null,null,null,null,7525,6]
[null,null,null,null,null,null,null,null,null,null,null,7526,4]
[null,null,null,null,null,null,null,null,null,null,null,7527,6]
[null,null,null,null,null,null,null,null,null,null,null,7530,6]
[null,null,null,null,null,null,null,null,null,null,null,7531,6]
[null,null,null,null,null,null,null,null,null,null,null,7532,6]
[null,null,null,null,null,null,null,null,null,null,null,7533,6]
[null,null,null,null,null,null,null,null,null,null,null,7534,6]
[null,null,null,null,null,null,null,null,null,null,null,7535,6]
[null,null,null,null,null,null,null,null,null,null,null,7536,6]
[null,null,null,null,null,null,null,null,null,null,null,7537,6]
[null,null,null,null,null,null,null,null,null,null,null,7538,6]
[null,null,null,null,null,null,null,null,null,null,null,7539,6]
[null,null,null,null,null,null,null,null,null,null,null,7541,6]
[null,null,null,null,null,null,null,null,null,null,null,7542,6]
[null,null,null,null,null,null,null,null,null,null,null,7543,6]
[null,null,null,null,null,null,null,null,null,null,null,7544,6]
[null,null,null,null,null,null,null,null,null,null,null,7545,6]
[null,null,null,null,null,null,null,null,null,null,null,7551,6]
[null,null,null,null,null,null,null,null,null,null,null,7552,6]
[null,null,null,null,null,null,null,null,null,null,null,7553,6]
[null,null,null,null,null,null,null,null,null,null,null,7555,6]
[null,null,null,null,null,null,null,null,null,null,null,7556,6]
[null,null,null,null,null,null,null,null,null,null,null,7557,6]
[null,null,null,null,null,null,null,null,null,null,null,7561,6]
[null,null,null,null,null,null,null,null,null,null,null,7562,6]
[null,null,null,null,null,null,null,null,null,null,null,7563,6]
[null,null,null,null,null,null,null,null,null,null,null,7564,6]
[null,null,null,null,null,null,null,null,null,null,null,7570,6]
[null,null,null,null,null,null,null,null,null,null,null,7581,6]
[null,null,null,null,null,null,null,null,null,null,null,7582,6]
[null,null,null,null,null,null,null,null,null,null,null,7584,6]
[null,null,null,null,null,null,null,null,null,null,null,7585,6]
[null,null,null,null,null,null,null,null,null,null,null,7586,6]
[null,null,null,null,null,null,null,null,null,null,null,7587,6]
[null,null,null,null,null,null,null,null,null,null,null,7588,6]
[null,null,null,null,null,null,null,null,null,null,null,7589,6]
[null,null,null,null,null,null,null,null,null,null,null,7600,3]
[null,null,null,null,null,null,null,null,null,null,null,7601,3]
[null,null,null,null,null,null,null,null,null,null,null,7602,3]
[null,null,null,null,null,null,null,null,null,null,null,7603,3]
[null,null,null,null,null,null,null,null,null,null,null,7604,3]
[null,null,null,null,null,null,null,null,null,null,null,7607,3]
[null,null,null,null,null,null,null,null,null,null,null,7608,3]
[null,null,null,null,null,null,null,null,null,null,null,7611,3]
[null,null,null,null,null,null,null,null,null,null,null,7612,3]
[null,null,null,null,null,null,null,null,null,null,null,7614,3]
[null,null,null,null,null,null,null,null,null,null,null,7615,3]
[null,null,null,null,null,null,null,null,null,null,null,7616,3]
[null,null,null,null,null,null,null,null,null,null,null,7617,3]
[null,null,null,null,null,null,null,null,null,null,null,7618,3]
[null,null,null,null,null,null,null,null,null,null,null,7619,3]
[null,null,null,null,null,null,null,null,null,null,null,7621,3]
[null,null,null,null,null,null,null,null,null,null,null,7622,3]
[null,null,null,null,null,null,null,null,null,null,null,7623,3]
[null,null,null,null,null,null,null,null,null,null,null,7624,3]
[null,null,null,null,null,null,null,null,null,null,null,7625,3]
[null,null,null,null,null,null,null,null,null,null,null,7626,3]
[null,null,null,null,null,null,null,null,null,null,null,7627,3]
[null,null,null,null,null,null,null,null,null,null,null,7628,3]
[null,null,null,null,null,null,null,null,null,null,null,7629,3]
[null,null,null,null,null,null,null,null,null,null,null,7630,3]
[null,null,null,null,null,null,null,null,null,null,null,7631,3]
[null,null,null,null,null,null,null,null,null,null,null,7632,3]
[null,null,null,null,null,null,null,null,null,null,null,7633,3]
[null,null,null,null,null,null,null,null,null,null,null,7634,3]
[null,null,null,null,null,null,null,null,null,null,null,7635,3]
[null,null,null,null,null,null,null,null,null,null,null,7636,3]
[null,null,null,null,null,null,null,null,null,null,null,7639,6]
[null,null,null,null,null,null,null,null,null,null,null,7646,3]
[null,null,null,null,null,null,null,null,null,null,null,7661,6]
[null,null,null,null,null,null,null,null,null,null,null,7663,6]
[null,null,null,null,null,null,null,null,null,null,null,7664,6]
[null,null,null,null,null,null,null,null,null,null,null,7666,6]
[null,null,null,null,null,null,null,null,null,null,null,7668,6]
[null,null,null,null,null,null,null,null,null,null,null,7671,6]
[null,null,null,null,null,null,null,null,null,null,null,7672,6]
[null,null,null,null,null,null,null,null,null,null,null,7673,6]
[null,null,null,null,null,null,null,null,null,null,null,7675,6]
[null,null,null,null,null,null,null,null,null,null,null,7677,6]
[null,null,null,null,null,null,null,null,null,null,null,7678,6]
[null,null,null,null,null,null,null,null,null,null,null,7681,6]
[null,null,null,null,null,null,null,null,null,null,null,7682,6]
[null,null,null,null,null,null,null,null,null,null,null,7683,6]
[null,null,null,null,null,null,null,null,null,null,null,7691,3]
[null,null,null,null,null,null,null,null,null,null,null,7693,3]
[null,null,null,null,null,null,null,null,null,null,null,7694,6]
[null,null,null,null,null,null,null,null,null,null,null,7695,6]
[null,null,null,null,null,null,null,null,null,null,null,7696,6]
[null,null,null,null,null,null,null,null,null,null,null,7700,6]
[null,null,null,null,null,null,null,null,null,null,null,7701,6]
[null,null,null,null,null,null,null,null,null,null,null,7711,6]
[null,null,null,null,null,null,null,null,null,null,null,7712,6]
[null,null,null,null,null,null,null,null,null,null,null,7714,6]
[null,null,null,null,null,null,null,null,null,null,null,7715,6]
[null,null,null,null,null,null,null,null,null,null,null,7716,6]
[null,null,null,null,null,null,null,null,null,null,null,7717,6]
[null,null,null,null,null,null,null,null,null,null,null,7718,6]
[null,null,null,null,null,null,null,null,null,null,null,7720,6]
[null,null,null,null,null,null,null,null,null,null,null,7722,6]
[null,null,null,null,null,null,null,null,null,null,null,7723,6]
[null,null,null,null,null,null,null,null,null,null,null,7724,6]
[null,null,null,null,null,null,null,null,null,null,null,7725,6]
[null,null,null,null,null,null,null,null,null,null,null,7726,6]
[null,null,null,null,null,null,null,null,null,null,null,7727,6]
[null,null,null,null,null,null,null,null,null,null,null,7728,6]
[null,null,null,null,null,null,null,null,null,null,null,7729,6]
[null,null,null,null,null,null,null,null,null,null,null,7731,6]
[null,null,null,null,null,null,null,null,null,null,null,7732,6]
[null,null,null,null,null,null,null,null,null,null,null,7733,6]
[null,null,null,null,null,null,null,null,null,null,null,7735,6]
[null,null,null,null,null,null,null,null,null,null,null,7737,6]
[null,null,null,null,null,null,null,null,null,null,null,7741,6]
[null,null,null,null,null,null,null,null,null,null,null,7742,6]
[null,null,null,null,null,null,null,null,null,null,null,7743,6]
[null,null,null,null,null,null,null,null,null,null,null,7744,6]
[null,null,null,null,null,null,null,null,null,null,null,7745,6]
[null,null,null,null,null,null,null,null,null,null,null,7747,6]
[null,null,null,null,null,null,null,null,null,null,null,7751,6]
[null,null,null,null,null,null,null,null,null,null,null,7752,6]
[null,null,null,null,null,null,null,null,null,null,null,7753,6]
[null,null,null,null,null,null,null,null,null,null,null,7754,6]
[null,null,null,null,null,null,null,null,null,null,null,7755,6]
[null,null,null,null,null,null,null,null,null,null,null,7756,6]
[null,null,null,null,null,null,null,null,null,null,null,7757,6]
[null,null,null,null,null,null,null,null,null,null,null,7758,6]
[null,null,null,null,null,null,null,null,null,null,null,7759,6]
[null,null,null,null,null,null,null,null,null,null,null,7761,6]
[null,null,null,null,null,null,null,null,null,null,null,7762,6]
[null,null,null,null,null,null,null,null,null,null,null,7763,6]
[null,null,null,null,null,null,null,null,null,null,null,7766,6]
[null,null,null,null,null,null,null,null,null,null,null,7767,6]
[null,null,null,null,null,null,null,null,null,null,null,7768,6]
[null,null,null,null,null,null,null,null,null,null,null,7771,6]
[null,null,null,null,null,null,null,null,null,null,null,7772,6]
[null,null,null,null,null,null,null,null,null,null,null,7773,6]
[null,null,null,null,null,null,null,null,null,null,null,7774,6]
[null,null,null,null,null,null,null,null,null,null,null,7775,6]
[null,null,null,null,null,null,null,null,null,null,null,7781,6]
[null,null,null,null,null,null,null,null,null,null,null,7782,6]
[null,null,null,null,null,null,null,null,null,null,null,7783,6]
[null,null,null,null,null,null,null,null,null,null,null,7784,6]
[null,null,null,null,null,null,null,null,null,null,null,7785,6]
[null,null,null,null,null,null,null,null,null,null,null,7800,6]
[null,null,null,null,null,null,null,null,null,null,null,7801,6]
[null,null,null,null,null,null,null,null,null,null,null,7811,6]
[null,null,null,null,null,null,null,null,null,null,null,7812,6]
[null,null,null,null,null,null,null,null,null,null,null,7813,6]
[null,null,null,null,null,null,null,null,null,null,null,7814,6]
[null,null,null,null,null,null,null,null,null,null,null,7815,6]
[null,null,null,null,null,null,null,null,null,null,null,7817,6]
[null,null,null,null,null,null,null,null,null,null,null,7818,6]
[null,null,null,null,null,null,null,null,null,null,null,7821,6]
[null,null,null,null,null,null,null,null,null,null,null,7822,6]
[null,null,null,null,null,null,null,null,null,null,null,7823,6]
[null,null,null,null,null,null,null,null,null,null,null,7824,6]
[null,null,null,null,null,null,null,null,null,null,null,7825,6]
[null,null,null,null,null,null,null,null,null,null,null,7826,6]
[null,null,null,null,null,null,null,null,null,null,null,7827,6]
[null,null,null,null,null,null,null,null,null,null,null,7831,6]
[null,null,null,null,null,null,null,null,null,null,null,7832,6]
[null,null,null,null,null,null,null,null,null,null,null,7833,6]
[null,null,null,null,null,null,null,null,null,null,null,7834,6]
[null,null,null,null,null,null,null,null,null,null,null,7835,6]
[null,null,null,null,null,null,null,null,null,null,null,7836,6]
[null,null,null,null,null,null,null,null,null,null,null,7837,6]
[null,null,null,null,null,null,null,null,null,null,null,7838,6]
[null,null,null,null,null,null,null,null,null,null,null,7839,6]
[null,null,null,null,null,null,null,null,null,null,null,7841,6]
[null,null,null,null,null,null,null,null,null,null,null,7843,6]
[null,null,null,null,null,null,null,null,null,null,null,7846,6]
[null,null,null,null,null,null,null,null,null,null,null,7847,6]
[null,null,null,null,null,null,null,null,null,null,null,7849,6]
[null,null,null,null,null,null,null,null,null,null,null,7850,6]
[null,null,null,null,null,null,null,null,null,null,null,7851,6]
[null,null,null,null,null,null,null,null,null,null,null,7853,6]
[null,null,null,null,null,null,null,null,null,null,null,7854,6]
[null,null,null,null,null,null,null,null,null,null,null,7900,6]
[null,null,null,null,null,null,null,null,null,null,null,7911,6]
[null,null,null,null,null,null,null,null,null,null,null,7912,6]
[null,null,null,null,null,null,null,null,null,null,null,7913,6]
[null,null,null,null,null,null,null,null,null,null,null,7914,6]
[null,null,null,null,null,null,null,null,null,null,null,7915,6]
[null,null,null,null,null,null,null,null,null,null,null,7918,6]
[null,null,null,null,null,null,null,null,null,null,null,7921,6]
[null,null,null,null,null,null,null,null,null,null,null,7922,6]
[null,null,null,null,null,null,null,null,null,null,null,7923,6]
[null,null,null,null,null,null,null,null,null,null,null,7924,6]
[null,null,null,null,null,null,null,null,null,null,null,7925,6]
[null,null,null,null,null,null,null,null,null,null,null,7926,6]
[null,null,null,null,null,null,null,null,null,null,null,7931,6]
[null,null,null,null,null,null,null,null,null,null,null,7932,6]
[null,null,null,null,null,null,null,null,null,null,null,7934,6]
[null,null,null,null,null,null,null,null,null,null,null,7935,6]
[null,null,null,null,null,null,null,null,null,null,null,7936,6]
[null,null,null,null,null,null,null,null,null,null,null,7937,6]
[null,null,null,null,null,null,null,null,null,null,null,7938,6]
[null,null,null,null,null,null,null,null,null,null,null,7940,6]
[null,null,null,null,null,null,null,null,null,null,null,7951,6]
[null,null,null,null,null,null,null,null,null,null,null,7952,6]
[null,null,null,null,null,null,null,null,null,null,null,7953,6]
[null,null,null,null,null,null,null,null,null,null,null,7954,6]
[null,null,null,null,null,null,null,null,null,null,null,7956,6]
[null,null,null,null,null,null,null,null,null,null,null,7957,6]
[null,null,null,null,null,null,null,null,null,null,null,7958,6]
[null,null,null,null,null,null,null,null,null,null,null,7960,6]
[null,null,null,null,null,null,null,null,null,null,null,7964,6]
[null,null,null,null,null,null,null,null,null,null,null,7965,6]
[null,null,null,null,null,null,null,null,null,null,null,7966,6]
[null,null,null,null,null,null,null,null,null,null,null,7967,6]
[null,null,null,null,null,null,null,null,null,null,null,7968,6]
[null,null,null,null,null,null,null,null,null,null,null,7971,6]
[null,null,null,null,null,null,null,null,null,null,null,7972,6]
[null,null,null,null,null,null,null,null,null,null,null,7973,6]
[null,null,null,null,null,null,null,null,null,null,null,7975,6]
[null,null,null,null,null,null,null,null,null,null,null,7976,6]
[null,null,null,null,null,null,null,null,null,null,null,7977,6]
[null,null,null,null,null,null,null,null,null,null,null,7979,6]
[null,null,null,null,null,null,null,null,null,null,null,7980,6]
[null,null,null,null,null,null,null,null,null,null,null,7981,6]
[null,null,null,null,null,null,null,null,null,null,null,7985,6]
[null,null,null,null,null,null,null,null,null,null,null,7986,6]
[null,null,null,null,null,null,null,null,null,null,null,7987,6]
[null,null,null,null,null,null,null,null,null,null,null,7988,6]
[null,null,null,null,null,null,null,null,null,null,null,8000,4]
[null,null,null,null,null,null,null,null,null,null,null,8001,4]
[null,null,null,null,null,null,null,null,null,null,null,8002,4]
[null,null,null,null,null,null,null,null,null,null,null,8003,4]
[null,null,null,null,null,null,null,null,null,null,null,8004,4]
[null,null,null,null,null,null,null,null,null,null,null,8005,4]
[null,null,null,null,null,null,null,null,null,null,null,8006,4]
[null,null,null,null,null,null,null,null,null,null,null,8007,4]
[null,null,null,null,null,null,null,null,null,null,null,8008,4]
[null,null,null,null,null,null,null,null,null,null,null,8019,4]
[null,null,null,null,null,null,null,null,null,null,null,8041,6]
[null,null,null,null,null,null,null,null,null,null,null,8042,6]
[null,null,null,null,null,null,null,null,null,null,null,8043,6]
[null,null,null,null,null,null,null,null,null,null,null,8044,6]
[null,null,null,null,null,null,null,null,null,null,null,8045,6]
[null,null,null,null,null,null,null,null,null,null,null,8046,6]
[null,null,null,null,null,null,null,null,null,null,null,8051,6]
[null,null,null,null,null,null,null,null,null,null,null,8052,6]
[null,null,null,null,null,null,null,null,null,null,null,8053,6]
[null,null,null,null,null,null,null,null,null,null,null,8054,6]
[null,null,null,null,null,null,null,null,null,null,null,8055,6]
[null,null,null,null,null,null,null,null,null,null,null,8056,6]
[null,null,null,null,null,null,null,null,null,null,null,8060,6]
[null,null,null,null,null,null,null,null,null,null,null,8061,6]
[null,null,null,null,null,null,null,null,null,null,null,8065,6]
[null,null,null,null,null,null,null,null,null,null,null,8066,6]
[null,null,null,null,null,null,null,null,null,null,null,8071,4]
[null,null,null,null,null,null,null,null,null,null,null,8072,6]
[null,null,null,null,null,null,null,null,null,null,null,8073,6]
[null,null,null,null,null,null,null,null,null,null,null,8074,6]
[null,null,null,null,null,null,null,null,null,null,null,8075,6]
[null,null,null,null,null,null,null,null,null,null,null,8080,6]
[null,null,null,null,null,null,null,null,null,null,null,8081,6]
[null,null,null,null,null,null,null,null,null,null,null,8082,6]
[null,null,null,null,null,null,null,null,null,null,null,8083,6]
[null,null,null,null,null,null,null,null,null,null,null,8084,6]
[null,null,null,null,null,null,null,null,null,null,null,8085,4]
[null,null,null,null,null,null,null,null,null,null,null,8086,6]
[null,null,null,null,null,null,null,null,null,null,null,8087,4]
[null,null,null,null,null,null,null,null,null,null,null,8088,6]
[null,null,null,null,null,null,null,null,null,null,null,8089,4]
[null,null,null,null,null,null,null,null,null,null,null,8092,6]
[null,null,null,null,null,null,null,null,null,null,null,8093,6]
[null,null,null,null,null,null,null,null,null,null,null,8095,4]
[null,null,null,null,null,null,null,null,null,null,null,8096,4]
[null,null,null,null,null,null,null,null,null,null,null,8097,6]
[null,null,null,null,null,null,null,null,null,null,null,8100,4]
[null,null,null,null,null,null,null,null,null,null,null,8101,4]
[null,null,null,null,null,null,null,null,null,null,null,8103,4]
[null,null,null,null,null,null,null,null,null,null,null,8104,4]
[null,null,null,null,null,null,null,null,null,null,null,8105,6]
[null,null,null,null,null,null,null,null,null,null,null,8109,6]
[null,null,null,null,null,null,null,null,null,null,null,8111,6]
[null,null,null,null,null,null,null,null,null,null,null,8112,6]
[null,null,null,null,null,null,null,null,null,null,null,8113,6]
[null,null,null,null,null,null,null,null,null,null,null,8121,6]
[null,null,null,null,null,null,null,null,null,null,null,8122,6]
[null,null,null,null,null,null,null,null,null,null,null,8123,6]
[null,null,null,null,null,null,null,null,null,null,null,8124,6]
[null,null,null,null,null,null,null,null,null,null,null,8125,6]
[null,null,null,null,null,null,null,null,null,null,null,8126,6]
[null,null,null,null,null,null,null,null,null,null,null,8127,6]
[null,null,null,null,null,null,null,null,null,null,null,8128,6]
[null,null,null,null,null,null,null,null,null,null,null,8130,6]
[null,null,null,null,null,null,null,null,null,null,null,8131,6]
[null,null,null,null,null,null,null,null,null,null,null,8132,6]
[null,null,null,null,null,null,null,null,null,null,null,8133,6]
[null,null,null,null,null,null,null,null,null,null,null,8134,6]
[null,null,null,null,null,null,null,null,null,null,null,8135,6]
[null,null,null,null,null,null,null,null,null,null,null,8136,6]
[null,null,null,null,null,null,null,null,null,null,null,8137,6]
[null,null,null,null,null,null,null,null,null,null,null,8138,6]
[null,null,null,null,null,null,null,null,null,null,null,8139,6]
[null,null,null,null,null,null,null,null,null,null,null,8141,6]
[null,null,null,null,null,null,null,null,null,null,null,8142,6]
[null,null,null,null,null,null,null,null,null,null,null,8143,6]
[null,null,null,null,null,null,null,null,null,null,null,8144,6]
[null,null,null,null,null,null,null,null,null,null,null,8145,6]
[null,null,null,null,null,null,null,null,null,null,null,8146,6]
[null,null,null,null,null,null,null,null,null,null,null,8151,6]
[null,null,null,null,null,null,null,null,null,null,null,8152,6]
[null,null,null,null,null,null,null,null,null,null,null,8153,4]
[null,null,null,null,null,null,null,null,null,null,null,8154,6]
[null,null,null,null,null,null,null,null,null,null,null,8155,6]
[null,null,null,null,null,null,null,null,null,null,null,8156,6]
[null,null,null,null,null,null,null,null,null,null,null,8157,6]
[null,null,null,null,null,null,null,null,null,null,null,8161,6]
[null,null,null,null,null,null,null,null,null,null,null,8162,6]
[null,null,null,null,null,null,null,null,null,null,null,8163,6]
[null,null,null,null,null,null,null,null,null,null,null,8164,6]
[null,null,null,null,null,null,null,null,null,null,null,8171,6]
[null,null,null,null,null,null,null,null,null,null,null,8172,4]
[null,null,null,null,null,null,null,null,null,null,null,8173,4]
[null,null,null,null,null,null,null,null,null,null,null,8174,6]
[null,null,null,null,null,null,null,null,null,null,null,8175,6]
[null,null,null,null,null,null,null,null,null,null,null,8180,6]
[null,null,null,null,null,null,null,null,null,null,null,8181,6]
[null,null,null,null,null,null,null,null,null,null,null,8182,6]
[null,null,null,null,null,null,null,null,null,null,null,8183,4]
[null,null,null,null,null,null,null,null,null,null,null,8184,4]
[null,null,null,null,null,null,null,null,null,null,null,8191,6]
[null,null,null,null,null,null,null,null,null,null,null,8192,6]
[null,null,null,null,null,null,null,null,null,null,null,8193,6]
[null,null,null,null,null,null,null,null,null,null,null,8194,6]
[null,null,null,null,null,null,null,null,null,null,null,8195,6]
[null,null,null,null,null,null,null,null,null,null,null,8196,6]
[null,null,null,null,null,null,null,null,null,null,null,8200,3]
[null,null,null,null,null,null,null,null,null,null,null,8201,3]
[null,null,null,null,null,null,null,null,null,null,null,8202,3]
[null,null,null,null,null,null,null,null,null,null,null,8220,4]
[null,null,null,null,null,null,null,null,null,null,null,8221,4]
[null,null,null,null,null,null,null,null,null,null,null,8222,4]
[null,null,null,null,null,null,null,null,null,null,null,8223,4]
[null,null,null,null,null,null,null,null,null,null,null,8225,6]
[null,null,null,null,null,null,null,null,null,null,null,8226,6]
[null,null,null,null,null,null,null,null,null,null,null,8227,4]
[null,null,null,null,null,null,null,null,null,null,null,8228,4]
[null,null,null,null,null,null,null,null,null,null,null,8229,4]
[null,null,null,null,null,null,null,null,null,null,null,8230,6]
[null,null,null,null,null,null,null,null,null,null,null,8231,4]
[null,null,null,null,null,null,null,null,null,null,null,8232,4]
[null,null,null,null,null,null,null,null,null,null,null,8233,6]
[null,null,null,null,null,null,null,null,null,null,null,8236,4]
[null,null,null,null,null,null,null,null,null,null,null,8237,6]
[null,null,null,null,null,null,null,null,null,null,null,8241,6]
[null,null,null,null,null,null,null,null,null,null,null,8242,6]
[null,null,null,null,null,null,null,null,null,null,null,8243,6]
[null,null,null,null,null,null,null,null,null,null,null,8244,6]
[null,null,null,null,null,null,null,null,null,null,null,8245,6]
[null,null,null,null,null,null,null,null,null,null,null,8246,6]
[null,null,null,null,null,null,null,null,null,null,null,8247,6]
[null,null,null,null,null,null,null,null,null,null,null,8248,6]
[null,null,null,null,null,null,null,null,null,null,null,8250,6]
[null,null,null,null,null,null,null,null,null,null,null,8251,6]
[null,null,null,null,null,null,null,null,null,null,null,8252,6]
[null,null,null,null,null,null,null,null,null,null,null,8253,6]
[null,null,null,null,null,null,null,null,null,null,null,8254,6]
[null,null,null,null,null,null,null,null,null,null,null,8255,6]
[null,null,null,null,null,null,null,null,null,null,null,8256,6]
[null,null,null,null,null,null,null,null,null,null,null,8257,6]
[null,null,null,null,null,null,null,null,null,null,null,8258,6]
[null,null,null,null,null,null,null,null,null,null,null,8261,6]
[null,null,null,null,null,null,null,null,null,null,null,8262,6]
[null,null,null,null,null,null,null,null,null,null,null,8263,6]
[null,null,null,null,null,null,null,null,null,null,null,8264,6]
[null,null,null,null,null,null,null,null,null,null,null,8265,6]
[null,null,null,null,null,null,null,null,null,null,null,8271,6]
[null,null,null,null,null,null,null,null,null,null,null,8272,6]
[null,null,null,null,null,null,null,null,null,null,null,8273,6]
[null,null,null,null,null,null,null,null,null,null,null,8274,6]
[null,null,null,null,null,null,null,null,null,null,null,8275,6]
[null,null,null,null,null,null,null,null,null,null,null,8281,6]
[null,null,null,null,null,null,null,null,null,null,null,8282,6]
[null,null,null,null,null,null,null,null,null,null,null,8283,6]
[null,null,null,null,null,null,null,null,null,null,null,8284,6]
[null,null,null,null,null,null,null,null,null,null,null,8285,6]
[null,null,null,null,null,null,null,null,null,null,null,8286,6]
[null,null,null,null,null,null,null,null,null,null,null,8291,6]
[null,null,null,null,null,null,null,null,null,null,null,8292,6]
[null,null,null,null,null,null,null,null,null,null,null,8294,6]
[null,null,null,null,null,null,null,null,null,null,null,8295,6]
[null,null,null,null,null,null,null,null,null,null,null,8296,6]
[null,null,null,null,null,null,null,null,null,null,null,8297,6]
[null,null,null,null,null,null,null,null,null,null,null,8300,6]
[null,null,null,null,null,null,null,null,null,null,null,8301,6]
[null,null,null,null,null,null,null,null,null,null,null,8303,6]
[null,null,null,null,null,null,null,null,null,null,null,8308,6]
[null,null,null,null,null,null,null,null,null,null,null,8311,6]
[null,null,null,null,null,null,null,null,null,null,null,8312,6]
[null,null,null,null,null,null,null,null,null,null,null,8313,5]
[null,null,null,null,null,null,null,null,null,null,null,8314,6]
[null,null,null,null,null,null,null,null,null,null,null,8315,5]
[null,null,null,null,null,null,null,null,null,null,null,8316,6]
[null,null,null,null,null,null,null,null,null,null,null,8317,6]
[null,null,null,null,null,null,null,null,null,null,null,8318,6]
[null,null,null,null,null,null,null,null,null,null,null,8319,6]
[null,null,null,null,null,null,null,null,null,null,null,8321,6]
[null,null,null,null,null,null,null,null,null,null,null,8330,5]
[null,null,null,null,null,null,null,null,null,null,null,8341,6]
[null,null,null,null,null,null,null,null,null,null,null,8342,6]
[null,null,null,null,null,null,null,null,null,null,null,8344,6]
[null,null,null,null,null,null,null,null,null,null,null,8345,6]
[null,null,null,null,null,null,null,null,null,null,null,8346,6]
[null,null,null,null,null,null,null,null,null,null,null,8347,6]
[null,null,null,null,null,null,null,null,null,null,null,8348,6]
[null,null,null,null,null,null,null,null,null,null,null,8349,6]
[null,null,null,null,null,null,null,null,null,null,null,8351,6]
[null,null,null,null,null,null,null,null,null,null,null,8352,6]
[null,null,null,null,null,null,null,null,null,null,null,8353,6]
[null,null,null,null,null,null,null,null,null,null,null,8354,6]
[null,null,null,null,null,null,null,null,null,null,null,8355,6]
[null,null,null,null,null,null,null,null,null,null,null,8356,6]
[null,null,null,null,null,null,null,null,null,null,null,8357,6]
[null,null,null,null,null,null,null,null,null,null,null,8360,6]
[null,null,null,null,null,null,null,null,null,null,null,8361,6]
[null,null,null,null,null,null,null,null,null,null,null,8363,6]
[null,null,null,null,null,null,null,null,null,null,null,8364,6]
[null,null,null,null,null,null,null,null,null,null,null,8369,6]
[null,null,null,null,null,null,null,null,null,null,null,8371,6]
[null,null,null,null,null,null,null,null,null,null,null,8372,6]
[null,null,null,null,null,null,null,null,null,null,null,8373,6]
[null,null,null,null,null,null,null,null,null,null,null,8380,6]
[null,null,null,null,null,null,null,null,null,null,null,8381,6]
[null,null,null,null,null,null,null,null,null,null,null,8391,6]
[null,null,null,null,null,null,null,null,null,null,null,8392,6]
[null,null,null,null,null,null,null,null,null,null,null,8393,6]
[null,null,null,null,null,null,null,null,null,null,null,8394,6]
[null,null,null,null,null,null,null,null,null,null,null,8395,6]
[null,null,null,null,null,null,null,null,null,null,null,8400,6]
[null,null,null,null,null,null,null,null,null,null,null,8403,6]
[null,null,null,null,null,null,null,null,null,null,null,8409,6]
[null,null,null,null,null,null,null,null,null,null,null,8411,3]
[null,null,null,null,null,null,null,null,null,null,null,8412,3]
[null,null,null,null,null,null,null,null,null,null,null,8413,6]
[null,null,null,null,null,null,null,null,null,null,null,8414,6]
[null,null,null,null,null,null,null,null,null,null,null,8415,6]
[null,null,null,null,null,null,null,null,null,null,null,8416,6]
[null,null,null,null,null,null,null,null,null,null,null,8417,6]
[null,null,null,null,null,null,null,null,null,null,null,8418,6]
[null,null,null,null,null,null,null,null,null,null,null,8419,6]
[null,null,null,null,null,null,null,null,null,null,null,8420,4]
[null,null,null,null,null,null,null,null,null,null,null,8422,6]
[null,null,null,null,null,null,null,null,null,null,null,8423,6]
[null,null,null,null,null,null,null,null,null,null,null,8424,6]
[null,null,null,null,null,null,null,null,null,null,null,8425,6]
[null,null,null,null,null,null,null,null,null,null,null,8426,6]
[null,null,null,null,null,null,null,null,null,null,null,8427,6]
[null,null,null,null,null,null,null,null,null,null,null,8428,6]
[null,null,null,null,null,null,null,null,null,null,null,8429,6]
[null,null,null,null,null,null,null,null,null,null,null,8430,6]
[null,null,null,null,null,null,null,null,null,null,null,8431,6]
[null,null,null,null,null,null,null,null,null,null,null,8432,6]
[null,null,null,null,null,null,null,null,null,null,null,8433,6]
[null,null,null,null,null,null,null,null,null,null,null,8434,6]
[null,null,null,null,null,null,null,null,null,null,null,8435,6]
[null,null,null,null,null,null,null,null,null,null,null,8436,6]
[null,null,null,null,null,null,null,null,null,null,null,8437,6]
[null,null,null,null,null,null,null,null,null,null,null,8438,6]
[null,null,null,null,null,null,null,null,null,null,null,8439,6]
[null,null,null,null,null,null,null,null,null,null,null,8440,6]
[null,null,null,null,null,null,null,null,null,null,null,8441,6]
[null,null,null,null,null,null,null,null,null,null,null,8442,6]
[null,null,null,null,null,null,null,null,null,null,null,8443,6]
[null,null,null,null,null,null,null,null,null,null,null,8444,6]
[null,null,null,null,null,null,null,null,null,null,null,8445,6]
[null,null,null,null,null,null,null,null,null,null,null,8446,6]
[null,null,null,null,null,null,null,null,null,null,null,8447,6]
[null,null,null,null,null,null,null,null,null,null,null,8448,6]
[null,null,null,null,null,null,null,null,null,null,null,8449,6]
[null,null,null,null,null,null,null,null,null,null,null,8451,6]
[null,null,null,null,null,null,null,null,null,null,null,8452,6]
[null,null,null,null,null,null,null,null,null,null,null,8454,6]
[null,null,null,null,null,null,null,null,null,null,null,8455,6]
[null,null,null,null,null,null,null,null,null,null,null,8456,6]
[null,null,null,null,null,null,null,null,null,null,null,8457,6]
[null,null,null,null,null,null,null,null,null,null,null,8458,6]
[null,null,null,null,null,null,null,null,null,null,null,8460,6]
[null,null,null,null,null,null,null,null,null,null,null,8462,6]
[null,null,null,null,null,null,null,null,null,null,null,8468,6]
[null,null,null,null,null,null,null,null,null,null,null,8469,6]
[null,null,null,null,null,null,null,null,null,null,null,8471,6]
[null,null,null,null,null,null,null,null,null,null,null,8473,6]
[null,null,null,null,null,null,null,null,null,null,null,8474,6]
[null,null,null,null,null,null,null,null,null,null,null,8475,6]
[null,null,null,null,null,null,null,null,null,null,null,8476,6]
[null,null,null,null,null,null,null,null,null,null,null,8477,6]
[null,null,null,null,null,null,null,null,null,null,null,8478,6]
[null,null,null,null,null,null,null,null,null,null,null,8479,6]
[null,null,null,null,null,null,null,null,null,null,null,8481,6]
[null,null,null,null,null,null,null,null,null,null,null,8482,6]
[null,null,null,null,null,null,null,null,null,null,null,8483,6]
[null,null,null,null,null,null,null,null,null,null,null,8484,6]
[null,null,null,null,null,null,null,null,null,null,null,8485,6]
[null,null,null,null,null,null,null,null,null,null,null,8491,6]
[null,null,null,null,null,null,null,null,null,null,null,8492,6]
[null,null,null,null,null,null,null,null,null,null,null,8493,6]
[null,null,null,null,null,null,null,null,null,null,null,8494,6]
[null,null,null,null,null,null,null,null,null,null,null,8495,6]
[null,null,null,null,null,null,null,null,null,null,null,8496,6]
[null,null,null,null,null,null,null,null,null,null,null,8497,6]
[null,null,null,null,null,null,null,null,null,null,null,8500,5]
[null,null,null,null,null,null,null,null,null,null,null,8501,5]
[null,null,null,null,null,null,null,null,null,null,null,8511,5]
[null,null,null,null,null,null,null,null,null,null,null,8512,6]
[null,null,null,null,null,null,null,null,null,null,null,8513,5]
[null,null,null,null,null,null,null,null,null,null,null,8514,5]
[null,null,null,null,null,null,null,null,null,null,null,8515,6]
[null,null,null,null,null,null,null,null,null,null,null,8516,6]
[null,null,null,null,null,null,null,null,null,null,null,8517,6]
[null,null,null,null,null,null,null,null,null,null,null,8518,6]
[null,null,null,null,null,null,null,null,null,null,null,8521,6]
[null,null,null,null,null,null,null,null,null,null,null,8522,6]
[null,null,null,null,null,null,null,null,null,null,null,8523,6]
[null,null,null,null,null,null,null,null,null,null,null,8531,6]
[null,null,null,null,null,null,null,null,null,null,null,8532,6]
[null,null,null,null,null,null,null,null,null,null,null,8533,6]
[null,null,null,null,null,null,null,null,null,null,null,8541,6]
[null,null,null,null,null,null,null,null,null,null,null,8542,6]
[null,null,null,null,null,null,null,null,null,null,null,8543,6]
[null,null,null,null,null,null,null,null,null,null,null,8544,4]
[null,null,null,null,null,null,null,null,null,null,null,8551,6]
[null,null,null,null,null,null,null,null,null,null,null,8552,6]
[null,null,null,null,null,null,null,null,null,null,null,8553,6]
[null,null,null,null,null,null,null,null,null,null,null,8554,6]
[null,null,null,null,null,null,null,null,null,null,null,8555,6]
[null,null,null,null,null,null,null,null,null,null,null,8556,6]
[null,null,null,null,null,null,null,null,null,null,null,8557,6]
[null,null,null,null,null,null,null,null,null,null,null,8558,6]
[null,null,null,null,null,null,null,null,null,null,null,8561,6]
[null,null,null,null,null,null,null,null,null,null,null,8562,6]
[null,null,null,null,null,null,null,null,null,null,null,8563,6]
[null,null,null,null,null,null,null,null,null,null,null,8564,6]
[null,null,null,null,null,null,null,null,null,null,null,8565,6]
[null,null,null,null,null,null,null,null,null,null,null,8571,6]
[null,null,null,null,null,null,null,null,null,null,null,8572,6]
[null,null,null,null,null,null,null,null,null,null,null,8581,4]
[null,null,null,null,null,null,null,null,null,null,null,8582,6]
[null,null,null,null,null,null,null,null,null,null,null,8591,6]
[null,null,null,null,null,null,null,null,null,null,null,8592,6]
[null,null,null,null,null,null,null,null,null,null,null,8593,6]
[null,null,null,null,null,null,null,null,null,null,null,8594,6]
[null,null,null,null,null,null,null,null,null,null,null,8595,6]
[null,null,null,null,null,null,null,null,null,null,null,8596,6]
[null,null,null,null,null,null,null,null,null,null,null,8597,6]
[null,null,null,null,null,null,null,null,null,null,null,8598,5]
[null,null,null,null,null,null,null,null,null,null,null,8600,6]
[null,null,null,null,null,null,null,null,null,null,null,8601,6]
[null,null,null,null,null,null,null,null,null,null,null,8602,6]
[null,null,null,null,null,null,null,null,null,null,null,8609,6]
[null,null,null,null,null,null,null,null,null,null,null,8611,6]
[null,null,null,null,null,null,null,null,null,null,null,8612,6]
[null,null,null,null,null,null,null,null,null,null,null,8613,6]
[null,null,null,null,null,null,null,null,null,null,null,8614,6]
[null,null,null,null,null,null,null,null,null,null,null,8617,6]
[null,null,null,null,null,null,null,null,null,null,null,8618,6]
[null,null,null,null,null,null,null,null,null,null,null,8619,6]
[null,null,null,null,null,null,null,null,null,null,null,8621,6]
[null,null,null,null,null,null,null,null,null,null,null,8622,6]
[null,null,null,null,null,null,null,null,null,null,null,8623,6]
[null,null,null,null,null,null,null,null,null,null,null,8624,6]
[null,null,null,null,null,null,null,null,null,null,null,8625,6]
[null,null,null,null,null,null,null,null,null,null,null,8626,6]
[null,null,null,null,null,null,null,null,null,null,null,8627,6]
[null,null,null,null,null,null,null,null,null,null,null,8628,6]
[null,null,null,null,null,null,null,null,null,null,null,8630,6]
[null,null,null,null,null,null,null,null,null,null,null,8635,6]
[null,null,null,null,null,null,null,null,null,null,null,8636,6]
[null,null,null,null,null,null,null,null,null,null,null,8637,6]
[null,null,null,null,null,null,null,null,null,null,null,8638,6]
[null,null,null,null,null,null,null,null,null,null,null,8640,6]
[null,null,null,null,null,null,null,null,null,null,null,8641,6]
[null,null,null,null,null,null,null,null,null,null,null,8642,6]
[null,null,null,null,null,null,null,null,null,null,null,8644,6]
[null,null,null,null,null,null,null,null,null,null,null,8646,6]
[null,null,null,null,null,null,null,null,null,null,null,8647,6]
[null,null,null,null,null,null,null,null,null,null,null,8648,6]
[null,null,null,null,null,null,null,null,null,null,null,8649,6]
[null,null,null,null,null,null,null,null,null,null,null,8651,6]
[null,null,null,null,null,null,null,null,null,null,null,8652,6]
[null,null,null,null,null,null,null,null,null,null,null,8653,6]
[null,null,null,null,null,null,null,null,null,null,null,8654,6]
[null,null,null,null,null,null,null,null,null,null,null,8655,6]
[null,null,null,null,null,null,null,null,null,null,null,8656,6]
[null,null,null,null,null,null,null,null,null,null,null,8658,6]
[null,null,null,null,null,null,null,null,null,null,null,8660,6]
[null,null,null,null,null,null,null,null,null,null,null,8665,6]
[null,null,null,null,null,null,null,null,null,null,null,8666,6]
[null,null,null,null,null,null,null,null,null,null,null,8667,6]
[null,null,null,null,null,null,null,null,null,null,null,8668,6]
[null,null,null,null,null,null,null,null,null,null,null,8669,6]
[null,null,null,null,null,null,null,null,null,null,null,8671,6]
[null,null,null,null,null,null,null,null,null,null,null,8672,6]
[null,null,null,null,null,null,null,null,null,null,null,8673,6]
[null,null,null,null,null,null,null,null,null,null,null,8674,6]
[null,null,null,null,null,null,null,null,null,null,null,8675,6]
[null,null,null,null,null,null,null,null,null,null,null,8676,6]
[null,null,null,null,null,null,null,null,null,null,null,8681,6]
[null,null,null,null,null,null,null,null,null,null,null,8683,6]
[null,null,null,null,null,null,null,null,null,null,null,8684,6]
[null,null,null,null,null,null,null,null,null,null,null,8685,6]
[null,null,null,null,null,null,null,null,null,null,null,8691,6]
[null,null,null,null,null,null,null,null,null,null,null,8692,6]
[null,null,null,null,null,null,null,null,null,null,null,8693,6]
[null,null,null,null,null,null,null,null,null,null,null,8694,6]
[null,null,null,null,null,null,null,null,null,null,null,8695,6]
[null,null,null,null,null,null,null,null,null,null,null,8696,6]
[null,null,null,null,null,null,null,null,null,null,null,8697,6]
[null,null,null,null,null,null,null,null,null,null,null,8698,6]
[null,null,null,null,null,null,null,null,null,null,null,8699,6]
[null,null,null,null,null,null,null,null,null,null,null,8700,6]
[null,null,null,null,null,null,null,null,null,null,null,8705,6]
[null,null,null,null,null,null,null,null,null,null,null,8706,6]
[null,null,null,null,null,null,null,null,null,null,null,8707,6]
[null,null,null,null,null,null,null,null,null,null,null,8708,6]
[null,null,null,null,null,null,null,null,null,null,null,8709,6]
[null,null,null,null,null,null,null,null,null,null,null,8710,6]
[null,null,null,null,null,null,null,null,null,null,null,8711,6]
[null,null,null,null,null,null,null,null,null,null,null,8712,6]
[null,null,null,null,null,null,null,null,null,null,null,8713,6]
[null,null,null,null,null,null,null,null,null,null,null,8714,6]
[null,null,null,null,null,null,null,null,null,null,null,8715,6]
[null,null,null,null,null,null,null,null,null,null,null,8716,6]
[null,null,null,null,null,null,null,null,null,null,null,8717,6]
[null,null,null,null,null,null,null,null,null,null,null,8718,6]
[null,null,null,null,null,null,null,null,null,null,null,8719,6]
[null,null,null,null,null,null,null,null,null,null,null,8721,6]
[null,null,null,null,null,null,null,null,null,null,null,8722,6]
[null,null,null,null,null,null,null,null,null,null,null,8723,6]
[null,null,null,null,null,null,null,null,null,null,null,8724,6]
[null,null,null,null,null,null,null,null,null,null,null,8725,4]
[null,null,null,null,null,null,null,null,null,null,null,8726,6]
[null,null,null,null,null,null,null,null,null,null,null,8728,6]
[null,null,null,null,null,null,null,null,null,null,null,8731,6]
[null,null,null,null,null,null,null,null,null,null,null,8732,6]
[null,null,null,null,null,null,null,null,null,null,null,8733,6]
[null,null,null,null,null,null,null,null,null,null,null,8734,6]
[null,null,null,null,null,null,null,null,null,null,null,8735,6]
[null,null,null,null,null,null,null,null,null,null,null,8736,6]
[null,null,null,null,null,null,null,null,null,null,null,8737,6]
[null,null,null,null,null,null,null,null,null,null,null,8738,6]
[null,null,null,null,null,null,null,null,null,null,null,8739,6]
[null,null,null,null,null,null,null,null,null,null,null,8741,6]
[null,null,null,null,null,null,null,null,null,null,null,8742,5]
[null,null,null,null,null,null,null,null,null,null,null,8743,6]
[null,null,null,null,null,null,null,null,null,null,null,8744,6]
[null,null,null,null,null,null,null,null,null,null,null,8745,6]
[null,null,null,null,null,null,null,null,null,null,null,8746,5]
[null,null,null,null,null,null,null,null,null,null,null,8747,5]
[null,null,null,null,null,null,null,null,null,null,null,8749,5]
[null,null,null,null,null,null,null,null,null,null,null,8751,5]
[null,null,null,null,null,null,null,null,null,null,null,8752,5]
[null,null,null,null,null,null,null,null,null,null,null,8753,6]
[null,null,null,null,null,null,null,null,null,null,null,8754,5]
[null,null,null,null,null,null,null,null,null,null,null,8755,5]
[null,null,null,null,null,null,null,null,null,null,null,8756,5]
[null,null,null,null,null,null,null,null,null,null,null,8761,6]
[null,null,null,null,null,null,null,null,null,null,null,8762,6]
[null,null,null,null,null,null,null,null,null,null,null,8764,6]
[null,null,null,null,null,null,null,null,null,null,null,8765,6]
[null,null,null,null,null,null,null,null,null,null,null,8767,6]
[null,null,null,null,null,null,null,null,null,null,null,8768,6]
[null,null,null,null,null,null,null,null,null,null,null,8769,6]
[null,null,null,null,null,null,null,null,null,null,null,8771,5]
[null,null,null,null,null,null,null,null,null,null,null,8772,5]
[null,null,null,null,null,null,null,null,null,null,null,8773,5]
[null,null,null,null,null,null,null,null,null,null,null,8774,6]
[null,null,null,null,null,null,null,null,null,null,null,8776,6]
[null,null,null,null,null,null,null,null,null,null,null,8777,5]
[null,null,null,null,null,null,null,null,null,null,null,8778,5]
[null,null,null,null,null,null,null,null,null,null,null,8781,6]
[null,null,null,null,null,null,null,null,null,null,null,8782,5]
[null,null,null,null,null,null,null,null,null,null,null,8783,5]
[null,null,null,null,null,null,null,null,null,null,null,8784,6]
[null,null,null,null,null,null,null,null,null,null,null,8785,6]
[null,null,null,null,null,null,null,null,null,null,null,8788,6]
[null,null,null,null,null,null,null,null,null,null,null,8789,6]
[null,null,null,null,null,null,null,null,null,null,null,8790,6]
[null,null,null,null,null,null,null,null,null,null,null,8792,6]
[null,null,null,null,null,null,null,null,null,null,null,8793,6]
[null,null,null,null,null,null,null,null,null,null,null,8795,6]
[null,null,null,null,null,null,null,null,null,null,null,8796,6]
[null,null,null,null,null,null,null,null,null,null,null,8797,6]
[null,null,null,null,null,null,null,null,null,null,null,8798,6]
[null,null,null,null,null,null,null,null,null,null,null,8799,6]
[null,null,null,null,null,null,null,null,null,null,null,8800,5]
[null,null,null,null,null,null,null,null,null,null,null,8801,5]
[null,null,null,null,null,null,null,null,null,null,null,8804,5]
[null,null,null,null,null,null,null,null,null,null,null,8808,5]
[null,null,null,null,null,null,null,null,null,null,null,8809,5]
[null,null,null,null,null,null,null,null,null,null,null,8821,6]
[null,null,null,null,null,null,null,null,null,null,null,8822,6]
[null,null,null,null,null,null,null,null,null,null,null,8823,5]
[null,null,null,null,null,null,null,null,null,null,null,8824,5]
[null,null,null,null,null,null,null,null,null,null,null,8825,6]
[null,null,null,null,null,null,null,null,null,null,null,8827,6]
[null,null,null,null,null,null,null,null,null,null,null,8831,5]
[null,null,null,null,null,null,null,null,null,null,null,8832,5]
[null,null,null,null,null,null,null,null,null,null,null,8834,5]
[null,null,null,null,null,null,null,null,null,null,null,8835,5]
[null,null,null,null,null,null,null,null,null,null,null,8840,6]
[null,null,null,null,null,null,null,null,null,null,null,8849,6]
[null,null,null,null,null,null,null,null,null,null,null,8851,6]
[null,null,null,null,null,null,null,null,null,null,null,8852,6]
[null,null,null,null,null,null,null,null,null,null,null,8853,6]
[null,null,null,null,null,null,null,null,null,null,null,8854,6]
[null,null,null,null,null,null,null,null,null,null,null,8855,5]
[null,null,null,null,null,null,null,null,null,null,null,8856,5]
[null,null,null,null,null,null,null,null,null,null,null,8857,5]
[null,null,null,null,null,null,null,null,null,null,null,8858,6]
[null,null,null,null,null,null,null,null,null,null,null,8861,5]
[null,null,null,null,null,null,null,null,null,null,null,8862,5]
[null,null,null,null,null,null,null,null,null,null,null,8863,6]
[null,null,null,null,null,null,null,null,null,null,null,8864,6]
[null,null,null,null,null,null,null,null,null,null,null,8865,6]
[null,null,null,null,null,null,null,null,null,null,null,8866,6]
[null,null,null,null,null,null,null,null,null,null,null,8868,6]
[null,null,null,null,null,null,null,null,null,null,null,8871,6]
[null,null,null,null,null,null,null,null,null,null,null,8872,6]
[null,null,null,null,null,null,null,null,null,null,null,8873,6]
[null,null,null,null,null,null,null,null,null,null,null,8874,6]
[null,null,null,null,null,null,null,null,null,null,null,8876,6]
[null,null,null,null,null,null,null,null,null,null,null,8877,6]
[null,null,null,null,null,null,null,null,null,null,null,8878,6]
[null,null,null,null,null,null,null,null,null,null,null,8879,6]
[null,null,null,null,null,null,null,null,null,null,null,8881,5]
[null,null,null,null,null,null,null,null,null,null,null,8882,5]
[null,null,null,null,null,null,null,null,null,null,null,8883,5]
[null,null,null,null,null,null,null,null,null,null,null,8884,6]
[null,null,null,null,null,null,null,null,null,null,null,8885,6]
[null,null,null,null,null,null,null,null,null,null,null,8886,6]
[null,null,null,null,null,null,null,null,null,null,null,8887,6]
[null,null,null,null,null,null,null,null,null,null,null,8888,6]
[null,null,null,null,null,null,null,null,null,null,null,8891,6]
[null,null,null,null,null,null,null,null,null,null,null,8893,6]
[null,null,null,null,null,null,null,null,null,null,null,8895,6]
[null,null,null,null,null,null,null,null,null,null,null,8896,5]
[null,null,null,null,null,null,null,null,null,null,null,8897,5]
[null,null,null,null,null,null,null,null,null,null,null,8900,3]
[null,null,null,null,null,null,null,null,null,null,null,8901,3]
[null,null,null,null,null,null,null,null,null,null,null,8904,3]
[null,null,null,null,null,null,null,null,null,null,null,8905,3]
[null,null,null,null,null,null,null,null,null,null,null,8907,3]
[null,null,null,null,null,null,null,null,null,null,null,8909,3]
[null,null,null,null,null,null,null,null,null,null,null,8911,5]
[null,null,null,null,null,null,null,null,null,null,null,8912,5]
[null,null,null,null,null,null,null,null,null,null,null,8913,6]
[null,null,null,null,null,null,null,null,null,null,null,8914,6]
[null,null,null,null,null,null,null,null,null,null,null,8915,5]
[null,null,null,null,null,null,null,null,null,null,null,8916,5]
[null,null,null,null,null,null,null,null,null,null,null,8917,5]
[null,null,null,null,null,null,null,null,null,null,null,8918,5]
[null,null,null,null,null,null,null,null,null,null,null,8919,5]
[null,null,null,null,null,null,null,null,null,null,null,8921,5]
[null,null,null,null,null,null,null,null,null,null,null,8922,6]
[null,null,null,null,null,null,null,null,null,null,null,8923,6]
[null,null,null,null,null,null,null,null,null,null,null,8924,5]
[null,null,null,null,null,null,null,null,null,null,null,8925,5]
[null,null,null,null,null,null,null,null,null,null,null,8926,5]
[null,null,null,null,null,null,null,null,null,null,null,8927,5]
[null,null,null,null,null,null,null,null,null,null,null,8928,5]
[null,null,null,null,null,null,null,null,null,null,null,8929,5]
[null,null,null,null,null,null,null,null,null,null,null,8931,5]
[null,null,null,null,null,null,null,null,null,null,null,8932,5]
[null,null,null,null,null,null,null,null,null,null,null,8933,5]
[null,null,null,null,null,null,null,null,null,null,null,8934,5]
[null,null,null,null,null,null,null,null,null,null,null,8935,5]
[null,null,null,null,null,null,null,null,null,null,null,8936,6]
[null,null,null,null,null,null,null,null,null,null,null,8941,3]
[null,null,null,null,null,null,null,null,null,null,null,8942,5]
[null,null,null,null,null,null,null,null,null,null,null,8943,5]
[null,null,null,null,null,null,null,null,null,null,null,8944,5]
[null,null,null,null,null,null,null,null,null,null,null,8945,5]
[null,null,null,null,null,null,null,null,null,null,null,8946,6]
[null,null,null,null,null,null,null,null,null,null,null,8947,6]
[null,null,null,null,null,null,null,null,null,null,null,8948,6]
[null,null,null,null,null,null,null,null,null,null,null,8949,6]
[null,null,null,null,null,null,null,null,null,null,null,8951,6]
[null,null,null,null,null,null,null,null,null,null,null,8953,6]
[null,null,null,null,null,null,null,null,null,null,null,8954,6]
[null,null,null,null,null,null,null,null,null,null,null,8956,6]
[null,null,null,null,null,null,null,null,null,null,null,8957,6]
[null,null,null,null,null,null,null,null,null,null,null,8958,6]
[null,null,null,null,null,null,null,null,null,null,null,8960,6]
[null,null,null,null,null,null,null,null,null,null,null,8961,6]
[null,null,null,null,null,null,null,null,null,null,null,8966,6]
[null,null,null,null,null,null,null,null,null,null,null,8969,6]
[null,null,null,null,null,null,null,null,null,null,null,8971,6]
[null,null,null,null,null,null,null,null,null,null,null,8973,6]
[null,null,null,null,null,null,null,null,null,null,null,8975,6]
[null,null,null,null,null,null,null,null,null,null,null,8976,6]
[null,null,null,null,null,null,null,null,null,null,null,8977,6]
[null,null,null,null,null,null,null,null,null,null,null,8978,6]
[null,null,null,null,null,null,null,null,null,null,null,8981,5]
[null,null,null,null,null,null,null,null,null,null,null,8983,5]
[null,null,null,null,null,null,null,null,null,null,null,8984,5]
[null,null,null,null,null,null,null,null,null,null,null,8985,6]
[null,null,null,null,null,null,null,null,null,null,null,8986,6]
[null,null,null,null,null,null,null,null,null,null,null,8988,6]
[null,null,null,null,null,null,null,null,null,null,null,8989,5]
[null,null,null,null,null,null,null,null,null,null,null,8990,6]
[null,null,null,null,null,null,null,null,null,null,null,8991,5]
[null,null,null,null,null,null,null,null,null,null,null,8992,5]
[null,null,null,null,null,null,null,null,null,null,null,8994,5]
[null,null,null,null,null,null,null,null,null,null,null,8995,5]
[null,null,null,null,null,null,null,null,null,null,null,8996,5]
[null,null,null,null,null,null,null,null,null,null,null,8997,6]
[null,null,null,null,null,null,null,null,null,null,null,8998,6]
[null,null,null,null,null,null,null,null,null,null,null,8999,6]
[null,null,null,null,null,null,null,null,null,null,null,9000,4]
[null,null,null,null,null,null,null,null,null,null,null,9001,4]
[null,null,null,null,null,null,null,null,null,null,null,9002,4]
[null,null,null,null,null,null,null,null,null,null,null,9004,4]
[null,null,null,null,null,null,null,null,null,null,null,9005,4]
[null,null,null,null,null,null,null,null,null,null,null,9007,4]
[null,null,null,null,null,null,null,null,null,null,null,9008,4]
[null,null,null,null,null,null,null,null,null,null,null,9010,4]
[null,null,null,null,null,null,null,null,null,null,null,9011,4]
[null,null,null,null,null,null,null,null,null,null,null,9012,4]
[null,null,null,null,null,null,null,null,null,null,null,9013,4]
[null,null,null,null,null,null,null,null,null,null,null,9014,4]
[null,null,null,null,null,null,null,null,null,null,null,9019,4]
[null,null,null,null,null,null,null,null,null,null,null,9021,4]
[null,null,null,null,null,null,null,null,null,null,null,9022,4]
[null,null,null,null,null,null,null,null,null,null,null,9023,4]
[null,null,null,null,null,null,null,null,null,null,null,9024,4]
[null,null,null,null,null,null,null,null,null,null,null,9025,4]
[null,null,null,null,null,null,null,null,null,null,null,9026,4]
[null,null,null,null,null,null,null,null,null,null,null,9027,4]
[null,null,null,null,null,null,null,null,null,null,null,9028,4]
[null,null,null,null,null,null,null,null,null,null,null,9029,4]
[null,null,null,null,null,null,null,null,null,null,null,9030,4]
[null,null,null,null,null,null,null,null,null,null,null,9040,4]
[null,null,null,null,null,null,null,null,null,null,null,9061,4]
[null,null,null,null,null,null,null,null,null,null,null,9062,5]
[null,null,null,null,null,null,null,null,null,null,null,9063,5]
[null,null,null,null,null,null,null,null,null,null,null,9071,5]
[null,null,null,null,null,null,null,null,null,null,null,9072,5]
[null,null,null,null,null,null,null,null,null,null,null,9073,5]
[null,null,null,null,null,null,null,null,null,null,null,9074,5]
[null,null,null,null,null,null,null,null,null,null,null,9081,5]
[null,null,null,null,null,null,null,null,null,null,null,9082,5]
[null,null,null,null,null,null,null,null,null,null,null,9083,5]
[null,null,null,null,null,null,null,null,null,null,null,9084,5]
[null,null,null,null,null,null,null,null,null,null,null,9085,5]
[null,null,null,null,null,null,null,null,null,null,null,9086,4]
[null,null,null,null,null,null,null,null,null,null,null,9088,5]
[null,null,null,null,null,null,null,null,null,null,null,9089,5]
[null,null,null,null,null,null,null,null,null,null,null,9090,5]
[null,null,null,null,null,null,null,null,null,null,null,9091,5]
[null,null,null,null,null,null,null,null,null,null,null,9092,4]
[null,null,null,null,null,null,null,null,null,null,null,9093,5]
[null,null,null,null,null,null,null,null,null,null,null,9094,5]
[null,null,null,null,null,null,null,null,null,null,null,9095,5]
[null,null,null,null,null,null,null,null,null,null,null,9096,5]
[null,null,null,null,null,null,null,null,null,null,null,9097,5]
[null,null,null,null,null,null,null,null,null,null,null,9098,4]
[null,null,null,null,null,null,null,null,null,null,null,9099,5]
[null,null,null,null,null,null,null,null,null,null,null,9100,5]
[null,null,null,null,null,null,null,null,null,null,null,9111,5]
[null,null,null,null,null,null,null,null,null,null,null,9112,5]
[null,null,null,null,null,null,null,null,null,null,null,9113,5]
[null,null,null,null,null,null,null,null,null,null,null,9121,5]
[null,null,null,null,null,null,null,null,null,null,null,9122,5]
[null,null,null,null,null,null,null,null,null,null,null,9123,5]
[null,null,null,null,null,null,null,null,null,null,null,9124,5]
[null,null,null,null,null,null,null,null,null,null,null,9125,4]
[null,null,null,null,null,null,null,null,null,null,null,9126,5]
[null,null,null,null,null,null,null,null,null,null,null,9127,5]
[null,null,null,null,null,null,null,null,null,null,null,9131,5]
[null,null,null,null,null,null,null,null,null,null,null,9132,4]
[null,null,null,null,null,null,null,null,null,null,null,9133,5]
[null,null,null,null,null,null,null,null,null,null,null,9134,5]
[null,null,null,null,null,null,null,null,null,null,null,9135,5]
[null,null,null,null,null,null,null,null,null,null,null,9136,5]
[null,null,null,null,null,null,null,null,null,null,null,9141,4]
[null,null,null,null,null,null,null,null,null,null,null,9142,5]
[null,null,null,null,null,null,null,null,null,null,null,9143,5]
[null,null,null,null,null,null,null,null,null,null,null,9144,5]
[null,null,null,null,null,null,null,null,null,null,null,9145,5]
[null,null,null,null,null,null,null,null,null,null,null,9146,5]
[null,null,null,null,null,null,null,null,null,null,null,9147,5]
[null,null,null,null,null,null,null,null,null,null,null,9151,4]
[null,null,null,null,null,null,null,null,null,null,null,9152,4]
[null,null,null,null,null,null,null,null,null,null,null,9153,5]
[null,null,null,null,null,null,null,null,null,null,null,9154,5]
[null,null,null,null,null,null,null,null,null,null,null,9155,5]
[null,null,null,null,null,null,null,null,null,null,null,9161,4]
[null,null,null,null,null,null,null,null,null,null,null,9162,4]
[null,null,null,null,null,null,null,null,null,null,null,9163,5]
[null,null,null,null,null,null,null,null,null,null,null,9164,5]
[null,null,null,null,null,null,null,null,null,null,null,9165,5]
[null,null,null,null,null,null,null,null,null,null,null,9167,5]
[null,null,null,null,null,null,null,null,null,null,null,9168,5]
[null,null,null,null,null,null,null,null,null,null,null,9169,5]
[null,null,null,null,null,null,null,null,null,null,null,9171,4]
[null,null,null,null,null,null,null,null,null,null,null,9172,5]
[null,null,null,null,null,null,null,null,null,null,null,9173,5]
[null,null,null,null,null,null,null,null,null,null,null,9174,5]
[null,null,null,null,null,null,null,null,null,null,null,9175,5]
[null,null,null,null,null,null,null,null,null,null,null,9176,5]
[null,null,null,null,null,null,null,null,null,null,null,9177,5]
[null,null,null,null,null,null,null,null,null,null,null,9178,5]
[null,null,null,null,null,null,null,null,null,null,null,9181,5]
[null,null,null,null,null,null,null,null,null,null,null,9182,5]
[null,null,null,null,null,null,null,null,null,null,null,9183,5]
[null,null,null,null,null,null,null,null,null,null,null,9184,5]
[null,null,null,null,null,null,null,null,null,null,null,9200,5]
[null,null,null,null,null,null,null,null,null,null,null,9211,5]
[null,null,null,null,null,null,null,null,null,null,null,9221,5]
[null,null,null,null,null,null,null,null,null,null,null,9222,5]
[null,null,null,null,null,null,null,null,null,null,null,9223,5]
[null,null,null,null,null,null,null,null,null,null,null,9224,5]
[null,null,null,null,null,null,null,null,null,null,null,9225,5]
[null,null,null,null,null,null,null,null,null,null,null,9226,5]
[null,null,null,null,null,null,null,null,null,null,null,9227,5]
[null,null,null,null,null,null,null,null,null,null,null,9228,5]
[null,null,null,null,null,null,null,null,null,null,null,9231,5]
[null,null,null,null,null,null,null,null,null,null,null,9232,5]
[null,null,null,null,null,null,null,null,null,null,null,9233,5]
[null,null,null,null,null,null,null,null,null,null,null,9234,5]
[null,null,null,null,null,null,null,null,null,null,null,9235,5]
[null,null,null,null,null,null,null,null,null,null,null,9241,4]
[null,null,null,null,null,null,null,null,null,null,null,9242,4]
[null,null,null,null,null,null,null,null,null,null,null,9243,5]
[null,null,null,null,null,null,null,null,null,null,null,9244,5]
[null,null,null,null,null,null,null,null,null,null,null,9245,5]
[null,null,null,null,null,null,null,null,null,null,null,9246,5]
[null,null,null,null,null,null,null,null,null,null,null,9300,5]
[null,null,null,null,null,null,null,null,null,null,null,9301,5]
[null,null,null,null,null,null,null,null,null,null,null,9311,5]
[null,null,null,null,null,null,null,null,null,null,null,9312,5]
[null,null,null,null,null,null,null,null,null,null,null,9313,5]
[null,null,null,null,null,null,null,null,null,null,null,9314,5]
[null,null,null,null,null,null,null,null,null,null,null,9315,5]
[null,null,null,null,null,null,null,null,null,null,null,9316,5]
[null,null,null,null,null,null,null,null,null,null,null,9317,5]
[null,null,null,null,null,null,null,null,null,null,null,9321,5]
[null,null,null,null,null,null,null,null,null,null,null,9322,5]
[null,null,null,null,null,null,null,null,null,null,null,9323,5]
[null,null,null,null,null,null,null,null,null,null,null,9324,5]
[null,null,null,null,null,null,null,null,null,null,null,9325,5]
[null,null,null,null,null,null,null,null,null,null,null,9326,5]
[null,null,null,null,null,null,null,null,null,null,null,9327,5]
[null,null,null,null,null,null,null,null,null,null,null,9330,5]
[null,null,null,null,null,null,null,null,null,null,null,9332,5]
[null,null,null,null,null,null,null,null,null,null,null,9339,5]
[null,null,null,null,null,null,null,null,null,null,null,9341,5]
[null,null,null,null,null,null,null,null,null,null,null,9342,5]
[null,null,null,null,null,null,null,null,null,null,null,9343,5]
[null,null,null,null,null,null,null,null,null,null,null,9344,5]
[null,null,null,null,null,null,null,null,null,null,null,9345,5]
[null,null,null,null,null,null,null,null,null,null,null,9346,5]
[null,null,null,null,null,null,null,null,null,null,null,9351,5]
[null,null,null,null,null,null,null,null,null,null,null,9352,5]
[null,null,null,null,null,null,null,null,null,null,null,9353,5]
[null,null,null,null,null,null,null,null,null,null,null,9354,5]
[null,null,null,null,null,null,null,null,null,null,null,9361,5]
[null,null,null,null,null,null,null,null,null,null,null,9362,5]
[null,null,null,null,null,null,null,null,null,null,null,9363,5]
[null,null,null,null,null,null,null,null,null,null,null,9364,5]
[null,null,null,null,null,null,null,null,null,null,null,9365,5]
[null,null,null,null,null,null,null,null,null,null,null,9371,5]
[null,null,null,null,null,null,null,null,null,null,null,9372,5]
[null,null,null,null,null,null,null,null,null,null,null,9373,5]
[null,null,null,null,null,null,null,null,null,null,null,9374,5]
[null,null,null,null,null,null,null,null,null,null,null,9375,5]
[null,null,null,null,null,null,null,null,null,null,null,9400,5]
[null,null,null,null,null,null,null,null,null,null,null,9401,5]
[null,null,null,null,null,null,null,null,null,null,null,9407,5]
[null,null,null,null,null,null,null,null,null,null,null,9408,5]
[null,null,null,null,null,null,null,null,null,null,null,9409,5]
[null,null,null,null,null,null,null,null,null,null,null,9421,5]
[null,null,null,null,null,null,null,null,null,null,null,9422,5]
[null,null,null,null,null,null,null,null,null,null,null,9423,5]
[null,null,null,null,null,null,null,null,null,null,null,9431,5]
[null,null,null,null,null,null,null,null,null,null,null,9432,5]
[null,null,null,null,null,null,null,null,null,null,null,9433,5]
[null,null,null,null,null,null,null,null,null,null,null,9434,5]
[null,null,null,null,null,null,null,null,null,null,null,9435,5]
[null,null,null,null,null,null,null,null,null,null,null,9436,5]
[null,null,null,null,null,null,null,null,null,null,null,9437,5]
[null,null,null,null,null,null,null,null,null,null,null,9438,5]
[null,null,null,null,null,null,null,null,null,null,null,9441,5]
[null,null,null,null,null,null,null,null,null,null,null,9442,5]
[null,null,null,null,null,null,null,null,null,null,null,9443,5]
[null,null,null,null,null,null,null,null,null,null,null,9444,5]
[null,null,null,null,null,null,null,null,null,null,null,9450,5]
[null,null,null,null,null,null,null,null,null,null,null,9451,5]
[null,null,null,null,null,null,null,null,null,null,null,9461,5]
[null,null,null,null,null,null,null,null,null,null,null,9462,5]
[null,null,null,null,null,null,null,null,null,null,null,9463,5]
[null,null,null,null,null,null,null,null,null,null,null,9464,5]
[null,null,null,null,null,null,null,null,null,null,null,9471,5]
[null,null,null,null,null,null,null,null,null,null,null,9472,5]
[null,null,null,null,null,null,null,null,null,null,null,9473,5]
[null,null,null,null,null,null,null,null,null,null,null,9474,5]
[null,null,null,null,null,null,null,null,null,null,null,9475,5]
[null,null,null,null,null,null,null,null,null,null,null,9476,5]
[null,null,null,null,null,null,null,null,null,null,null,9481,5]
[null,null,null,null,null,null,null,null,null,null,null,9482,5]
[null,null,null,null,null,null,null,null,null,null,null,9483,5]
[null,null,null,null,null,null,null,null,null,null,null,9484,5]
[null,null,null,null,null,null,null,null,null,null,null,9485,5]
[null,null,null,null,null,null,null,null,null,null,null,9491,5]
[null,null,null,null,null,null,null,null,null,null,null,9492,5]
[null,null,null,null,null,null,null,null,null,null,null,9493,5]
[null,null,null,null,null,null,null,null,null,null,null,9494,4]
[null,null,null,null,null,null,null,null,null,null,null,9495,5]
[null,null,null,null,null,null,null,null,null,null,null,9500,5]
[null,null,null,null,null,null,null,null,null,null,null,9511,5]
[null,null,null,null,null,null,null,null,null,null,null,9512,5]
[null,null,null,null,null,null,null,null,null,null,null,9513,5]
[null,null,null,null,null,null,null,null,null,null,null,9514,5]
[null,null,null,null,null,null,null,null,null,null,null,9515,5]
[null,null,null,null,null,null,null,null,null,null,null,9516,5]
[null,null,null,null,null,null,null,null,null,null,null,9517,5]
[null,null,null,null,null,null,null,null,null,null,null,9521,5]
[null,null,null,null,null,null,null,null,null,null,null,9522,5]
[null,null,null,null,null,null,null,null,null,null,null,9523,5]
[null,null,null,null,null,null,null,null,null,null,null,9531,5]
[null,null,null,null,null,null,null,null,null,null,null,9532,6]
[null,null,null,null,null,null,null,null,null,null,null,9533,6]
[null,null,null,null,null,null,null,null,null,null,null,9534,6]
[null,null,null,null,null,null,null,null,null,null,null,9541,5]
[null,null,null,null,null,null,null,null,null,null,null,9542,5]
[null,null,null,null,null,null,null,null,null,null,null,9544,5]
[null,null,null,null,null,null,null,null,null,null,null,9545,5]
[null,null,null,null,null,null,null,null,null,null,null,9547,5]
[null,null,null,null,null,null,null,null,null,null,null,9548,5]
[null,null,null,null,null,null,null,null,null,null,null,9549,5]
[null,null,null,null,null,null,null,null,null,null,null,9551,5]
[null,null,null,null,null,null,null,null,null,null,null,9552,5]
[null,null,null,null,null,null,null,null,null,null,null,9553,5]
[null,null,null,null,null,null,null,null,null,null,null,9554,5]
[null,null,null,null,null,null,null,null,null,null,null,9555,5]
[null,null,null,null,null,null,null,null,null,null,null,9556,5]
[null,null,null,null,null,null,null,null,null,null,null,9561,5]
[null,null,null,null,null,null,null,null,null,null,null,9600,5]
[null,null,null,null,null,null,null,null,null,null,null,9608,5]
[null,null,null,null,null,null,null,null,null,null,null,9609,5]
[null,null,null,null,null,null,null,null,null,null,null,9611,5]
[null,null,null,null,null,null,null,null,null,null,null,9612,5]
[null,null,null,null,null,null,null,null,null,null,null,9621,5]
[null,null,null,null,null,null,null,null,null,null,null,9622,5]
[null,null,null,null,null,null,null,null,null,null,null,9623,5]
[null,null,null,null,null,null,null,null,null,null,null,9624,5]
[null,null,null,null,null,null,null,null,null,null,null,9625,5]
[null,null,null,null,null,null,null,null,null,null,null,9631,5]
[null,null,null,null,null,null,null,null,null,null,null,9632,5]
[null,null,null,null,null,null,null,null,null,null,null,9633,5]
[null,null,null,null,null,null,null,null,null,null,null,9634,5]
[null,null,null,null,null,null,null,null,null,null,null,9635,5]
[null,null,null,null,null,null,null,null,null,null,null,9636,5]
[null,null,null,null,null,null,null,null,null,null,null,9641,5]
[null,null,null,null,null,null,null,null,null,null,null,9643,5]
[null,null,null,null,null,null,null,null,null,null,null,9651,5]
[null,null,null,null,null,null,null,null,null,null,null,9652,5]
[null,null,null,null,null,null,null,null,null,null,null,9653,5]
[null,null,null,null,null,null,null,null,null,null,null,9654,5]
[null,null,null,null,null,null,null,null,null,null,null,9661,5]
[null,null,null,null,null,null,null,null,null,null,null,9662,5]
[null,null,null,null,null,null,null,null,null,null,null,9663,5]
[null,null,null,null,null,null,null,null,null,null,null,9664,5]
[null,null,null,null,null,null,null,null,null,null,null,9665,5]
[null,null,null,null,null,null,null,null,null,null,null,9671,5]
[null,null,null,null,null,null,null,null,null,null,null,9672,5]
[null,null,null,null,null,null,null,null,null,null,null,9673,5]
[null,null,null,null,null,null,null,null,null,null,null,9674,5]
[null,null,null,null,null,null,null,null,null,null,null,9675,5]
[null,null,null,null,null,null,null,null,null,null,null,9676,5]
[null,null,null,null,null,null,null,null,null,null,null,9681,5]
[null,null,null,null,null,null,null,null,null,null,null,9682,5]
[null,null,null,null,null,null,null,null,null,null,null,9683,5]
[null,null,null,null,null,null,null,null,null,null,null,9684,5]
[null,null,null,null,null,null,null,null,null,null,null,9685,5]
[null,null,null,null,null,null,null,null,null,null,null,9700,5]
[null,null,null,null,null,null,null,null,null,null,null,9701,5]
[null,null,null,null,null,null,null,null,null,null,null,9704,5]
[null,null,null,null,null,null,null,null,null,null,null,9705,5]
[null,null,null,null,null,null,null,null,null,null,null,9707,5]
[null,null,null,null,null,null,null,null,null,null,null,9719,5]
[null,null,null,null,null,null,null,null,null,null,null,9721,5]
[null,null,null,null,null,null,null,null,null,null,null,9722,5]
[null,null,null,null,null,null,null,null,null,null,null,9723,5]
[null,null,null,null,null,null,null,null,null,null,null,9724,4]
[null,null,null,null,null,null,null,null,null,null,null,9725,4]
[null,null,null,null,null,null,null,null,null,null,null,9726,5]
[null,null,null,null,null,null,null,null,null,null,null,9727,5]
[null,null,null,null,null,null,null,null,null,null,null,9730,5]
[null,null,null,null,null,null,null,null,null,null,null,9731,5]
[null,null,null,null,null,null,null,null,null,null,null,9732,5]
[null,null,null,null,null,null,null,null,null,null,null,9733,5]
[null,null,null,null,null,null,null,null,null,null,null,9734,5]
[null,null,null,null,null,null,null,null,null,null,null,9735,5]
[null,null,null,null,null,null,null,null,null,null,null,9736,5]
[null,null,null,null,null,null,null,null,null,null,null,9737,5]
[null,null,null,null,null,null,null,null,null,null,null,9738,5]
[null,null,null,null,null,null,null,null,null,null,null,9739,5]
[null,null,null,null,null,null,null,null,null,null,null,9740,5]
[null,null,null,null,null,null,null,null,null,null,null,9741,5]
[null,null,null,null,null,null,null,null,null,null,null,9742,5]
[null,null,null,null,null,null,null,null,null,null,null,9743,5]
[null,null,null,null,null,null,null,null,null,null,null,9744,5]
[null,null,null,null,null,null,null,null,null,null,null,9745,5]
[null,null,null,null,null,null,null,null,null,null,null,9746,5]
[null,null,null,null,null,null,null,null,null,null,null,9747,5]
[null,null,null,null,null,null,null,null,null,null,null,9748,5]
[null,null,null,null,null,null,null,null,null,null,null,9749,5]
[null,null,null,null,null,null,null,null,null,null,null,9751,5]
[null,null,null,null,null,null,null,null,null,null,null,9752,5]
[null,null,null,null,null,null,null,null,null,null,null,9754,5]
[null,null,null,null,null,null,null,null,null,null,null,9756,5]
[null,null,null,null,null,null,null,null,null,null,null,9757,5]
[null,null,null,null,null,null,null,null,null,null,null,9758,5]
[null,null,null,null,null,null,null,null,null,null,null,9761,5]
[null,null,null,null,null,null,null,null,null,null,null,9762,4]
[null,null,null,null,null,null,null,null,null,null,null,9763,5]
[null,null,null,null,null,null,null,null,null,null,null,9764,5]
[null,null,null,null,null,null,null,null,null,null,null,9765,5]
[null,null,null,null,null,null,null,null,null,null,null,9766,5]
[null,null,null,null,null,null,null,null,null,null,null,9771,5]
[null,null,null,null,null,null,null,null,null,null,null,9772,5]
[null,null,null,null,null,null,null,null,null,null,null,9773,5]
[null,null,null,null,null,null,null,null,null,null,null,9774,5]
[null,null,null,null,null,null,null,null,null,null,null,9775,5]
[null,null,null,null,null,null,null,null,null,null,null,9776,5]
[null,null,null,null,null,null,null,null,null,null,null,9777,5]
[null,null,null,null,null,null,null,null,null,null,null,9781,5]
[null,null,null,null,null,null,null,null,null,null,null,9782,5]
[null,null,null,null,null,null,null,null,null,null,null,9783,5]
[null,null,null,null,null,null,null,null,null,null,null,9784,5]
[null,null,null,null,null,null,null,null,null,null,null,9789,5]
[null,null,null,null,null,null,null,null,null,null,null,9791,4]
[null,null,null,null,null,null,null,null,null,null,null,9792,5]
[null,null,null,null,null,null,null,null,null,null,null,9793,4]
[null,null,null,null,null,null,null,null,null,null,null,9794,5]
[null,null,null,null,null,null,null,null,null,null,null,9795,4]
[null,null,null,null,null,null,null,null,null,null,null,9796,5]
[null,null,null,null,null,null,null,null,null,null,null,9797,4]
[null,null,null,null,null,null,null,null,null,null,null,9798,5]
[null,null,null,null,null,null,null,null,null,null,null,9799,5]
[null,null,null,null,null,null,null,null,null,null,null,9800,5]
[null,null,null,null,null,null,null,null,null,null,null,9811,5]
[null,null,null,null,null,null,null,null,null,null,null,9812,5]
[null,null,null,null,null,null,null,null,null,null,null,9813,5]
[null,null,null,null,null,null,null,null,null,null,null,9814,5]
[null,null,null,null,null,null,null,null,null,null,null,9821,5]
[null,null,null,null,null,null,null,null,null,null,null,9823,5]
[null,null,null,null,null,null,null,null,null,null,null,9824,5]
[null,null,null,null,null,null,null,null,null,null,null,9825,5]
[null,null,null,null,null,null,null,null,null,null,null,9826,5]
[null,null,null,null,null,null,null,null,null,null,null,9831,5]
[null,null,null,null,null,null,null,null,null,null,null,9832,4]
[null,null,null,null,null,null,null,null,null,null,null,9833,5]
[null,null,null,null,null,null,null,null,null,null,null,9834,5]
[null,null,null,null,null,null,null,null,null,null,null,9835,5]
[null,null,null,null,null,null,null,null,null,null,null,9836,5]
[null,null,null,null,null,null,null,null,null,null,null,9841,5]
[null,null,null,null,null,null,null,null,null,null,null,9842,5]
[null,null,null,null,null,null,null,null,null,null,null,9899,5]
[null,null,null,null,null,null,null,null,null,null,null,9900,5]
[null,null,null,null,null,null,null,null,null,null,null,9901,5]
[null,null,null,null,null,null,null,null,null,null,null,9909,5]
[null,null,null,null,null,null,null,null,null,null,null,9911,5]
[null,null,null,null,null,null,null,null,null,null,null,9912,5]
[null,null,null,null,null,null,null,null,null,null,null,9913,5]
[null,null,null,null,null,null,null,null,null,null,null,9914,5]
[null,null,null,null,null,null,null,null,null,null,null,9915,5]
[null,null,null,null,null,null,null,null,null,null,null,9917,5]
[null,null,null,null,null,null,null,null,null,null,null,9918,5]
[null,null,null,null,null,null,null,null,null,null,null,9919,5]
[null,null,null,null,null,null,null,null,null,null,null,9921,5]
[null,null,null,null,null,null,null,null,null,null,null,9922,5]
[null,null,null,null,null,null,null,null,null,null,null,9923,5]
[null,null,null,null,null,null,null,null,null,null,null,9931,5]
[null,null,null,null,null,null,null,null,null,null,null,9932,5]
[null,null,null,null,null,null,null,null,null,null,null,9933,5]
[null,null,null,null,null,null,null,null,null,null,null,9934,5]
[null,null,null,null,null,null,null,null,null,null,null,9935,5]
[null,null,null,null,null,null,null,null,null,null,null,9936,5]
[null,null,null,null,null,null,null,null,null,null,null,9937,5]
[null,null,null,null,null,null,null,null,null,null,null,9938,5]
[null,null,null,null,null,null,null,null,null,null,null,9941,5]
[null,null,null,null,null,null,null,null,null,null,null,9942,5]
[null,null,null,null,null,null,null,null,null,null,null,9943,5]
[null,null,null,null,null,null,null,null,null,null,null,9944,5]
[null,null,null,null,null,null,null,null,null,null,null,9945,5]
[null,null,null,null,null,null,null,null,null,null,null,9946,5]
[null,null,null,null,null,null,null,null,null,null,null,9951,5]
[null,null,null,null,null,null,null,null,null,null,null,9952,5]
[null,null,null,null,null,null,null,null,null,null,null,9953,5]
[null,null,null,null,null,null,null,null,null,null,null,9954,5]
[null,null,null,null,null,null,null,null,null,null,null,9955,5]
[null,null,null,null,null,null,null,null,null,null,null,9961,5]
[null,null,null,null,null,null,null,null,null,null,null,9962,5]
[null,null,null,null,null,null,null,null,null,null,null,9963,5]
[null,null,null,null,null,null,null,null,null,null,null,9970,5]
[null,null,null,null,null,null,null,null,null,null,null,9981,5]
[null,null,null,null,null,null,null,null,null,null,null,9982,5]
[null,null,null,null,null,null,null,null,null,null,null,9983,5]
[null,null,null,null,null,null,null,null,null,null,null,9985,5]
[null,null,null,null,null,null,null,null,null,null,null,2047,3]
[null,null,null,null,null,null,null,null,null,null,null,2082,3]
[null,null,null,null,null,null,null,null,null,null,null,2105,1]
[null,null,null,null,null,null,null,null,null,null,null,2442,1]
[null,null,null,null,null,null,null,null,null,null,null,2444,1]
[null,null,null,null,null,null,null,null,null,null,null,2761,5]
[null,null,null,null,null,null,null,null,null,null,null,2806,5]
[null,null,null,null,null,null,null,null,null,null,null,2902,5]
[null,null,null,null,null,null,null,null,null,null,null,3107,5]
[null,null,null,null,null,null,null,null,null,null,null,3305,3]
[null,null,null,null,null,null,null,null,null,null,null,3392,6]
[null,null,null,null,null,null,null,null,null,null,null,3393,6]
[null,null,null,null,null,null,null,null,null,null,null,3401,6]
[null,null,null,null,null,null,null,null,null,null,null,3402,6]
[null,null,null,null,null,null,null,null,null,null,null,3435,4]
[null,null,null,null,null,null,null,null,null,null,null,3505,4]
[null,null,null,null,null,null,null,null,null,null,null,3506,4]
[null,null,null,null,null,null,null,null,null,null,null,3513,4]
[null,null,null,null,null,null,null,null,null,null,null,3514,4]
[null,null,null,null,null,null,null,null,null,null,null,3547,4]
[null,null,null,null,null,null,null,null,null,null,null,3549,4]
[null,null,null,null,null,null,null,null,null,null,null,3607,6]
[null,null,null,null,null,null,null,null,null,null,null,3703,6]
[null,null,null,null,null,null,null,null,null,null,null,3705,6]
[null,null,null,null,null,null,null,null,null,null,null,3861,6]
[null,null,null,null,null,null,null,null,null,null,null,4004,3]
[null,null,null,null,null,null,null,null,null,null,null,4006,3]
[null,null,null,null,null,null,null,null,null,null,null,4007,3]
[null,null,null,null,null,null,null,null,null,null,null,4040,3]
[null,null,null,null,null,null,null,null,null,null,null,4041,3]
[null,null,null,null,null,null,null,null,null,null,null,4044,3]
[null,null,null,null,null,null,null,null,null,null,null,4045,3]
[null,null,null,null,null,null,null,null,null,null,null,4046,3]
[null,null,null,null,null,null,null,null,null,null,null,4047,3]
[null,null,null,null,null,null,null,null,null,null,null,4048,3]
[null,null,null,null,null,null,null,null,null,null,null,4101,5]
[null,null,null,null,null,null,null,null,null,null,null,4131,5]
[null,null,null,null,null,null,null,null,null,null,null,4151,5]
[null,null,null,null,null,null,null,null,null,null,null,4152,5]
[null,null,null,null,null,null,null,null,null,null,null,4155,5]
[null,null,null,null,null,null,null,null,null,null,null,4202,5]
[null,null,null,null,null,null,null,null,null,null,null,4406,3]
[null,null,null,null,null,null,null,null,null,null,null,4410,3]
[null,null,null,null,null,null,null,null,null,null,null,4411,3]
[null,null,null,null,null,null,null,null,null,null,null,4412,3]
[null,null,null,null,null,null,null,null,null,null,null,4512,4]
[null,null,null,null,null,null,null,null,null,null,null,4601,6]
[null,null,null,null,null,null,null,null,null,null,null,4603,6]
[null,null,null,null,null,null,null,null,null,null,null,4701,6]
[null,null,null,null,null,null,null,null,null,null,null,4801,6]
[null,null,null,null,null,null,null,null,null,null,null,5003,4]
[null,null,null,null,null,null,null,null,null,null,null,5101,6]
[null,null,null,null,null,null,null,null,null,null,null,5102,6]
[null,null,null,null,null,null,null,null,null,null,null,5131,6]
[null,null,null,null,null,null,null,null,null,null,null,5201,5]
[null,null,null,null,null,null,null,null,null,null,null,5302,6]
[null,null,null,null,null,null,null,null,null,null,null,5311,6]
[null,null,null,null,null,null,null,null,null,null,null,5341,6]
[null,null,null,null,null,null,null,null,null,null,null,5351,6]
[null,null,null,null,null,null,null,null,null,null,null,5403,6]
[null,null,null,null,null,null,null,null,null,null,null,5404,6]
[null,null,null,null,null,null,null,null,null,null,null,5432,6]
[null,null,null,null,null,null,null,null,null,null,null,5441,6]
[null,null,null,null,null,null,null,null,null,null,null,5521,5]
[null,null,null,null,null,null,null,null,null,null,null,5602,5]
[null,null,null,null,null,null,null,null,null,null,null,5603,5]
[null,null,null,null,null,null,null,null,null,null,null,5604,5]
[null,null,null,null,null,null,null,null,null,null,null,5605,5]
[null,null,null,null,null,null,null,null,null,null,null,5801,5]
[null,null,null,null,null,null,null,null,null,null,null,5802,5]
[null,null,null,null,null,null,null,null,null,null,null,6003,5]
[null,null,null,null,null,null,null,null,null,null,null,6005,5]
[null,null,null,null,null,null,null,null,null,null,null,6006,5]
[null,null,null,null,null,null,null,null,null,null,null,6007,5]
[null,null,null,null,null,null,null,null,null,null,null,6063,6]
[null,null,null,null,null,null,null,null,null,null,null,6093,5]
[null,null,null,null,null,null,null,null,null,null,null,6102,5]
[null,null,null,null,null,null,null,null,null,null,null,6402,6]
[null,null,null,null,null,null,null,null,null,null,null,6502,5]
[null,null,null,null,null,null,null,null,null,null,null,6603,6]
[null,null,null,null,null,null,null,null,null,null,null,6642,6]
[null,null,null,null,null,null,null,null,null,null,null,6702,4]
[null,null,null,null,null,null,null,null,null,null,null,6703,4]
[null,null,null,null,null,null,null,null,null,null,null,6704,4]
[null,null,null,null,null,null,null,null,null,null,null,6705,4]
[null,null,null,null,null,null,null,null,null,null,null,6707,4]
[null,null,null,null,null,null,null,null,null,null,null,6708,4]
[null,null,null,null,null,null,null,null,null,null,null,6709,4]
[null,null,null,null,null,null,null,null,null,null,null,6712,4]
[null,null,null,null,null,null,null,null,null,null,null,6717,4]
[null,null,null,null,null,null,null,null,null,null,null,6718,4]
[null,null,null,null,null,null,null,null,null,null,null,6719,4]
[null,null,null,null,null,null,null,null,null,null,null,6740,4]
[null,null,null,null,null,null,null,null,null,null,null,6741,4]
[null,null,null,null,null,null,null,null,null,null,null,6742,4]
[null,null,null,null,null,null,null,null,null,null,null,6743,4]
[null,null,null,null,null,null,null,null,null,null,null,6744,4]
[null,null,null,null,null,null,null,null,null,null,null,6745,4]
[null,null,null,null,null,null,null,null,null,null,null,6746,4]
[null,null,null,null,null,null,null,null,null,null,null,6747,4]
[null,null,null,null,null,null,null,null,null,null,null,6748,4]
[null,null,null,null,null,null,null,null,null,null,null,6802,6]
[null,null,null,null,null,null,null,null,null,null,null,6804,6]
[null,null,null,null,null,null,null,null,null,null,null,6811,6]
[null,null,null,null,null,null,null,null,null,null,null,6901,6]
[null,null,null,null,null,null,null,null,null,null,null,6902,6]
[null,null,null,null,null,null,null,null,null,null,null,7002,6]
[null,null,null,null,null,null,null,null,null,null,null,7021,6]
[null,null,null,null,null,null,null,null,null,null,null,7102,5]
[null,null,null,null,null,null,null,null,null,null,null,7302,6]
[null,null,null,null,null,null,null,null,null,null,null,7303,6]
[null,null,null,null,null,null,null,null,null,null,null,7306,6]
[null,null,null,null,null,null,null,null,null,null,null,7309,6]
[null,null,null,null,null,null,null,null,null,null,null,7402,3]
[null,null,null,null,null,null,null,null,null,null,null,7403,3]
[null,null,null,null,null,null,null,null,null,null,null,7407,3]
[null,null,null,null,null,null,null,null,null,null,null,7501,6]
[null,null,null,null,null,null,null,null,null,null,null,7519,4]
[null,null,null,null,null,null,null,null,null,null,null,7571,6]
[null,null,null,null,null,null,null,null,null,null,null,7605,3]
[null,null,null,null,null,null,null,null,null,null,null,7606,3]
[null,null,null,null,null,null,null,null,null,null,null,7610,3]
[null,null,null,null,null,null,null,null,null,null,null,7613,3]
[null,null,null,null,null,null,null,null,null,null,null,7643,3]
[null,null,null,null,null,null,null,null,null,null,null,7644,3]
[null,null,null,null,null,null,null,null,null,null,null,7645,3]
[null,null,null,null,null,null,null,null,null,null,null,7647,3]
[null,null,null,null,null,null,null,null,null,null,null,7648,3]
[null,null,null,null,null,null,null,null,null,null,null,7650,3]
[null,null,null,null,null,null,null,null,null,null,null,7702,6]
[null,null,null,null,null,null,null,null,null,null,null,7802,6]
[null,null,null,null,null,null,null,null,null,null,null,7901,6]
[null,null,null,null,null,null,null,null,null,null,null,8011,4]
[null,null,null,null,null,null,null,null,null,null,null,8020,4]
[null,null,null,null,null,null,null,null,null,null,null,8062,6]
[null,null,null,null,null,null,null,null,null,null,null,8102,4]
[null,null,null,null,null,null,null,null,null,null,null,8204,3]
[null,null,null,null,null,null,null,null,null,null,null,8205,3]
[null,null,null,null,null,null,null,null,null,null,null,8206,3]
[null,null,null,null,null,null,null,null,null,null,null,8207,3]
[null,null,null,null,null,null,null,null,null,null,null,8302,6]
[null,null,null,null,null,null,null,null,null,null,null,8331,6]
[null,null,null,null,null,null,null,null,null,null,null,8362,6]
[null,null,null,null,null,null,null,null,null,null,null,8401,6]
[null,null,null,null,null,null,null,null,null,null,null,8404,6]
[null,null,null,null,null,null,null,null,null,null,null,8408,6]
[null,null,null,null,null,null,null,null,null,null,null,8461,6]
[null,null,null,null,null,null,null,null,null,null,null,8502,6]
[null,null,null,null,null,null,null,null,null,null,null,8503,6]
[null,null,null,null,null,null,null,null,null,null,null,8505,6]
[null,null,null,null,null,null,null,null,null,null,null,8510,6]
[null,null,null,null,null,null,null,null,null,null,null,8604,6]
[null,null,null,null,null,null,null,null,null,null,null,8631,6]
[null,null,null,null,null,null,null,null,null,null,null,8634,6]
[null,null,null,null,null,null,null,null,null,null,null,8701,6]
[null,null,null,null,null,null,null,null,null,null,null,8802,5]
[null,null,null,null,null,null,null,null,null,null,null,8803,5]
[null,null,null,null,null,null,null,null,null,null,null,8902,3]
[null,null,null,null,null,null,null,null,null,null,null,8903,3]
[null,null,null,null,null,null,null,null,null,null,null,8906,3]
[null,null,null,null,null,null,null,null,null,null,null,8908,3]
[null,null,null,null,null,null,null,null,null,null,null,9003,4]
[null,null,null,null,null,null,null,null,null,null,null,9006,4]
[null,null,null,null,null,null,null,null,null,null,null,9009,4]
[null,null,null,null,null,null,null,null,null,null,null,9020,4]
[null,null,null,null,null,null,null,null,null,null,null,9201,5]
[null,null,null,null,null,null,null,null,null,null,null,9202,5]
[null,null,null,null,null,null,null,null,null,null,null,9203,5]
[null,null,null,null,null,null,null,null,null,null,null,9331,5]
[null,null,null,null,null,null,null,null,null,null,null,9402,5]
[null,null,null,null,null,null,null,null,null,null,null,9403,5]
[null,null,null,null,null,null,null,null,null,null,null,9404,5]
[null,null,null,null,null,null,null,null,null,null,null,9405,5]
[null,null,null,null,null,null,null,null,null,null,null,9406,5]
[null,null,null,null,null,null,null,null,null,null,null,9501,5]
[null,null,null,null,null,null,null,null,null,null,null,9502,5]
[null,null,null,null,null,null,null,null,null,null,null,9503,5]
[null,null,null,null,null,null,null,null,null,null,null,9601,5]
[null,null,null,null,null,null,null,null,null,null,null,9602,5]
[null,null,null,null,null,null,null,null,null,null,null,9702,5]
[null,null,null,null,null,null,null,null,null,null,null,9703,5]
[null,null,null,null,null,null,null,null,null,null,null,9706,5]
[null,null,null,null,null,null,null,null,null,null,null,9708,5]
[null,null,null,null,null,null,null,null,null,null,null,9709,5]
[null,null,null,null,null,null,null,null,null,null,null,9710,5]
[null,null,null,null,null,null,null,null,null,null,null,9801,5]
[null,null,null,null,null,null,null,null,null,null,null,9971,5]
[null,null,null,null,null,null,null,null,null,null,null,9343,6]
[null,null,null,null,null,null,null,null,null,null,null,9344,6]
[null,null,null,null,null,null,null,null,null,null,null,9345,6]
[null,null,null,null,null,null,null,null,null,null,null,9346,6]
[null,null,null,null,null,null,null,null,null,null,null,9346,6]
[null,null,null,null,null,null,null,null,null,null,null,9346,6]
[null,null,null,null,null,null,null,null,null,null,null,9351,6]
[null,null,null,null,null,null,null,null,null,null,null,9352,6]
[null,null,null,null,null,null,null,null,null,null,null,9353,6]
[null,null,null,null,null,null,null,null,null,null,null,9354,6]
[null,null,null,null,null,null,null,null,null,null,null,9361,6]
[null,null,null,null,null,null,null,null,null,null,null,9362,6]
[null,null,null,null,null,null,null,null,null,null,null,9363,6]
[null,null,null,null,null,null,null,null,null,null,null,9364,6]
[null,null,null,null,null,null,null,null,null,null,null,9365,6]
[null,null,null,null,null,null,null,null,null,null,null,9371,6]
[null,null,null,null,null,null,null,null,null,null,null,9372,6]
[null,null,null,null,null,null,null,null,null,null,null,9373,6]
[null,null,null,null,null,null,null,null,null,null,null,9374,6]
[null,null,null,null,null,null,null,null,null,null,null,9375,6]
[null,null,null,null,null,null,null,null,null,null,null,9375,6]
[null,null,null,null,null,null,null,null,null,null,null,9375,6]
[null,null,null,null,null,null,null,null,null,null,null,9400,5]
[null,null,null,null,null,null,null,null,null,null,null,9401,5]
[null,null,null,null,null,null,null,null,null,null,null,9402,5]
[null,null,null,null,null,null,null,null,null,null,null,9403,5]
[null,null,null,null,null,null,null,null,null,null,null,9404,5]
[null,null,null,null,null,null,null,null,null,null,null,9405,5]
[null,null,null,null,null,null,null,null,null,null,null,9406,5]
[null,null,null,null,null,null,null,null,null,null,null,9407,5]
[null,null,null,null,null,null,null,null,null,null,null,9408,5]
[null,null,null,null,null,null,null,null,null,null,null,9409,5]
[null,null,null,null,null,null,null,null,null,null,null,9421,6]
[null,null,null,null,null,null,null,null,null,null,null,9422,6]
[null,null,null,null,null,null,null,null,null,null,null,9423,6]
[null,null,null,null,null,null,null,null,null,null,null,9431,6]
[null,null,null,null,null,null,null,null,null,null,null,9432,6]
[null,null,null,null,null,null,null,null,null,null,null,9433,6]
[null,null,null,null,null,null,null,null,null,null,null,9434,6]
[null,null,null,null,null,null,null,null,null,null,null,9435,6]
[null,null,null,null,null,null,null,null,null,null,null,9436,6]
[null,null,null,null,null,null,null,null,null,null,null,9437,6]
[null,null,null,null,null,null,null,null,null,null,null,9438,6]
[null,null,null,null,null,null,null,null,null,null,null,9441,6]
[null,null,null,null,null,null,null,null,null,null,null,9442,6]
[null,null,null,null,null,null,null,null,null,null,null,9443,6]
[null,null,null,null,null,null,null,null,null,null,null,9444,6]
[null,null,null,null,null,null,null,null,null,null,null,9450,6]
[null,null,null,null,null,null,null,null,null,null,null,9451,6]
[null,null,null,null,null,null,null,null,null,null,null,9451,6]
[null,null,null,null,null,null,null,null,null,null,null,9461,6]
[null,null,null,null,null,null,null,null,null,null,null,9462,6]
[null,null,null,null,null,null,null,null,null,null,null,9463,6]
[null,null,null,null,null,null,null,null,null,null,null,9464,6]
[null,null,null,null,null,null,null,null,null,null,null,9471,6]
[null,null,null,null,null,null,null,null,null,null,null,9472,6]
[null,null,null,null,null,null,null,null,null,null,null,9473,6]
[null,null,null,null,null,null,null,null,null,null,null,9474,6]
[null,null,null,null,null,null,null,null,null,null,null,9474,6]
[null,null,null,null,null,null,null,null,null,null,null,9475,6]
[null,null,null,null,null,null,null,null,null,null,null,9476,6]
[null,null,null,null,null,null,null,null,null,null,null,9481,6]
[null,null,null,null,null,null,null,null,null,null,null,9482,6]
[null,null,null,null,null,null,null,null,null,null,null,9483,6]
[null,null,null,null,null,null,null,null,null,null,null,9484,6]
[null,null,null,null,null,null,null,null,null,null,null,9485,6]
[null,null,null,null,null,null,null,null,null,null,null,9491,6]
[null,null,null,null,null,null,null,null,null,null,null,9492,6]
[null,null,null,null,null,null,null,null,null,null,null,9493,6]
[null,null,null,null,null,null,null,null,null,null,null,9494,4]
[null,null,null,null,null,null,null,null,null,null,null,9495,6]
[null,null,null,null,null,null,null,null,null,null,null,9500,6]
[null,null,null,null,null,null,null,null,null,null,null,9501,6]
[null,null,null,null,null,null,null,null,null,null,null,9502,6]
[null,null,null,null,null,null,null,null,null,null,null,9503,6]
[null,null,null,null,null,null,null,null,null,null,null,9511,6]
[null,null,null,null,null,null,null,null,null,null,null,9512,6]
[null,null,null,null,null,null,null,null,null,null,null,9513,6]
[null,null,null,null,null,null,null,null,null,null,null,9514,6]
[null,null,null,null,null,null,null,null,null,null,null,9515,6]
[null,null,null,null,null,null,null,null,null,null,null,9516,6]
[null,null,null,null,null,null,null,null,null,null,null,9517,6]
[null,null,null,null,null,null,null,null,null,null,null,9521,6]
[null,null,null,null,null,null,null,null,null,null,null,9522,6]
[null,null,null,null,null,null,null,null,null,null,null,9523,6]
[null,null,null,null,null,null,null,null,null,null,null,9531,6]
[null,null,null,null,null,null,null,null,null,null,null,9532,6]
[null,null,null,null,null,null,null,null,null,null,null,9533,6]
[null,null,null,null,null,null,null,null,null,null,null,9534,6]
[null,null,null,null,null,null,null,null,null,null,null,9534,6]
[null,null,null,null,null,null,null,null,null,null,null,9541,6]
[null,null,null,null,null,null,null,null,null,null,null,9542,6]
[null,null,null,null,null,null,null,null,null,null,null,9542,6]
[null,null,null,null,null,null,null,null,null,null,null,9544,6]
[null,null,null,null,null,null,null,null,null,null,null,9545,6]
[null,null,null,null,null,null,null,null,null,null,null,9547,6]
[null,null,null,null,null,null,null,null,null,null,null,9548,6]
[null,null,null,null,null,null,null,null,null,null,null,9549,6]
[null,null,null,null,null,null,null,null,null,null,null,9551,6]
[null,null,null,null,null,null,null,null,null,null,null,9552,6]
[null,null,null,null,null,null,null,null,null,null,null,9553,6]
[null,null,null,null,null,null,null,null,null,null,null,9553,6]
[null,null,null,null,null,null,null,null,null,null,null,9554,6]
[null,null,null,null,null,null,null,null,null,null,null,9554,6]
[null,null,null,null,null,null,null,null,null,null,null,9555,6]
[null,null,null,null,null,null,null,null,null,null,null,9556,6]
[null,null,null,null,null,null,null,null,null,null,null,9561,6]
[null,null,null,null,null,null,null,null,null,null,null,9561,6]
[null,null,null,null,null,null,null,null,null,null,null,9600,6]
[null,null,null,null,null,null,null,null,null,null,null,9601,6]
[null,null,null,null,null,null,null,null,null,null,null,9602,6]
[null,null,null,null,null,null,null,null,null,null,null,9608,6]
[null,null,null,null,null,null,null,null,null,null,null,9609,6]
[null,null,null,null,null,null,null,null,null,null,null,9611,6]
[null,null,null,null,null,null,null,null,null,null,null,9612,6]
[null,null,null,null,null,null,null,null,null,null,null,9612,6]
[null,null,null,null,null,null,null,null,null,null,null,9621,6]
[null,null,null,null,null,null,null,null,null,null,null,9622,6]
[null,null,null,null,null,null,null,null,null,null,null,9623,6]
[null,null,null,null,null,null,null,null,null,null,null,9624,6]
[null,null,null,null,null,null,null,null,null,null,null,9625,6]
[null,null,null,null,null,null,null,null,null,null,null,9625,6]
[null,null,null,null,null,null,null,null,null,null,null,9631,6]
[null,null,null,null,null,null,null,null,null,null,null,9632,6]
[null,null,null,null,null,null,null,null,null,null,null,9633,6]
[null,null,null,null,null,null,null,null,null,null,null,9634,6]
[null,null,null,null,null,null,null,null,null,null,null,9634,6]
[null,null,null,null,null,null,null,null,null,null,null,9635,6]
[null,null,null,null,null,null,null,null,null,null,null,9636,6]
[null,null,null,null,null,null,null,null,null,null,null,9641,6]
[null,null,null,null,null,null,null,null,null,null,null,9643,6]
[null,null,null,null,null,null,null,null,null,null,null,9651,6]
[null,null,null,null,null,null,null,null,null,null,null,9652,6]
[null,null,null,null,null,null,null,null,null,null,null,9653,6]
[null,null,null,null,null,null,null,null,null,null,null,9654,6]
[null,null,null,null,null,null,null,null,null,null,null,9661,6]
[null,null,null,null,null,null,null,null,null,null,null,9662,6]
[null,null,null,null,null,null,null,null,null,null,null,9662,6]
[null,null,null,null,null,null,null,null,null,null,null,9663,6]
[null,null,null,null,null,null,null,null,null,null,null,9664,6]
[null,null,null,null,null,null,null,null,null,null,null,9665,6]
[null,null,null,null,null,null,null,null,null,null,null,9671,6]
[null,null,null,null,null,null,null,null,null,null,null,9672,6]
[null,null,null,null,null,null,null,null,null,null,null,9673,6]
[null,null,null,null,null,null,null,null,null,null,null,9674,6]
[null,null,null,null,null,null,null,null,null,null,null,9675,6]
[null,null,null,null,null,null,null,null,null,null,null,9676,6]
[null,null,null,null,null,null,null,null,null,null,null,9681,6]
[null,null,null,null,null,null,null,null,null,null,null,9682,6]
[null,null,null,null,null,null,null,null,null,null,null,9683,6]
[null,null,null,null,null,null,null,null,null,null,null,9684,6]
[null,null,null,null,null,null,null,null,null,null,null,9685,6]
[null,null,null,null,null,null,null,null,null,null,null,9700,5]
[null,null,null,null,null,null,null,null,null,null,null,9701,5]
[null,null,null,null,null,null,null,null,null,null,null,9702,5]
[null,null,null,null,null,null,null,null,null,null,null,9703,5]
[null,null,null,null,null,null,null,null,null,null,null,9704,5]
[null,null,null,null,null,null,null,null,null,null,null,9705,5]
[null,null,null,null,null,null,null,null,null,null,null,9706,5]
[null,null,null,null,null,null,null,null,null,null,null,9707,5]
[null,null,null,null,null,null,null,null,null,null,null,9708,5]
[null,null,null,null,null,null,null,null,null,null,null,9709,5]
[null,null,null,null,null,null,null,null,null,null,null,9710,5]
[null,null,null,null,null,null,null,null,null,null,null,9719,5]
[null,null,null,null,null,null,null,null,null,null,null,9721,6]
[null,null,null,null,null,null,null,null,null,null,null,9722,6]
[null,null,null,null,null,null,null,null,null,null,null,9723,6]
[null,null,null,null,null,null,null,null,null,null,null,9724,4]
[null,null,null,null,null,null,null,null,null,null,null,9725,4]
[null,null,null,null,null,null,null,null,null,null,null,9725,4]
[null,null,null,null,null,null,null,null,null,null,null,9725,4]
[null,null,null,null,null,null,null,null,null,null,null,9726,6]
[null,null,null,null,null,null,null,null,null,null,null,9727,6]
[null,null,null,null,null,null,null,null,null,null,null,9730,6]
[null,null,null,null,null,null,null,null,null,null,null,9731,6]
[null,null,null,null,null,null,null,null,null,null,null,9732,6]
[null,null,null,null,null,null,null,null,null,null,null,9733,6]
[null,null,null,null,null,null,null,null,null,null,null,9733,6]
[null,null,null,null,null,null,null,null,null,null,null,9733,6]
[null,null,null,null,null,null,null,null,null,null,null,9734,6]
[null,null,null,null,null,null,null,null,null,null,null,9735,6]
[null,null,null,null,null,null,null,null,null,null,null,9736,6]
[null,null,null,null,null,null,null,null,null,null,null,9737,6]
[null,null,null,null,null,null,null,null,null,null,null,9738,6]
[null,null,null,null,null,null,null,null,null,null,null,9739,6]
[null,null,null,null,null,null,null,null,null,null,null,9739,6]
[null,null,null,null,null,null,null,null,null,null,null,9739,6]
[null,null,null,null,null,null,null,null,null,null,null,9740,6]
[null,null,null,null,null,null,null,null,null,null,null,9741,6]
[null,null,null,null,null,null,null,null,null,null,null,9742,6]
[null,null,null,null,null,null,null,null,null,null,null,9743,6]
[null,null,null,null,null,null,null,null,null,null,null,9744,6]
[null,null,null,null,null,null,null,null,null,null,null,9745,6]
[null,null,null,null,null,null,null,null,null,null,null,9746,6]
[null,null,null,null,null,null,null,null,null,null,null,9747,6]
[null,null,null,null,null,null,null,null,null,null,null,9748,6]
[null,null,null,null,null,null,null,null,null,null,null,9749,6]
[null,null,null,null,null,null,null,null,null,null,null,9751,6]
[null,null,null,null,null,null,null,null,null,null,null,9752,6]
[null,null,null,null,null,null,null,null,null,null,null,9752,6]
[null,null,null,null,null,null,null,null,null,null,null,9754,6]
[null,null,null,null,null,null,null,null,null,null,null,9754,6]
[null,null,null,null,null,null,null,null,null,null,null,9756,6]
[null,null,null,null,null,null,null,null,null,null,null,9757,6]
[null,null,null,null,null,null,null,null,null,null,null,9761,6]
[null,null,null,null,null,null,null,null,null,null,null,9762,4]
[null,null,null,null,null,null,null,null,null,null,null,9763,6]
[null,null,null,null,null,null,null,null,null,null,null,9764,6]
[null,null,null,null,null,null,null,null,null,null,null,9766,6]
[null,null,null,null,null,null,null,null,null,null,null,9766,6]
[null,null,null,null,null,null,null,null,null,null,null,9766,6]
[null,null,null,null,null,null,null,null,null,null,null,9771,6]
[null,null,null,null,null,null,null,null,null,null,null,9772,6]
[null,null,null,null,null,null,null,null,null,null,null,9773,6]
[null,null,null,null,null,null,null,null,null,null,null,9774,6]
[null,null,null,null,null,null,null,null,null,null,null,9774,6]
[null,null,null,null,null,null,null,null,null,null,null,9774,6]
[null,null,null,null,null,null,null,null,null,null,null,9775,6]
[null,null,null,null,null,null,null,null,null,null,null,9776,6]
[null,null,null,null,null,null,null,null,null,null,null,9777,6]
[null,null,null,null,null,null,null,null,null,null,null,9781,6]
[null,null,null,null,null,null,null,null,null,null,null,9782,6]
[null,null,null,null,null,null,null,null,null,null,null,9783,6]
[null,null,null,null,null,null,null,null,null,null,null,9784,6]
[null,null,null,null,null,null,null,null,null,null,null,9784,6]
[null,null,null,null,null,null,null,null,null,null,null,9784,6]
[null,null,null,null,null,null,null,null,null,null,null,9789,6]
[null,null,null,null,null,null,null,null,null,null,null,9791,4]
[null,null,null,null,null,null,null,null,null,null,null,9791,4]
[null,null,null,null,null,null,null,null,null,null,null,9792,6]
[null,null,null,null,null,null,null,null,null,null,null,9793,4]
[null,null,null,null,null,null,null,null,null,null,null,9794,6]
[null,null,null,null,null,null,null,null,null,null,null,9795,4]
[null,null,null,null,null,null,null,null,null,null,null,9796,6]
[null,null,null,null,null,null,null,null,null,null,null,9796,6]
[null,null,null,null,null,null,null,null,null,null,null,9797,4]
[null,null,null,null,null,null,null,null,null,null,null,9798,6]
[null,null,null,null,null,null,null,null,null,null,null,9799,6]
[null,null,null,null,null,null,null,null,null,null,null,9800,6]
[null,null,null,null,null,null,null,null,null,null,null,9801,6]
[null,null,null,null,null,null,null,null,null,null,null,9811,6]
[null,null,null,null,null,null,null,null,null,null,null,9812,6]
[null,null,null,null,null,null,null,null,null,null,null,9813,6]
[null,null,null,null,null,null,null,null,null,null,null,9813,6]
[null,null,null,null,null,null,null,null,null,null,null,9814,6]
[null,null,null,null,null,null,null,null,null,null,null,9821,6]
[null,null,null,null,null,null,null,null,null,null,null,9821,6]
[null,null,null,null,null,null,null,null,null,null,null,9823,6]
[null,null,null,null,null,null,null,null,null,null,null,9824,6]
[null,null,null,null,null,null,null,null,null,null,null,9825,6]
[null,null,null,null,null,null,null,null,null,null,null,9826,6]
[null,null,null,null,null,null,null,null,null,null,null,9831,6]
[null,null,null,null,null,null,null,null,null,null,null,9832,4]
[null,null,null,null,null,null,null,null,null,null,null,9833,6]
[null,null,null,null,null,null,null,null,null,null,null,9834,6]
[null,null,null,null,null,null,null,null,null,null,null,9835,6]
[null,null,null,null,null,null,null,null,null,null,null,9836,6]
[null,null,null,null,null,null,null,null,null,null,null,9841,6]
[null,null,null,null,null,null,null,null,null,null,null,9842,6]
[null,null,null,null,null,null,null,null,null,null,null,9899,6]
[null,null,null,null,null,null,null,null,null,null,null,9900,6]
[null,null,null,null,null,null,null,null,null,null,null,9901,6]
[null,null,null,null,null,null,null,null,null,null,null,9909,6]
[null,null,null,null,null,null,null,null,null,null,null,9909,6]
[null,null,null,null,null,null,null,null,null,null,null,9911,6]
[null,null,null,null,null,null,null,null,null,null,null,9911,6]
[null,null,null,null,null,null,null,null,null,null,null,9912,6]
[null,null,null,null,null,null,null,null,null,null,null,9912,6]
[null,null,null,null,null,null,null,null,null,null,null,9913,6]
[null,null,null,null,null,null,null,null,null,null,null,9913,6]
[null,null,null,null,null,null,null,null,null,null,null,9913,6]
[null,null,null,null,null,null,null,null,null,null,null,9914,6]
[null,null,null,null,null,null,null,null,null,null,null,9915,6]
[null,null,null,null,null,null,null,null,null,null,null,9915,6]
[null,null,null,null,null,null,null,null,null,null,null,9915,6]
[null,null,null,null,null,null,null,null,null,null,null,9915,6]
[null,null,null,null,null,null,null,null,null,null,null,9917,6]
[null,null,null,null,null,null,null,null,null,null,null,9917,6]
[null,null,null,null,null,null,null,null,null,null,null,9918,6]
[null,null,null,null,null,null,null,null,null,null,null,9919,6]
[null,null,null,null,null,null,null,null,null,null,null,9921,6]
[null,null,null,null,null,null,null,null,null,null,null,9922,6]
[null,null,null,null,null,null,null,null,null,null,null,9923,6]
[null,null,null,null,null,null,null,null,null,null,null,9931,6]
[null,null,null,null,null,null,null,null,null,null,null,9931,6]
[null,null,null,null,null,null,null,null,null,null,null,9932,6]
[null,null,null,null,null,null,null,null,null,null,null,9933,6]
[null,null,null,null,null,null,null,null,null,null,null,9934,6]
[null,null,null,null,null,null,null,null,null,null,null,9934,6]
[null,null,null,null,null,null,null,null,null,null,null,9934,6]
[null,null,null,null,null,null,null,null,null,null,null,9935,6]
[null,null,null,null,null,null,null,null,null,null,null,9936,6]
[null,null,null,null,null,null,null,null,null,null,null,9937,6]
[null,null,null,null,null,null,null,null,null,null,null,9938,6]
[null,null,null,null,null,null,null,null,null,null,null,9938,6]
[null,null,null,null,null,null,null,null,null,null,null,9941,6]
[null,null,null,null,null,null,null,null,null,null,null,9941,6]
[null,null,null,null,null,null,null,null,null,null,null,9942,6]
[null,null,null,null,null,null,null,null,null,null,null,9943,6]
[null,null,null,null,null,null,null,null,null,null,null,9944,6]
[null,null,null,null,null,null,null,null,null,null,null,9944,6]
[null,null,null,null,null,null,null,null,null,null,null,9945,6]
[null,null,null,null,null,null,null,null,null,null,null,9946,6]
[null,null,null,null,null,null,null,null,null,null,null,9946,6]
[null,null,null,null,null,null,null,null,null,null,null,9951,6]
[null,null,null,null,null,null,null,null,null,null,null,9952,6]
[null,null,null,null,null,null,null,null,null,null,null,9953,6]
[null,null,null,null,null,null,null,null,null,null,null,9953,6]
[null,null,null,null,null,null,null,null,null,null,null,9954,6]
[null,null,null,null,null,null,null,null,null,null,null,9955,6]
[null,null,null,null,null,null,null,null,null,null,null,9961,6]
[null,null,null,null,null,null,null,null,null,null,null,9962,6]
[null,null,null,null,null,null,null,null,null,null,null,9962,6]
[null,null,null,null,null,null,null,null,null,null,null,9963,6]
[null,null,null,null,null,null,null,null,null,null,null,9963,6]
[null,null,null,null,null,null,null,null,null,null,null,9970,6]
[null,null,null,null,null,null,null,null,null,null,null,9971,6]
[null,null,null,null,null,null,null,null,null,null,null,9981,6]
[null,null,null,null,null,null,null,null,null,null,null,9982,6]
[null,null,null,null,null,null,null,null,null,null,null,9982,6]
[null,null,null,null,null,null,null,null,null,null,null,9982,6]
[null,null,null,null,null,null,null,null,null,null,null,9983,6]
[null,null,null,null,null,null,null,null,null,null,null,9983,6]
[null,null,null,null,null,null,null,null,null,null,null,9985,6]

{"sheet":"fedlap","index":1,"n_rows":41,"n_cols":9,"rows_kept":41,"cut":false,"hidden":false,"merged":[[37,0,37,9],[40,0,40,9],[34,0,34,8],[24,2,24,8],[22,2,22,8],[36,0,36,9],[26,2,26,4],[28,2,28,4]]}
[]
[]
[]
[]
[]
[]
[null,null,null,null,null,null,null,null,"Székhely:1082 Budapest, Baross u. 1."]
[null,null,null,null,null,null,null,null,"Cégjegyzékszám: 01-10-041566"]
[null,null,null,null,null,null,null,null,"Adószám: 10491984-2-44"]
[]
[]
[]
[]
[]
[]
["UNION-Flotta Kötelező biztosítási gépjármű-felelősségbiztosítási ajánlat"]
[]
[]
[null,"                      Biztosítási ajánlatkérésükre az UNION Biztosító biztosítási szabályzatai alapján "]
[null,null,"az alábbi előzetes díjajánlatot teszi."]
[]
[]
[null,"Ajánlatkérő cég neve:",{"$f":"díjszamító!B4","v":0}]
[]
[null,"Székhelye:"]
[]
[null,"Képviselő neve:"]
[]
[null,"Ajánlat kiadásának dátuma:",{"$f":"TODAY()","v":"2013-10-31"}]
[]
[]
[]
[]
[]
[]
["Az UNION Biztosító"]
["A hazai biztosítási piac felső harmadába tartozó UNION Biztosító a bécsi székhelyű, tőzsdén jegyzett Vienna Insurance Group cégcsoport tagja. A több csatornán elérhető, széles körű termékpalettája keretében az UNION Biztosító lakossági, vállalati, valamint intézményi ügyfelei számára kínál innovatív, egyedi igényeknek megfelelő biztosítási megoldásokat. E megoldások érintik a hosszú távú befektetési célokhoz, váratlan helyzetekre való anyagi felkészüléshez, magas színvonalú egészségügyi ellátás biztosításához, féltve őrzött otthon és vagyontárgyak védelméhez, vagy vállalkozások, vállalatok és intézmények vagyon-, felelősség- és gépjármű-biztosítási igényéhez kapcsolódó sajátos szükségleteket egyaránt. Üzleti aktivitása mellett a társadalmi szerepvállalásra is kiemelt figyelmet fordít. 2010. évi üzleti tevékenysége nyomán immár harmadik alkalommal érdemelte ki a legjobb üzleti márkákat fémjelző Business Superbrands díjat. Az UNION Biztosító 2010-ben 24,6 milliárd forint díjbevételre tett szert."]
["A Vienna Insurance Group (VIG) Közép-Kelet-Európa egyik vezető biztosítási csoportja: 24 országban, mintegy 25 ezer alkalmazottal közel 50 biztosítótársaságot működtet. "]
[]
["Vienna Insurance Group"]
["A tőzsdén jegyzett bécsi központú Vienna Insurance Group (VIG) egyike Közép-Kelet-Európa vezető biztosítási csoportjainak. Az ausztriai anyavállalaton kívül a Vienna Insurance Group leányvállalatokon keresztül az alábbi országokban folytat biztosítási tevékenységet: Albánia, Bulgária, Csehország, Észtország, Fehéroroszország, Grúzia, Horvátország, Lettország, Lengyelország, Liechtenstein, Litvánia, Macedónia, Magyarország, Németország, Románia, Oroszország, Szerbia, Szlovákia, Törökország és Ukrajna. A csoport Olaszországban és Szlovéniában is rendelkezik fiókképviseletekkel. Az osztrák piacon a Vienna Insurance Group (VIG) a Wiener Städtische Versicherung, a Donau Versicherung és a Sparkassen Versicherung vállalatokkal képviseli magát."]

{"sheet":"díjszamító","index":2,"n_rows":51,"n_cols":12,"rows_kept":51,"cut":false,"hidden":false,"merged":[[5,4,6,4],[5,3,6,3],[0,0,0,10],[3,7,4,8],[3,9,4,10],[2,0,2,10],[3,0,4,0],[3,1,4,6],[5,2,6,2],[5,0,6,1],[5,5,6,5],[5,6,6,6],[7,0,12,0],[8,7,10,9],[8,10,10,10],[11,7,12,9],[11,10,12,10],[14,10,18,10],[23,7,24,8],[17,9,18,9],[20,9,22,9],[5,10,6,10],[5,7,6,9],[7,7,7,9],[20,10,24,10],[13,7,13,9],[32,0,35,0],[14,0,18,0],[24,0,24,1],[20,7,22,8],[25,7,25,9],[14,7,16,8],[17,7,18,8],[14,9,16,9],[23,9,24,9],[30,0,30,1],[26,0,29,0],[20,0,23,0],[26,10,30,10],[32,7,35,8],[32,9,35,9],[26,7,30,9],[42,10,43,10],[32,10,35,10],[37,7,38,8],[37,9,38,9],[37,10,38,10],[40,7,40,8],[50,0,50,10],[42,3,42,6],[43,3,43,6],[44,3,44,6],[45,3,45,6],[46,0,46,2],[46,3,46,6],[44,7,44,9],[45,10,46,10],[47,0,48,10],[49,0,49,10]]}
["UNION - KGFB FLOTTA DÍJSZÁMÍTÁS 2014"]
[]
[{"$f":"IF(Munka2!V11=\"\",Munka2!V12,Munka2!V11)","v":"Tarifáláshoz az adószám, a TEÁOR kód és a székhely írányítószámának megadása kötelező!"}]
["Szerződő:",null,null,null,null,null,null,"Szerződő adószáma:"]
[]
["Gépjármű-kategóriák",null,"Alapdíj\n/ db (Ft)","db","Nemz. fuvarozás szorzó","Összevont Szorzó","Éves\ndíj / db (Ft)","Kedvezmények / pótdíjak",null,null,"Szorzó"]
[]
["Személygépkocsik \n(M1 gépjármű-kategória)","37 kW teljesítményig ",{"$f":"Munka2!C3","v":23400},null,{"$f":"Munka2!D3","v":1},{"$f":"IF(OR(Munka2!U7=0,Munka2!U6=0),\"#HIÁNYZIK\",IF(ISNUMBER(Munka2!U4),díjszamító!K38*díjszamító!K41*díjszamító!K43,díjszamító!K9*díjszamító!K15*díjszamító!K21*díjszamító!K33*díjszamító!K41*díjszamító!K43*K27))","v":"#HIÁNYZIK"},{"$f":"IF(ISNUMBER(D8),ROUND(C8*F8,0),\"\")","v":""},"Használat módja"]
[null,"38 kW-tól 50 kW teljesítményig ",{"$f":"Munka2!C4","v":27600},null,{"$f":"Munka2!D4","v":1},{"$f":"F$8","v":"#HIÁNYZIK"},{"$f":"IF(ISNUMBER(D9),ROUND(C9*F9,0),\"\")","v":""},null,null,null,{"$f":"Munka2!H17","v":1}]
[null,"51 kW-tól 70 kW teljesítményig ",{"$f":"Munka2!C5","v":32040},null,{"$f":"Munka2!D5","v":1},{"$f":"F$8","v":"#HIÁNYZIK"},""]
[null,"71 kW-tól 100 kW teljesítményig ",{"$f":"Munka2!C6","v":37800},null,{"$f":"Munka2!D6","v":1},"#HIÁNYZIK",""]
[null,"101 kW-tól 180 kW teljesítményig ",{"$f":"Munka2!C7","v":42000},null,{"$f":"Munka2!D7","v":1},"#HIÁNYZIK","","Szerződő Nemzetközi fuvarozással\n is foglalkozik?"]
[null,"180 kW teljesítmény felett ",{"$f":"Munka2!C8","v":49800},null,{"$f":"Munka2!D8","v":1},"#HIÁNYZIK",""]
[null,null,null,null,null,null,null,"Tevékenységi kör szorzó:"]
["Motorkerékpárok \n(L3e, L4e, L5e, L7e gépjármű-kategória)","12 kW teljesítményig ",{"$f":"Munka2!C10","v":6350},null,{"$f":"Munka2!D10","v":1},"#HIÁNYZIK",{"$f":"IF(ISNUMBER(D15),ROUND(C15*F15,0),\"\")","v":""},"Cégnyilvántartásba bejegyzett fő tevékenységi kör TEÁOR' 08 kódja:",null,null,{"$f":"Munka2!H33","v":1}]
[null,"13 kW-tól 35 kW teljesítményig ",{"$f":"Munka2!C11","v":10500},null,{"$f":"Munka2!D11","v":1},"#HIÁNYZIK",{"$f":"IF(ISNUMBER(D16),ROUND(C16*F16,0),\"\")","v":""}]
[null,"36 kW-tól 70 kW teljesítményig ",{"$f":"Munka2!C12","v":12900},null,{"$f":"Munka2!D12","v":1},"#HIÁNYZIK",{"$f":"IF(ISNUMBER(D17),ROUND(C17*F17,0),\"\")","v":""},null,null,null,null,{"$f":"IF(J33<31,1,IF(Munka2!H34=TRUE,1,IF(J15=\"\",0,1)))","v":1}]
[null,"71 kW-tól 94 kW teljesítményig ",{"$f":"Munka2!C13","v":13500},null,{"$f":"Munka2!D13","v":1},"#HIÁNYZIK","","TEÁOR nélküli (pl.: egyház, költségvetési szerv)"]
[null,"94 kW teljesítmény felett ",{"$f":"Munka2!C14","v":15000},null,{"$f":"Munka2!D14","v":1},"#HIÁNYZIK",""]
[null,null,null,null,null,null,null,"Terület szorzó"]
["Autóbuszok \n(M2, M3 gépjármű-kategória)","10-19 férőhely",{"$f":"Munka2!C16","v":80000},null,{"$f":"Munka2!D16","v":1},{"$f":"F$8*IF(ISNUMBER(Munka2!$U$4),1,E21)","v":{"$error":"#VALUE!"}},"","Székhely irányítószáma:",null,null,{"$f":"IF(ISNUMBER(Munka2!P15),IF(Munka2!H36=1,0.6,Munka2!P15),\"\")","v":""}]
[null,"20-42 férőhely",{"$f":"Munka2!C17","v":120000},null,{"$f":"Munka2!D17","v":1},{"$f":"F$8*IF(ISNUMBER(Munka2!$U$4),1,E22)","v":{"$error":"#VALUE!"}},""]
[null,"43-79 férőhely",{"$f":"Munka2!C18","v":215000},null,{"$f":"Munka2!D18","v":1},{"$f":"F$8*IF(ISNUMBER(Munka2!$U$4),1,E23)","v":{"$error":"#VALUE!"}},""]
[null,"80 férőhelytől",{"$f":"Munka2!C19","v":255000},null,{"$f":"Munka2!D19","v":1},{"$f":"F$8*IF(ISNUMBER(Munka2!$U$4),1,E24)","v":{"$error":"#VALUE!"}},"","Szerződő flottakezeléssel is foglalkozik:"]
["Trolibusz (M3 gépjármű-kategória)",null,{"$f":"Munka2!C20","v":400000},null,{"$f":"Munka2!D20","v":1},{"$f":"F$8*E25","v":{"$error":"#VALUE!"}},""]
[null,null,null,null,null,null,null,"Együttbiztosítás szorzó"]
["Tehergépkocsik \n(N1, N2, N3 gépjármű-kategória)","3500 kg össztömegig",{"$f":"Munka2!C24","v":59880},null,{"$f":"Munka2!D24","v":1},{"$f":"F$8*IF(ISNUMBER(Munka2!$U$4),1,E27)","v":{"$error":"#VALUE!"}},{"$f":"IF(ISNUMBER(D27),ROUND(C27*F27,0),\"\")","v":""},"A szerződő rendelkezik:",null,null,{"$f":"IF(J33>30,1,Munka2!D47)","v":1}]
[null,"3501-7500 kg össztömegig",{"$f":"Munka2!C25","v":102600},null,{"$f":"Munka2!D25","v":1},{"$f":"F$8*IF(ISNUMBER(Munka2!$U$4),1,E28)","v":{"$error":"#VALUE!"}},""]
[null,"7501-12000 kg össztömegig",{"$f":"Munka2!C26","v":152280},null,{"$f":"Munka2!D26","v":1},{"$f":"F$8*IF(ISNUMBER(Munka2!$U$4),1,E29)","v":{"$error":"#VALUE!"}},""]
[null,"12000 kg össztömeg felett",{"$f":"Munka2!C27","v":222000},null,{"$f":"Munka2!D27","v":1},{"$f":"F$8*IF(ISNUMBER(Munka2!$U$4),1,E30)","v":{"$error":"#VALUE!"}},""]
["Vontatók (N1, N2, N3 gépjármű-kategória)",null,{"$f":"Munka2!C28","v":640000},null,{"$f":"Munka2!D28","v":1},{"$f":"F$8*IF(ISNUMBER(Munka2!$U$4),1,E31)","v":{"$error":"#VALUE!"}},{"$f":"IF(ISNUMBER(D31),ROUND(C31*F31,0),\"\")","v":""}]
[null,null,null,null,null,null,null,"A flotta nagyságától függő szorzó"]
["Pótkocsik, félpótkocsik (O1, O2, O3, O4, R1, R2, R3, R4 gépjármű-kategória)","750 kg össztömegig",{"$f":"Munka2!C30","v":2400},null,{"$f":"Munka2!D30","v":1},{"$f":"F$8*IF(ISNUMBER(Munka2!$U$4),1,E33)","v":{"$error":"#VALUE!"}},"","A szerződő által üzemben tartott járművek  száma:",null,null,{"$f":"IF(Munka2!H35=1,1,Munka2!H11)","v":1}]
[null,"751-3500 kg össztömegig",{"$f":"Munka2!C31","v":3000},null,{"$f":"Munka2!D31","v":1},{"$f":"F$8*IF(ISNUMBER(Munka2!$U$4),1,E34)","v":{"$error":"#VALUE!"}},""]
[null,"3501-10000 kg össztömegig",{"$f":"Munka2!C32","v":3850},null,{"$f":"Munka2!D32","v":1},{"$f":"F$8*IF(ISNUMBER(Munka2!$U$4),1,E35)","v":{"$error":"#VALUE!"}},""]
[null,"10000 kg össztömeg felett",{"$f":"Munka2!C33","v":10680},null,{"$f":"Munka2!D33","v":1},{"$f":"F$8*IF(ISNUMBER(Munka2!$U$4),1,E36)","v":{"$error":"#VALUE!"}},""]
[null,null,null,null,null,null,null,"Egyedi UNION-Flotta szorzó"]
["Mezőgazdasági vontatók (T1, T2, T3, T4, T5 gépjármű-kategória)","mezőgazdasági vontató",{"$f":"Munka2!C35","v":14000},null,{"$f":"Munka2!D35","v":1},"#HIÁNYZIK","","Flotta keret-kötvényszám vagy szerződő partnerszám:",null,null,{"$f":"IF(ISNUMBER(Munka2!U4),Munka2!U4,1)","v":1}]
["Lassú járművek","lassú jármű",{"$f":"Munka2!C36","v":12000},null,{"$f":"Munka2!D36","v":1},"#HIÁNYZIK",""]
["Munkagépek (S1, S2 gépjármű-kategória)","munkagép",{"$f":"Munka2!C37","v":12840},null,{"$f":"Munka2!D37","v":1},"#HIÁNYZIK","","Üzleti kedvezmény"]
["Segédmotoros kerékpárok (L1e, L2e gépjármű-kategória)","segédmotoros kerékpár",{"$f":"Munka2!C38","v":6840},null,{"$f":"Munka2!D38","v":1},"#HIÁNYZIK","","Üzleti kedvezmény (jutalék mentes)",null,null,{"$f":"IF(Munka2!H2=TRUE,0.9,1)","v":1}]
["Négykerekű segédmotoros kerékpárok (L6e gépjármű-kategória)","segédmotoros kerékpár",{"$f":"Munka2!C39","v":7800},null,{"$f":"Munka2!D39","v":1},"#HIÁNYZIK","","Díjfizetési gyakoriság szorzó"]
["Járművek száma összesen:",null,null,{"$f":"SUM(D8:D42)","v":0},null,null,null,null,null,null,{"$f":"Munka2!H23","v":1}]
["Fizetendő éves díj összesen:",null,null,{"$f":"IF(L17=1,IF(D43<5,\"\",IF(J33<L27,\"\",IF(D43>0,SUMPRODUCT(D8:D42,G8:G42),\"\"))),\"\")","v":""}]
[{"$f":"CONCATENATE(Munka2!I23,\" díj:\")","v":"Negyedéves díj:"},null,null,{"$f":"IF(D44=\"\",\"\",D44/Munka2!J23)","v":""},null,null,null,"Kiegészítő biztosítások",null,null,"Jármű (db)"]
[{"$f":"CONCATENATE(\"Baleseti adó (Ft / \",Munka2!F23,\"):\")","v":"Baleseti adó (Ft / negyedév):"},null,null,{"$f":"ROUND(Munka2!Z39/Munka2!J23,0)","v":0},null,null,null,null,null,null,{"$f":"IF(L47=FALSE,\"\",Munka2!D50)","v":""}]
["Kiegészítő biztosítás Éves díj:",null,null,{"$f":"Munka2!F50","v":""},null,null,null,null,null,null,null,{"$f":"Munka2!C50","v":false}]
[{"$f":"IF(J33<D43,\"Hiba! A szerződő által üzemben tartott járművek száma nem lehet kisebb, mint a tarifálásnál megadott jármű szám!\",\"\")","v":""}]
[]
[{"$f":"IF(L47=TRUE,\"AZ UNION-Flotta Értékvédelem Bázis biztosítás a lila színnel jelölt személy- és tehergépjárművekre terjed ki!\",\"\")","v":""}]
["A tarifáló program a szerződés megkötéséhez szükséges keretszerződést és adatközlőt is tartalmazza. Az UNION Biztosítóhoz kötött flották esetében az adatközlők leadásakor kérjük mellékelni a szerződő által aláírt keretszerződést 3 példányban, alkuszi megbízást, illetve az ügyfél TEÁOR (főtevékenység) azonosítására szolgáló dokumentum másolatát.  "]

{"sheet":"Keretszerz","index":3,"n_rows":72,"n_cols":17,"rows_kept":72,"cut":false,"hidden":false,"merged":[[71,1,71,15],[57,1,57,15],[54,1,54,15],[56,1,56,15],[69,1,69,15],[70,1,70,15],[59,2,59,3],[59,5,59,6],[64,3,64,6],[64,10,64,13],[68,1,68,15],[31,1,31,15],[33,1,33,15],[38,1,38,15],[51,2,51,12],[52,1,52,15],[49,1,49,15],[40,1,40,15],[35,2,35,12],[43,1,43,15],[48,2,48,12],[37,1,37,15],[42,1,42,15],[36,1,36,15],[46,2,46,9],[47,1,47,15],[24,1,24,15],[28,1,28,15],[30,1,30,6],[21,1,21,15],[25,5,25,6],[25,1,25,4],[27,1,27,15],[30,7,30,8],[29,2,29,7],[6,1,6,15],[7,1,7,15],[26,5,26,6],[26,1,26,4],[10,1,10,10],[10,13,10,15],[9,1,9,4],[22,1,22,15],[23,1,23,15],[18,8,18,15],[18,1,18,7],[15,1,15,15],[16,1,16,2],[17,1,17,10],[17,12,17,15],[11,2,11,11]]}
[]
[]
[]
[]
[]
[]
[]
[null,"KÖTELEZŐ GÉPJÁRMŰ FLOTTA-BIZTOSÍTÁSI SZERZŐDÉS"]
[]
[null,"Amely létrejött egyrészt az"]
[null,{"$f":"díjszamító!B4","v":0},null,null,null,null,null,null,null,null,null,"(adószám:",null,{"$f":"díjszamító!J4","v":0}]
[null,"cím:",null,null,null,null,null,null,null,null,null,null,") ,mint szerződő "]
[null,"(továbbiakban: Szerződő),"]
[null,"másrészt  az"]
[null," UNION Vienna Insurance Group Biztosító Zrt. (cím: 1082 Budapest, Baross u. 1., "]
[null,"adószám: 10491984-4-44) , mint biztosító (továbbiakban: Biztosító) "]
[null,"között a(z)"]
[null,null,null,null,null,null,null,null,null,null,null,"(cím:"]
[null,null,null,null,null,null,null,null,") közvetítésével (továbbiakban: Közvetítő) "]
[null,"az alábbi feltételek szerint:"]
[]
[null,"Szerződés jellege: keret-szerződés"]
[null,"Biztosítás tartama:  határozatlan"]
[null,"Biztosítási évforduló:  minden év január 1."]
[null,"Biztosítási időszak:   egy naptári év"]
[null,"Kockázatviselés kezdete: ",null,null,null,"2014-01-01"]
[null,"Díjfizetési gyakoriság:"]
[null,"Díjfizetés módja:   banki utalás-összevont számla -számlarészletezővel  "]
[]
[null,"1.","Általános rendelkezések"]
[null," Szerződő ajánlata alapján Biztosító",null,null,null,null,null,null,null,"-tól Szerződő járműveire a hatályos jogszabály"]
[null," – 2009. évi LXII. törvény és annak felhatalmazása alapján alkotott rendeletek  – szerinti kötelező gépjármű-felelősségbiztosítási (KGFB) fedezetet nyújtja."]
[]
[null," A biztosítás éves díját Biztosító a Magyar Nemzeti Bank honlapján meghirdetett flotta-díjtarifa szerint állapítja meg. Az egyes korrekciós tényezők a flottában biztosított összes gépjárműre együttesen vehetők igénybe, függetlenül az egyes gépjárművek eltérő használati módjától. Az egységes korrekciós tényezők alkalmazásánál mindig a legmagasabb értékű korrekciós tényezőt veszi figyelembe a Biztosító."]
[]
[null,"2.","Díjfizetésre és díjkönyvelésre vonatkozó rendelkezések"]
[null,"A biztosítás első díjrészlete a számla kiállításának napján; amennyiben a számla kiállításának napja korábbi, mint a kockázatviselés kezdete, a kockázatviselés kezdetének napján esedékes. A folytatólagos díjrészlet az adott díjfizetési időszaknak az első napján esedékes."]
[null,"A biztosítási díj mellett – a népegészségügyi termékadóról szóló 2011. évi CIII. törvényben foglaltaknak megfelelően – baleseti adót kell fizetni. A befizetett díjat a biztosító először a baleseti adóra számolja el, és az ezek után fennmaradó összeget írja jóvá a biztosítási szerződésen."]
[null,"Ha a Szerződő a biztosítási díjat az esedékességtől számított 60. napig nem fizeti meg, a szerződés az esedékességtől számított 60. napon megszűnik. "]
[]
[null,"Díjnemfizetés miatti megszűnés esetén a Szerződő az esedékességtől a szerződés megszűnéséig terjedő időszakra a biztosítási díj megfizetésére köteles."]
[]
[null,"Biztosító a flottában biztosított egyes gépjárműveket külön alszerződéseken tartja nyilván. Ha a Szerződő által fizetett díj nem, vagy nem egészében fedezi a díjelőírást, akkor a fizetett díj alszerződésekre könyvelésekor Biztosító az alábbi módon jár el.\nHa az egyes alszerződések különböző időpontig díjrendezettek, akkor a biztosító minden esetben a legrégebbi díjhátralékú alszerződésre könyvel először díjat. Ha az egyes alszerződések ugyanaddig az időpontig díjrendezettek, akkor a Biztosító minden esetben a legkisebb szerződésszámú hátralékos alszerződésre könyvel először díjat."]
[null,"Amennyiben a Szerződő a biztosítási díj megfizetésén kívül fedezetlenségi díj fizetésére is köteles, a Biztosító először a baleseti adót, majd a fedezetlenségi díjat egyenlíti ki és az ezek után fennmaradó összeget írja jóvá az új szerződésen."]
[]
[]
[null,"3.","Kiegészítő biztosításra vonatkozó rendelkezések"]
[null,"A Szerződő elfogadja az UNION-Flotta Gépjármű Értékvédelem Bázis kiegészítő biztosítás szerződési feltételeiben foglaltakat.",null,null,null,null,null,null,null,null,null,null,null,null,null,null,{"$f":"Munka2!C50","v":false}]
[null,{"$f":"IF(Q48=FALSE,\"3.\",\"4.\")","v":"3."},"Változás bejelentési kötelezettség"]
[null,"Amennyiben a gépjárműállományban változás történik, ezt a szerződő köteles a lehető legrövidebb időn belül, de legkésőbb 5 munkanapon belül a biztosítónak bejelenteni. Az állomány változásából következő díjkülönbözetet a felek minden esetben az adott időszakot követő 30 munkanapon belül számolják el."]
[]
[null,{"$f":"IF(Q48=FALSE,\"4.\",\"5.\")","v":"4."},"Egyéb rendelkezések"]
[null,"Szerződő felhatalmazza Biztosítót, hogy a biztosítási szerződés megkötéséhez, módosításához, állományban tartásához, valamint a szolgáltatás teljesítéséhez szükséges, a gépjárműre vonatkozó adatokat a Közigazgatási és Elektronikus Közszolgáltatások Központi Hivatala által vezetett nyilvántartásból lekérje."]
[]
[null,"Biztosító Szerződő gépjárműveinek kötelező gépjármű-felelősségbiztosításait egy keretkötvényben kezeli, valamint a járművenkénti kármentességi besorolást a díj meghatározásánál nem veszi figyelembe."]
[]
[null,"A jogszabályok változása esetén a jelen szerződés rendelkezéseinek és a hatályos jogszabályok kötelező érvényű előírásainak esetleges eltérésekor a hatályos jogszabályok az irányadók."]
[null,{"$f":"IF(Q48=FALSE,\"Szerződő aláírásával igazolja, hogy az 1. és 2. számú mellékletet átvette.\",\"Szerződő aláírásával igazolja, hogy az 1. ,2. és 3. számú mellékletet átvette.\")","v":"Szerződő aláírásával igazolja, hogy az 1. és 2. számú mellékletet átvette."}]
[]
[null,"Kelt.:",null,null,","]
[]
[]
[]
[]
[null,null,null,"Szerződő",null,null,null,null,null,null,"Biztosító"]
[]
[]
[]
[]
[null,"1. sz. melléklet: UNION – kgfb flotta díjszámítás 2013"]
[null,"2. sz. melléklet: UNION-Flotta kötelező gépjármű-felelősségbiztosítás biztosítási feltételei"]
[null,"3. sz. melléklet: UNION-Flotta Gépjármű Értékvédelem Bázis Biztosítás Szerződési Feltételek"]

{"sheet":"2. sz. mellekelt ","index":4,"n_rows":546,"n_cols":1,"rows_kept":546,"cut":false,"hidden":false,"merged":[]}
[]
[]
[]
[]
[]
[]
["UNION-Flotta kötelező gépjármű-felelősségbiztosítás"]
["Biztosítási Feltételek"]
[]
["A biztosítótársaságra vonatkozó adatok"]
["UNION Vienna Insurance Group Biztosító Zrt."]
["H-1082 Budapest, Baross u. 1."]
["H-1461 Budapest, Pf.: 131."]
["Telefon: (36-1) 486-4200"]
["Cégjegyzékszám: 01-10-041566 Fővárosi Bíróság mint Cégbíróság"]
[]
["2009. évi LXII. törvény a kötelező gépjármű-felelősségbiztosításról"]
[]
["A biztosító jelen szerződési feltétele a kötelező gépjármű-felelősségbiztosításról szóló 2009. évi LXII. törvény rendelkezéseiben foglaltakra figyelemmel készült, a jogszabály szövegének módosítása nélkül, annak számozásának megtartásával, csak a szerződő felek jogait és kötelezettségeit érintő rendelkezések figyelembevételével."]
[]
["ÁLTALÁNOS RENDELKEZÉSEK"]
[]
["A törvény hatálya"]
["1. § Ha nemzetközi szerződés eltérően nem rendelkezik, e törvény hatálya kiterjed:"]
["a) minden magyarországi telephelyű gépjármű üzemben tartójára, továbbá más tagállami telephelyű gépjármű – ha annak rendeltetés helye szerinti tagállama Magyarország – tulajdonosára, és az általuk kötött kötelező gépjármű-felelősségbiztosítási szerződésre;"]
["b) a külföldi telephelyű gépjármű Magyarország területére történő belépésének, valamint Magyarország területén a fogalomban történő részvételének feltételeire;"]
["c) a biztosítók, a kárrendezési megbízott, kárképviselő, a levelező, a Kártalanítási Számla, a Kártalanítási Alap, a Nemzeti Iroda, a Kártalanítási Szervezet, az Információs Központ, valamint a Magyar Biztosítók Szövetségének (a továbbiakban: MABISZ) e törvényben szabályozott tevékenységére;"]
["d)  a pénzügyi közvetítőrendszer felügyeletével kapcsolatos feladatkörében eljáró Magyar Nemzeti Bank (a továbbiakban: Felügyelet), a biztosító felszámolójának, a kötelező gépjármű-felelősségbiztosítást igazoló okirat (a kötvényt is beleértve) adatait, valamint egyéb vonatkozó adatokat nyilvántartó szervnek (a továbbiakban: kötvénynyilvántartó szerv), a kárnyilvántartással kapcsolatos feladatokat ellátó kárnyilvántartó szervnek, a fővárosi és megyei kormányhivatal járási (fővárosi kerületi) hivatalának (a továbbiakban: járási hivatal) és a vámhatóságnak e törvényben szabályozott tevékenységére."]
[]
["2. § E törvény hatálya nem terjed ki:"]
["a) a nemzetközi gépjármű-biztosítási – a tagállamok és más államok nemzeti irodái közötti – megállapodásból és a kapcsolódó megállapodásokból eredő – e törvényben nem szabályozott – feladatok ellátására;"]
["b) Magyarország területén rendezett gépjárműversenyen (edzésen) részt vevő gépjárművekre kötött felelősségbiztosítási szerződésekre;"]
["c) arra az esetre, ha az e törvényben foglaltaktól Magyarország területén állomásozó vagy áthaladó külföldi katonai gépjárművek vonatkozásában jogszabály eltérő szabályokat állapít meg."]
[]
["Értelmező rendelkezések"]
["3. § E törvény alkalmazásában:"]
["1. Belső Szabályzat: a Bizottság 2003. július 28-i, a 72/166/EGK tanácsi irányelvnek a gépjármű-felelősségbiztosítás ellenőrzésére vonatkozó alkalmazásáról szóló 2003/564/EK határozatának függelékében foglalt, a nemzeti irodák egymás közötti kapcsolatait rendező szabályzat;"]
["2. biztosítási időszak: a határozatlan tartamú szerződések esetében – a díjfizetés gyakoriságától függetlenül – az az időtartam, amelyre a megállapított díj vonatkozik;"]
["3. biztosító: a biztosítókról és biztosítási tevékenységről szóló 2003. évi LX. törvényben (a továbbiakban: Bit.) meghatározott szervezet, amely a székhely szerinti tagállamában engedélyt kapott a gépjármű-felelősségbiztosítási tevékenység végzésére, és Magyarország területén az e törvényben foglaltaknak megfelelően a kötelező gépjármű-felelősségbiztosítási (a továbbiakban: biztosítás) tevékenység folytatására jogosult;"]
["4. biztosított: a gépjármű biztosítással rendelkező üzemben tartója és a gépjárművet vezető személy;"]
["5. díjtarifa: miniszteri rendeletben meghatározott gépjármű-kategóriánként, és – a flotta kivételével – bonus-malus osztályonként, biztosító által megállapított alapdíjak és a díj meghatározásánál alkalmazható valamennyi korrekciós tényező összessége;"]
["6. egyedi szerződés: adott üzemben tartó által, egy meghatározott gépjárműre kötött, e törvénynek megfelelő biztosítási szerződés;"]
["7. fedezetlenségi díj: az adott gépjármű vonatkozásában az üzemben tartó biztosítási kötelezettségének – a szünetelés időtartamának kivételével – díjfizetés hiányában kockázatviselés nélküli időtartamára (fedezetlenség időtartama) a Kártalanítási Számla kezelőjét megillető, általa meghatározott díjtarifa alapján utólagosan megállapított díj;"]
["8. forgalmi engedély: az állandó vagy ideiglenes forgalmi engedély, az ideiglenes forgalomban tartási engedély, valamint a lassú jármű és a négykerekű segédmotoros kerékpár (quad) igazolólapja;"]
["8/A. gazdasági totálkár: a káresemény következtében károsult gépjármű megjavíttatása gazdaságilag nem indokolható, mivel annak javítási, valamint a kár elhárításával kapcsolatos egyéb költségei, illetve a javítást követően esetlegesen fennmaradó értékcsökkenés összege a gépjármű károsodás időpontjában fennálló forgalmi értékének maradványértékkel (roncsértékkel) csökkentett összegét meghaladja;"]
["9. gépjárműflotta: egy adott biztosítónál ugyanazon – egyéni vállalkozó, jogi személy, jogi személyiség nélküli gazdasági társaság – szerződő üzemben tartó által biztosított gépjárművek együttesen kezelt csoportja, ha ezen gépjárművek darabszáma a biztosítási időszak kezdőnapján eléri az ötöt;"]
["10. gépjármű: a közúti forgalomban való részvétel feltételeként hatósági engedélyre és jelzésre kötelezett – a közúti közlekedés szabályairól szóló 1/1975. (II. 5.) KPM-BM együttes rendelet (KRESZ) 1. számú függelékének II. b) pontjában meghatározott – gépjármű, pótkocsi, félpótkocsi, mezőgazdasági vontató, négykerekű segédmotoros kerékpár (quad), lassú jármű és munkagép, továbbá a hatósági engedélyre és jelzésre nem kötelezett segédmotoros kerékpár;"]
["11. gépjárműverseny: zárt versenypályán vagy a forgalom elől elzárt közúton (útszakaszon) tartott, gépjárművek számára rendezett sportrendezvény;"]
["12. harmadik ország: a Bit.-ben meghatározott fogalom;"]
["13. harmadik országbeli biztosító: a Bit.-ben meghatározott fogalom;"]
["14. határon átnyúló szolgáltatás: a Bit.-ben meghatározott fogalom;"]
["15. hozott kárelőzményi igazolás: más tagállam által előírt kötelezettség alapján megkötött gépjármű-felelősségbiztosítási szerződésre vonatkozó igazolás, amely tartalmazza az adott biztosítónál nyilvántartott időszakot, valamint a szerződés hatálya alatt harmadik személyeknek okozott és a más tagállami biztosító által az igazolás kiadásának napjáig elismert, vagy vele szemben jogerősen megítélt kártérítések alapjául szolgáló káresetek számát, időpontját, illetve a kármentesség tényét;"]
["16. Információs Központ: a gépjármű üzemeltetésével harmadik személyeknek okozott károkból eredő kárigények érvényesítése érdekében adatok közlése és e törvényben meghatározott egyéb feladatok ellátása érdekében létrehozott szervezet;"]
["17. ismeretlen gépjármű: az a gépjármű, amely nem azonosítható, illetve utólag sem azonosítható, mivel elhagyta a baleset helyszínét, vagy azonosító adatokkal nem rendelkezik, illetve azokat meghamisították vagy nem felismerhetők;"]
["18. kárképviselő: a határon átnyúló szolgáltatás esetében a biztosító által a gépjármű-felelősségbiztosítási károk rendezésével, a biztosító peres és peren kívüli képviseletével megbízott, illetve arra jogosult személy vagy szervezet;"]
["19. károsult: a gépjárművel okozott kár esetén kártérítésre jogosult személy vagy szervezet;"]
["20. kárrendezési megbízott: a gépjármű-felelősségbiztosítási tevékenységet végző biztosító székhely szerinti tagállamától eltérő tagállamban működő megbízottja, aki a biztosító által biztosított gépjármű üzemeltetésével kapcsolatban felmerült kárigényeket a károsult lakóhelye (székhelye) szerinti tagállamban kezeli és rendezi, valamint a biztosítót a károsulttal szemben képviseli;"]
["21. Kártalanítási Alap: az e törvény szerinti biztosítók által létrehozott és finanszírozott pénzalap, mely azon biztosítónál (a továbbiakban: felszámolás alatt álló biztosító) a károkozás időpontjában e törvény szerinti biztosítási szerződés alapján fedezettel rendelkező üzemben tartó gépjárművével okozott károk megtérítését fedezi, mellyel szemben a biztosító tevékenységét engedélyező tagállamban felszámolási eljárás megindult;"]
["22. Kártalanítási Számla (Garanciaalap): az e törvény szerinti biztosítók által létrehozott és folyamatosan finanszírozott pénzalap, amelynek feladata a biztosítási kötelezettség ellenére biztosítással nem rendelkező üzemben tartó gépjárműve által vagy az e törvényben meghatározott korlátozásokkal az ismeretlen üzemben tartó gépjárműve által, valamint az ismeretlen gépjárművel okozott károk megtérítése, amennyiben a kötelezettségvállalás országa Magyarország;"]
["23. kártalanítási szervezet: a gépjármű-felelősségbiztosítási tevékenységet végző biztosítók által a székhelyük szerinti tagállamban működtetett szervezet, amelynek feladata a belföldi károsult más tagállam területén telephellyel rendelkező gépjármű üzemeltetéséből eredően a zöldkártyarendszer valamely országában elszenvedett kára kapcsán a károkozó biztosítója vagy annak kárrendezési megbízottja kárrendezésének elmaradása esetén a kárigények elbírálása és kielégítése e törvényben meghatározott esetekben;"]
["24. kötelezettségvállalás országa: bármely fajta gépjármű biztosítása esetén a"]
["a) telephely szerinti ország, vagy"]
["b) baleset bekövetkezésének helye szerinti ország, amennyiben a hatósági jelzés viselésére kötelezett gépjármű baleset részesévé vált, és nem rendelkezik érvényes hatósági jelzéssel, illetve a rajta lévő hatósági jelzés nem rendelhető, vagy már nem rendelhető hozzá, vagy"]
["c) rendeltetés helye szerinti tagállam;"]
["25. külföldi: a devizakorlátozások megszüntetéséről, valamint egyes kapcsolódó törvények módosításáról szóló 2001. évi XCIII. törvény 2. §-ának 2. pontjában meghatározott fogalom;"]
["26. levelező: olyan biztosító, a biztosító részére kárrendezési tevékenységet végző szervezet, kárrendezési megbízott, egyéb szervezet vagy személy, akit vagy amelyet a működése szerinti ország nemzeti irodájának jóváhagyásával a zöldkártyarendszerhez tartozó ország biztosítója jelöl a biztosítottjai által a levelező országában okozott gépjármű-felelősségbiztosítási károk kezelésére és rendezésére;"]
["27. Nemzeti Iroda: az e törvény szerinti biztosítók szervezete, amely ellátja a nemzetközi gépjármű-biztosítási megállapodásból és a kapcsolódó egyezményekből eredő koordinációs, kárrendezési és elszámolási feladatokat;"]
["28. rendeltetés helye szerinti tagállam: gépjármű tulajdonjogának átruházása esetén a tulajdonszerzést követően a rendelkezésre bocsátástól számított harmincnapos időtartam folyamán az – a gépjármű telephely szerinti országától eltérő – tagállam,"]
["a) ahol a tulajdont szerző természetes személy állandó lakóhelye, a jogi személy, jogi személyiség nélküli szervezet tulajdonszerzése esetén annak székhelye található, illetve"]
["b) amelyben a tulajdont szerző szokásos tartózkodási helye van, vagy ha a szerződő jogi személy, jogi személyiség nélküli szervezet, az a tagállam, amelyben a tulajdont szerzőnek a szerződéssel érintett telephelye, fióktelepe található;"]
["29. Rendszámegyezmény: a nemzeti irodák között létrejött olyan megállapodás, amely alapján az egyezményben részes országok hatóságai a zöldkártyában megtestesülő igazolás helyett az illető országban megkövetelt gépjármű-felelősségbiztosítási fedezet igazolásául a jármű hatósági jelzését (forgalmi rendszámát) az országjellel együtt elfogadják;"]
["30. súlyos személyi sérülés: a balesetből eredően legalább 25%-os össz-szervezeti egészségkárosodással járó maradandó fogyatékosságot okozó, vagy a balesetből eredő, legalább 6 hónapos gyógytartammal járó súlyos egészségromlást okozó sérülés;"]
["31. székhely szerinti tagállam: a Bit.-ben a székhely tagállamaként meghatározott fogalom;"]
["32. tagállam: az Európai Gazdasági Térségről szóló megállapodásban részes állam és Svájc;"]
["33. telephely szerinti ország: az az ország,"]
["a) amelynek hatósága a gépjárművet állandó vagy ideiglenes hatósági jelzéssel ellátta, vagy"]
["b) amelyben a hatósági jelzés viselésére nem kötelezett gépjárművek esetében a tulajdonos vagy a gépjármű felett egyébként rendelkezési jogot gyakorló személy (jogi személy, jogi személyiség nélküli szervezet) állandó lakóhelye (székhelye), illetve szokásos tartózkodási helye (az érintett telephelye, fióktelepe) található;"]
["34. türelmi idő: a díj esedékességétől számított hatvannapos időszak, melynek a díj megfizetése nélkül történő leteltével a szerződés – amennyiben egyéb okból még nem szűnt meg – díjnemfizetéssel megszűnik;"]
["35. üzemben tartó: a gépjármű telephelye szerinti ország hatóságai által kibocsátott okiratba bejegyzett üzemben tartó (engedélyes, engedély jogosultja), ennek hiányában a tulajdonos;"]
["36. zöldkártya: a zöldkártyarendszer országaiban elfogadott, egységes szabványnak megfelelő nemzetközi gépjármű-felelősségbiztosítási igazolvány (kártya), amelyet a nemzeti iroda nevében a biztosítási szerződésnek megfelelően a biztosítók állítanak ki az üzemben tartó számára, a meglátogatott országban megkövetelt gépjármű-felelősségbiztosítási fedezet meglétének igazolására;"]
["37. zöldkártyarendszer: a nemzeti irodák közötti megállapodások alapján az ezen megállapodásokban részes országok rendszere, mely rendszerhez tartozó országok hatóságai a zöldkártyában megtestesülő igazolást az országban megkövetelt gépjármű-felelősségbiztosítási fedezet igazolásául elfogadják."]
[]
["A GÉPJÁRMÛ-FELELÕSSÉGBIZTOSÍTÁS SZABÁLYAI"]
["A GÉPJÁRMÛ-FELELÕSSÉGBIZTOSÍTÁS ÁLTALÁNOS SZABÁLYAI"]
[]
["A biztosítási kötelezettség"]
[]
["4. § (1) Minden magyarországi telephelyű gépjármű üzemben tartója köteles – a külön jogszabály alapján mentesített gépjárművek kivételével – az e törvény szerinti biztosítóval a gépjármű üzemeltetése során okozott károk fedezetére, az e törvényben meghatározott feltételek szerinti biztosítási szerződést kötni, és azt díjfizetéssel hatályban tartani (biztosítási kötelezettség)."]
["(2) A biztosítási kötelezettség, ha jogszabály másként nem rendelkezik, a mindenkori üzemben tartót a gépjármű hatósági engedéllyel és jelzéssel való ellátásának időpontjától – a szünetelés kivételével – a gépjármű forgalomból történő kivonásáig, illetve a külön jogszabályban meghatározott forgalomba helyezésre nem kötelezett gépjármű esetében a forgalomban történő részvétel kezdetétől a részvétel végleges megszüntetéséig terheli."]
["(3) A szerződés megkötésére vonatkozó kötelezettség tekintetében üzemben tartónak minősül a gépjármű tulajdonosa által – szerződés vagy más hitelt érdemlően igazolt jogcím alapján – üzemben tartóként megnevezett személy."]
["(4) Ha a szerződéskötésre a tulajdonjog átszállása miatt kerül sor, az e törvény szerinti új üzemben tartó köteles a tulajdonjog átszállását követően a biztosítási szerződést haladéktalanul megkötni."]
["(5) Ideiglenes forgalomban tartás engedélyezése, illetve ideiglenes forgalmi engedély kiadása esetén a biztosítási kötelezettség az ideiglenes forgalomban tartási engedély, illetve az ideiglenes forgalmi engedély érvényességének időtartama alatt áll fenn."]
["(6) Az üzemben tartó halála esetén, ha a biztosítási kötelezettség címzettje nem állapítható meg, a szerződés legkésőbb a hagyatéki eljárást lezáró határozat jogerőre emelkedésétől számított 30 napig tartható hatályban, amennyiben a gépjármű birtokosa a halál tényét a biztosítónak bejelentette, és a szerződést díjfizetéssel hatályban tartja."]
["(7) Más tagállami telephelyű gépjármű tulajdonosa – ha a gépjármű rendeltetés helye szerinti tagállama Magyarország – köteles a tulajdonszerzést követően a rendelkezésre bocsátástól számított harmincnapos időtartamra az e törvény szerinti biztosítással rendelkezni."]
[]
["A szerződés létrejötte és megszűnése"]
[]
["5. § (1) A biztosító a magyarországi telephelyű gépjármű üzemben tartójának, valamint azon gépjármű tulajdonosának, melynek rendeltetés helye szerinti tagállama a Magyar Köztársaság, az e törvényben meghatározott feltételek szerinti biztosítási szerződés megkötésére vonatkozó – a biztosító díjtarifájának megfelelő – ajánlatát a 13. § (1) bekezdésében meghatározott összeghatárok szerint köteles elfogadni. A biztosító a biztosítási időszak kezdetét hatvan nappal megelőzően tett ajánlatot nem fogadhatja el, és ezen időpontot megelőzően szerződést nem köthet, az így létrejött szerződés érvénytelen. A biztosító az ajánlat elutasításáról annak beérkezésétől számított tizenöt napon belül értesíti az üzemben tartót."]
["(2) Ha a biztosítási szerződés a biztosítási időszak tartama alatt a 21. § (4) bekezdésében meghatározottak szerint (díjnemfizetés) szűnik meg, az üzemben tartónak az adott biztosítási időszak hátralévő részére fedezetet nyújtó szerződés megkötésére vonatkozó ajánlatát kizárólag az a biztosító jogosult és köteles elfogadni, amelynél a szerződés az adott biztosítási időszakban díjnemfizetéssel szűnt meg."]
["(3) A (2) bekezdésben meghatározott esetben az üzemben tartó annál a biztosítónál köteles a szerződést – az újrakötött szerződés kockázatviselési kezdetének időpontjában alkalmazandó díjtarifa alapján – megkötni, ahol a szerződése díjnemfizetés miatt szűnt meg."]
["(4) Az a biztosító, amely a szerződést a biztosítási időszak végére felmondta vagy a szerződés a biztosítási időszak alatt díjnemfizetés miatt szűnt meg, az üzemben tartónak a szerződés megszűnését közvetlenül követő biztosítási időszakra vonatkozó ajánlatát nem köteles elfogadni."]
["6. § (1) A biztosítási szerződés a felek írásbeli megállapodásával jön létre."]
["(2) A szerződés úgy is létrejön, ha a szerződő üzemben tartó a díjtarifának és a biztosítási feltételeknek megfelelő ajánlatát a jogviszony tartalmára, és a biztosítási feltételekre vonatkozó tájékoztatás birtokában, a biztosító által rendszeresített ajánlati lapon a biztosító vagy annak képviselője részére átadja."]
["(3) A biztosító a (2) bekezdés szerinti ajánlatot annak átadásától számított 15 napon belül az 5. § (4) bekezdésében meghatározott indokok alapján utasíthatja el."]
["(4) Ha az üzemben tartó ajánlata nem felel meg a (2) bekezdésben meghatározott feltételeknek, a szerződés akkor is létrejön, ha a biztosító az ajánlatra 15 napon belül nem nyilatkozik."]
["(5) A (2) és (4) bekezdés szerinti esetben a szerződés az ajánlat átadásának időpontjában – az ajánlat szerinti tartalommal – jön létre."]
["(6) A biztosító a (4) bekezdésben meghatározott esetben az ajánlatot annak átadásától számított 15 napon belül a díjtarifától és a biztosítási feltételektől való eltérésre történő hivatkozással, illetve az 5. § (4) bekezdésében meghatározott indokok alapján elutasíthatja, vagy igazolható módon elküldött javaslatot tehet az ajánlat díjtarifának és a biztosítási feltételeknek megfelelő módosítására. Ha az ajánlat módosítására tett javaslatot a szerződő a kézhezvételtől számított 15 napon belül nem kifogásolja, a szerződés az (5) bekezdésben meghatározott időpontban a módosított ajánlat szerint létrejön."]
["(7) Ha a biztosító az ajánlat módosítására tesz javaslatot, köteles az üzemben tartó figyelmét felhívni az ajánlat módosításának tényére, valamint az ajánlathoz viszonyított lényeges eltérésekre. Ennek hiányában a szerződés az ajánlat tartalmának megfelelően jön létre."]
["(8) A biztosító kötvényt az e §-ban meghatározottak szerint létrejött szerződés tartalmával egyező tartalommal bocsáthat ki."]
["7. § (1) A szerződő felek bármelyike a biztosítási időszak utolsó napjára (biztosítási évfordulóra), azt legalább 30 nappal megelőzően a biztosítási szerződést írásban, indoklás nélkül felmondhatja. A felmondás akkor hatályos, ha az a másik félhez határidőben megérkezik."]
["(2) A biztosítási időszakon belül – az e törvényben meghatározott eseteken túl – a szerződés csak a felek közös megegyezésével szüntethető meg."]
["(3) A szerződés érdekmúlással szűnik meg a gépjármű forgalomból történő kivonásával, az üzemben tartó változása esetén, illetve szünetelés esetén, ha az újbóli üzembe helyezés a kivonás napjától számított egy éven belül nem történik meg."]
["(4) A szerződés érdekmúlással szűnik meg a tulajdonjog átszállása esetén, ha a szerződéskötésre kötelezett üzemben tartó személyében változás áll be."]
["8. § (1) A járműnyilvántartásban szereplő gépjárművek vonatkozásában a fennálló biztosítás által érintett biztosítót az e törvényben előírt feladatainak ellátása céljából, a gépjármű forgalomból történő kivonásának, a gépjármű első és ismételt forgalomba helyezésének, valamint a gépjármű tulajdonjogát érintő változásnak – ideértve a régi tulajdonos (átruházó) külön jogszabályban meghatározott, tulajdonjog-változáshoz kapcsolódó bejelentési kötelezettsége teljesítésének időpontját is – járműnyilvántartásba történő bejegyzéséről, továbbá az üzemben tartó és a járműnyilvántartásba bejegyzett üzemben tartó személyét érintő változás járműnyilvántartásba történő bejegyzéséről – e tény járműnyilvántartásba történő bejegyzésével egyidejűleg – a kötvénynyilvántartó szerv elektronikus úton értesíti, amely értesítést a biztosító a feladatai ellátása során figyelembe veszi."]
["(2) A járműnyilvántartásban nem szereplő gépjármű üzemben tartója a hatósági engedély visszavonását, a tulajdonjog átruházását, illetve az üzemben tartó változását igazoló okiratot, a forgalomban történő részvétel végleges megszüntetését tanúsító nyilatkozatát köteles a biztosítónál 15 napon belül bemutatni."]
["(3) A biztosító köteles – a díjnemfizetéssel történő megszűnés esetének kivételével – a biztosítási szerződés megszűnésének tényéről és a megszűnt szerződés külön rendeletben meghatározott bonus-malus besorolásáról a megszűnést, illetve az arról történt tudomásszerzést követő 30 napon belül az üzemben tartót írásban tájékoztatni."]
["(4) A szerződésre a magyar jogot kell alkalmazni."]
["(5) A szerződésre a Polgári Törvénykönyvről szóló törvény rendelkezései akkor alkalmazhatók, ha e törvény eltérő rendelkezést nem tartalmaz."]
["9. § (1) Az üzemben tartó a szerződéskötéskor köteles minden, a biztosítás elvállalása szempontjából lényeges körülményt közölni a biztosítóval, így különösen – fennálló szerződés esetén a biztosítási időszak vagy a tartam utolsó napját követő – az új biztosítási időszak vagy a határozott tartam kezdő napját, biztosítóváltás esetén az előző biztosítási időszakra vonatkozóan a fedezetet nyújtó biztosító megnevezését és a biztosítást igazoló okirat számát, továbbá, – amennyiben az üzemben tartó már rendelkezik vele – a kártörténeti rendszerazonosító számot."]
["(2) Az üzemben tartó a szerződéskötéskor köteles a fedezetlenségi díj megállapításához szükséges adatokat a biztosítóval vagy annak képviselőjével közölni."]
["(3) A 4. § (3) bekezdésében meghatározottak szerint a gépjármű tulajdonosa által üzemben tartóként megnevezett személy által kötött szerződés az üzemben tartói jogosultság keletkezésének – járműnyilvántartásba bejegyzett – időpontjában – de legkorábban a biztosítási szerződésben megállapított időpontban, ennek hiányában a szerződés létrejöttének időpontjában – lép hatályba. Ha az üzemben tartói jogosultság bejegyzése a szerződéskötést követő 30 napon belül nem történik meg, a szerződés megszűnik."]
["(4) Az üzemben tartó köteles 8 napon belül bejelenteni a biztosítónak a biztosítást igazoló okiratban feltüntetett adatok változását."]
["10. § Ugyanarra a biztosítási időszakra vagy ugyanazon biztosítási időszak egy részére kötött további biztosítási szerződés érvénytelen."]
[]
["A gépjárműflottára kötött szerződésre alkalmazandó szabályok "]
[]
["11. § (1) Gépjárműflottára kötött szerződés esetén a szerződő felek az e törvényben meghatározottaktól eltérhetnek a szerződés létrejöttét, megszűnését, a biztosítási időszakot, a díjfizetést illetően."]
["(2) A biztosító a díjat a flottára kötött szerződés vonatkozásában a biztosítási időszak, illetve tartam kezdő napján alkalmazandó díjtarifa alapján alakítja ki. A biztosító az így megállapított díjat az adott biztosítási időszak alatt nem változtathatja meg."]
["(3) A biztosító köteles a flottára kötött szerződés vonatkozásában egy - a meghirdetés napjától számított hatvannapos időszakon túli - előre meghatározott naptól alkalmazandó díjtarifáját a Magyar Nemzeti Bank elnökének rendeletében meghatározott módon, a Felügyelet honlapján meghirdetni, továbbá a meghirdetés közzétételével egyidejűleg a saját és a MABISZ honlapján közzétenni. Eltérés esetén a Felügyelet honlapján meghirdetett tarifa az alkalmazandó."]
["(4) Gépjárműflottára a flottához tartozó gépjárművek kategóriáitól és fajtáitól függetlenül határozott tartamú szerződés is köthető."]
[]
["A helytállási kötelezettség és annak mértéke"]
[]
["12. § A biztosítás kiterjed a felelősség kérdésének vizsgálatára, és azoknak a megalapozott kártérítési igényeknek a kielégítésére, amelyeket a biztosított személyekkel szemben a biztosítási szerződésben megjelölt gépjármű üzemeltetése során okozott károk miatt támasztanak."]
["13. § (1) Egy biztosítási esemény vonatkozásában a károsultak számától függetlenül a biztosító dologi károk esetén káreseményenként 500 millió Ft összeghatárig, személyi sérülés miatti károk esetén káreseményenként 1600 millió Ft összeghatárig köteles helytállni, mely összegek magukban foglalják a káresemény kapcsán bármilyen jogcímen érvényesíthető követeléseket, az igényérvényesítés költségeit, valamint a teljesítés időpontjáig eltelt időszakra járó kamatokat."]
["(2) Ha a biztosított a kárt más tagállam területén okozta, vagy a zöldkártyarendszer azon országainak területén, amelyek nemzeti irodájával a magyar Nemzeti Iroda megállapodást kötött, a biztosító helytállási kötelezettségének mértéke a káresemény helye szerinti ország gépjármű-felelősségbiztosítási jogszabályai szerint áll fenn. Ha a biztosító szerződésben meghatározott helytállási kötelezettségének mértéke magasabb a káresemény helye szerinti országban előírt mértéknél, a biztosító helytállási kötelezettsége a biztosítási szerződésben vállalt összeghatárok mértékéig áll fenn."]
["(3) Azonos okból bekövetkezett, azzal közvetlen okozati összefüggésben lévő, időben összefüggő több káresemény egy biztosítási eseménynek minősül."]
["14. § (1) Ha egy biztosítási eseménnyel kapcsolatban több jogosult megalapozott kártérítési igénye meghaladja a 13. § (1)-(2) bekezdésében meghatározott összeget, akkor a kártérítési igények megtérítése az összes kártérítési igénynek a károkra káreseményenként meghatározott összeghez viszonyított arányában történik."]
["(2) Ha kártérítésként járadékfizetési kötelezettség áll fenn, a biztosítási összeg felosztásakor a járadék tőkeértékét kell figyelembe venni. Ha a jövőben várható járadékkifizetések tőkeértéke magasabb a szerződésben rögzített biztosítási összegből rendelkezésre álló összegnél, a biztosító a járadékkifizetések tőkeértékét arányosan csökkentve állapítja meg a járadék nagyságát."]
["(3) Ha a biztosítási esemény folytán az adott kártípusra (dologi, illetve személyi kár) meghatározott káreseményenkénti összeg kimerül, a biztosítási összeg felosztásakor figyelembe nem vett károsult kizárólag akkor érvényesíthet kártérítési igényt, ha azt a biztosító a károsultnak fel nem róható okból hagyta figyelmen kívül. Ebben az esetben a kárt olyan arányban kell az adott kártípusra meghatározott biztosítási összeg újrafelosztásával megtéríteni, amilyen arányban a károsult a biztosítási összeg felosztásakor abból részesülhetett volna."]
["(4) A (3) bekezdés szerinti eljárást kell követnie a biztosítónak akkor is, ha egy vagy több károsult kártérítési igénye a károsultnak fel nem róható okból a biztosítási összeg felosztását követően jelentkezik, vagy növekszik (pl. egészségi állapot romlása)."]
["(5) Ha a biztosító a figyelembe nem vett károsult kárát az (1)–(4) bekezdésekben foglaltak szerint megtérítette, a biztosítási összeg újrafelosztása miatt jogosult a többi érintett károsulttól a részükre korábban teljesített kárkifizetésből az új kártérítési arányt meghaladó kártérítési összeget visszakövetelni a kifizetést követő 5 éven belül. A biztosító az újrafelosztás lehetőségéről köteles a károsultat a kárrendezés során, az első kárkifizetéssel egyidejűleg írásban tájékoztatni."]
["(6) Ha egy vagy több károsult kártérítési igénye a biztosítási összeg (1) bekezdésben meghatározottak szerinti felosztásakor figyelembe vetthez képest csökken, abban az esetben a többi károsult a biztosítási összeg újrafelosztásából eredő új kártérítési aránynak megfelelő kártérítésre jogosult."]
["15. § A biztosítás nem terjed ki arra a kárra, amely"]
["a) a károkozó gépjárműben elhelyezett tárgyakban keletkezett, ha ezek nem a gépjárművel utazók személyi használatára szóló tárgyak;"]
["b) a károkozó gépjárműben keletkezett;"]
["c) a károkozó gépjármű biztosítottjainak egymással szembeni igényéből származó dologi kárként, illetve elmaradt haszonként keletkezett;"]
["d) sugárzó, toxikus anyagok és termékek hatására, vagy az egészségügyi hatóságok részéről a sugárzás káros hatásainak megszüntetését célzó intézkedések folytán keletkezett;"]
["e) a gépjármű balesete nélkül az út burkolatában keletkezett;"]
["f) a gépjármű – forgalomban való részvétele nélkül – munkagépként való használata során keletkezett;"]
["g) álló gépjárműre fel-, illetve arról való lerakodás következtében keletkezett;"]
["h) üzemi balesetnek minősül, és a gépjármű javítási vagy karbantartási munkái során keletkezett;"]
["i) gépjárműverseny vagy az ahhoz szükséges edzés során következett be;"]
["j) környezetszennyezéssel a gépjármű balesete nélkül keletkezett;"]
["k) a gépjármű üzemeltetésével egyéb vagyontárgyban folyamatos állagrongálással okozott, illetőleg állagromlásból adódott;"]
["l) háború, háborús cselekmény, terrorcselekmény következményeként keletkezett."]
[]
["A biztosítási szerződés időbeli hatálya, és a biztosítási időszak"]
["16. § (1) Az állandó forgalmi engedélyre kötelezett gépjárművek esetében a biztosítási szerződés határozatlan tartamú."]
["(2) Az ideiglenes forgalmi engedéllyel, az ideiglenes forgalomban tartási engedéllyel rendelkező gépjárművek, továbbá az igazolólappal rendelkező lassú járművek és a négykerekű segédmotoros kerékpárok (quadok), továbbá a külön jogszabályban meghatározott forgalomba helyezésre nem kötelezett gépjárművek esetében, valamint a 4. § (7) bekezdésében foglalt esetben a biztosítási szerződésben megjelölt határozott tartamú szerződés köthető."]
["(3) A közúti közlekedési igazgatási feladatokról, a közúti közlekedési okmányok kiadásáról és visszavonásáról szóló miniszteri rendeletben meghatározott mezőgazdasági erőgép (lassú jármű) esetében határozatlan tartamú szerződés köthető."]
["17. § (1) A határozatlan tartamú szerződések esetében a biztosítási időszak egy év, az 5. § (2) bekezdésében meghatározottak szerint újrakötött szerződések esetében a megszűnt szerződés szerinti biztosítási időszak végéig terjedő időszak."]
["(2) A biztosítási évfordulót a biztosítást igazoló okiraton fel kell tüntetni."]
["(3) A biztosítási időszak első napja – a szünetelés időtartama alatt hatályba lépő szerződések kivételével – a kockázatviselés kezdete."]
["(4) A biztosító a biztosítási időszak utolsó napját megelőző ötvenedik napig elküldött írásos értesítőben tájékoztatja a szerződő felet a biztosítási évfordulóról és a következő biztosítási időszakra – az értesítés időpontjában rendelkezésre álló adatok alapján – a díjtarifa szerint várható díjról."]
["(5) A (4) bekezdésben meghatározott értesítés – a szerződő hozzájáruló nyilatkozata alapján – elektronikus úton is megtehető."]
[]
["A biztosítási szerződés területi hatálya"]
["18. § A biztosítási szerződés területi hatálya a tagállamok területére, valamint a zöldkártyarendszer azon országainak területére terjed ki, amelyek nemzeti irodájával a magyar Nemzeti Iroda a Belső Szabályzatnak megfelelő kétoldalú megállapodást kötött."]
[]
["A biztosító kockázatviselése"]
["19. § (1) A biztosító kockázatviselése (a biztosítási fedezet) a felek által a szerződésben meghatározott időpontban, ennek hiányában a szerződés létrejöttének időpontjában, a 4. § (3) bekezdésében meghatározott üzemben tartó által kötött szerződés esetén az üzemben tartói jogosultság keletkezésének – járműnyilvántartásba bejegyzett – időpontjában – de legkorábban a biztosítási szerződésben megállapított időpontban, ennek hiányában a szerződés létrejöttének időpontjában – kezdődik."]
["(2) Ahhoz, hogy a biztosító kockázatviselése már a biztosítási szerződés létrejöttét megelőzően megkezdődjék, a biztosító vagy az általa feljogosított személy írásbeli elfogadó nyilatkozata szükséges."]
["(3) Semmis a biztosító által egyoldalúan, a másik fél közreműködése nélkül meghatározott és egyedileg meg nem tárgyalt szerződési (biztosítási) feltétel, amennyiben olyan kikötést tartalmaz, hogy a biztosító csak a díj (első díjrészlet) befizetését követően viseli a kockázatot."]
["(4) A biztosító kockázatviselése a 21. § (4) bekezdésében meghatározott türelmi időben fennáll."]
["(5) A szerződés érdekmúlással történő megszűnése esetén a biztosító kockázatviselése a forgalomból történő kivonás, a forgalomban történő részvétel végleges megszüntetése, a szerződéskötésre kötelezett üzemben tartó személyének változása esetén a tulajdonjog átszállása, illetve az üzemben tartói jogosultság megszűnésének – járműnyilvántartásba bejegyzett – időpontjában szűnik meg."]
["(6) A biztosító kockázatviselése a szerződés közös megegyezéssel történő megszüntetése esetén a szerződés megszűnésének időpontjában, a szerződés biztosítási időszak végére történő felmondása esetén a biztosítási időszak zárónapján szűnik meg."]
["(7) A szerződés a 21. § (4) bekezdésében meghatározott megszűnése esetén a biztosító kockázatviselése a türelmi idő zárónapján szűnik meg."]
[]
["Díjfizetés"]
[]
["20. § (1) A biztosítási díj a kockázat viselésének időtartamára előre illeti meg a biztosítót."]
["(2) A biztosító a kockázatviselése megszűnése napjáig járó biztosítási díj megfizetését követelheti."]
["(3) A határozott tartamú biztosítási szerződések biztosítási díja a biztosítás tartamára egy összegben illeti meg a biztosítót (egyszeri díj)."]
["21. § (1) A biztosítás első díjrészlete, valamint folytatólagos díjrészletei a felek által a szerződésben meghatározott időpontokban esedékesek. Ennek hiányában az első díjrészlet a szerződés létrejöttekor, a folytatólagos díjrészlet pedig az adott díjfizetési időszaknak az első napján esedékes."]
["(1a) Ha a díj a 23. § (2) bekezdésében meghatározott megváltoztatás esetén módosul, vagy a szerződő fél által már megfizetett díjat jogszabályváltozás folytán utóbb más tartozására kell elszámolni, az üzemben tartó a díjkülönbözetet az esedékes következő biztosítási díjrészlettel együtt - a biztosítási időszakra járó díj teljes megfizetése esetén 30 napos határidővel - köteles megfizetni."]
["(2) Az egyszeri díjat – a felek eltérő megállapodásának hiányában – a szerződés létrejöttekor kell megfizetni."]
["(3) A biztosítót a késedelmes díjfizetés időszakára a szerződésben megállapított kamat illeti meg."]
["(4) Ha az esedékes biztosítási díjat nem fizetik meg, a biztosító a díj esedékességétől számított harmincadik nap elteltéig – a következményekre történő figyelmeztetés mellett – a szerződő félnek a díj esedékességétől számított hatvannapos póthatáridővel, igazolható módon a teljesítésre vonatkozó felszólítást küld. A türelmi idő eredménytelen leteltével a szerződés – amennyiben egyéb okból még nem szűnt meg – az esedékességtől számított hatvanadik napon megszűnik."]
["(5) A biztosító köteles a szerződés megszűnéséről 15 napon belül az üzemben tartónak igazolható módon értesítést küldeni, amennyiben a szerződés megszűnése díjnemfizetés miatt következett be."]
["6) Az 5. § (3) bekezdésében meghatározott esetben a szerződő fél a szerződés megkötésekor köteles megfizetni az újrakötött szerződés vonatkozásában az adott biztosítási időszak hátralévő részére járó díjat, és - amennyiben még nem fizette meg - a díjnemfizetéssel megszűnt szerződés vonatkozásában a türelmi időre járó díjat."]
["(7) A biztosító köteles a szerződés (4) bekezdés szerinti díjnemfizetés miatt bekövetkező megszűnése esetén a kötvénynyilvántartó szerv felé a 49. § alapján fennálló értesítési kötelezettségének a szerződés megszűnésétől számított nyolc munkanapon belül eleget tenni."]
[]
["Fedezetlenségi díj megfizetésére vonatkozó szabályok"]
[]
["22. § (1) Az üzemben tartó köteles a fedezetlenségi díjat megfizetni."]
["(2) A teljes fedezetlenségi díjat azon biztosító köteles kiszámítani és beszedni, amely az üzemben tartóval a fedezetlenség időtartamát követően szerződést köt."]
["(3) A biztosító a fedezetlenségi díjat az arról történt tudomásszerzést követően haladéktalanul köteles kiszámítani."]
["(4) A fedezetlenségi díj kiszámításánál arra az évre járó meghirdetett díjtarifát kell alkalmazni, amelyre a fedezetlenség időtartama esik, a díjat beszedő biztosító díjtarifája nem alkalmazható."]
["(5) Az üzemben tartó a (3) és (4) bekezdésben meghatározottak szerint kiszámított fedezetlenségi díjat az esedékes biztosítási díjrészlettel együtt – a biztosítási időszakra járó díj teljes megfizetése esetén 30 napos határidővel – köteles megfizetni."]
["(6) Ha az üzemben tartó az (5) bekezdésben meghatározott kötelezettségének nem tesz eleget, a 21. § (4) bekezdésében meghatározott rendelkezéseket kell alkalmazni."]
["(7) A Kártalanítási Számla kezelője a fedezetlenségi díjnak - a díjhirdetést követő naptári évre vonatkozó, a Kártalanítási Számla általi kártérítések és a kártérítésekhez kapcsolódó eljárási költségek alapján egy naptári évre számított - tarifáját gépjármű-kategóriánként, legkésőbb a naptári év végét megelőző negyvenötödik napig a Magyar Nemzeti Bank elnökének rendeletében meghatározott módon a Felügyelet honlapján meghirdeti, továbbá ezzel egyidejűleg a MABISZ honlapján közzéteszi. Eltérés esetén a Felügyelet honlapján meghirdetett tarifa az alkalmazandó."]
[]
["Díjtarifa, díjhirdetés"]
["23. § (1) A biztosító a díjat minden egyedi szerződés vonatkozásában a meghirdetett – a biztosítási időszak, illetve tartam kezdőnapján alkalmazandó – díjtarifa alapján alakítja ki és azt az adott biztosítási időszak alatt – jogszabály eltérő rendelkezése hiányában – nem változtathatja meg, kivéve, ha a szerződés díja a szerződő üzemben tartónak a szerződés megkötésekor fennálló közlési vagy együttműködési kötelezettségének megsértése következtében tér el a díjtarifa szerint megállapítandó díjtól."]
["(2) A szerződő üzemben tartónak a szerződés megkötésekor fennálló közlési vagy együttműködési kötelezettségének megsértése esetén a szerződés díja legkésőbb a kockázatviselés kezdetét követő hatvan napon belül, az üzemben tartó egyidejű értesítése mellett – a szerződéskötéskor fennálló tények figyelembevételével – a kockázatviselés kezdetétől alkalmazandó hatállyal módosítható a biztosítási időszak, illetve tartam kezdőnapján alkalmazandó díjtarifa szerint."]
["(3) A biztosító köteles minden egyedi szerződés vonatkozásában egy – a meghirdetés napjától számított hatvannapos időszakon túli – előre meghatározott naptól alkalmazandó díjtarifáját a Magyar Nemzeti Bank elnökének rendeletében meghatározott módon, a Felügyelet honlapján meghirdetni, továbbá a meghirdetés közzétételével egyidejűleg a saját és a MABISZ honlapján közzétenni. Eltérés esetén a Felügyelet honlapján meghirdetett tarifa alkalmazandó."]
["(4) A biztosító köteles a biztosítási feltételeit és az alkalmazandó díjtarifáját az ügyfélfogadásra rendelkezésre álló helyiségeiben és a honlapján folyamatosan hozzáférhetővé tenni."]
["(5) Ha a biztosító a gépjármű-felelősségbiztosítást határon átnyúló szolgáltatás keretében nyújtja és Magyarország területén szervezeti egységgel nem rendelkezik, köteles gondoskodni arról, hogy a (4) bekezdésben említett információk a kárképviselő székhelyén vagy lakóhelyén betekin­tés céljából kifüggesztésre kerüljenek."]
["24. § (1) A határozatlan tartamú szerződés fennállása alatt a biztosítás díja a következő biztosítási időszak első napjától kezdődő hatállyal a biztosítási időszak kezdőnapján alkalmazandó díjtarifa szerint módosul, és az az adott biztosítási időszak alatt nem változtatható meg."]
["(2) Az (1) bekezdésben foglaltaktól kizárólag akkor lehet eltérni, ha azt jogszabály kifejezetten lehetővé teszi."]
[]
["Bonus-malus rendszer"]
["25. § (1) Az üzemben tartó a kármentes időszakhoz igazodó díjkedvezményre (bonus) jogosult, illetve az okozott és a biztosító teljesítési kötelezettségét kiváltó káresemények számához igazodó díjtöbblet (malus) fizetésére köteles."]
["(2) A biztosítók külön rendeletben meghatározottak szerint kötelesek a kártörténeti adatokat felhasználni, a kártörténeti adatokon alapuló bonus-malus rendszert működtetni, továbbá a kártörténeti igazolásokat kiadni."]
[]
["Szünetelés"]
["26. § (1) A biztosító kockázatviselése a járműnyilvántartásban szereplő gépjárművek esetében szünetel, ha az üzemben tartó kérelmére vagy hivatalból történő eljárás következtében a gépjármű a forgalomból ideiglenes kivonásra került."]
["(2) A biztosítót az (1) bekezdésben meghatározott ideiglenes kivonás tényéről, valamint annak kezdő és záró időpontjáról a kötvénynyilvántartó szerv elektronikus úton értesíti."]
["(3) A szünetelés a (2) bekezdésben meghatározott időpontoknak megfelelően a kivonás napjától a szünetelés lejártának napjáig vagy a gépjármű ismételt forgalomba helyezésének napjáig, de legfeljebb hat hónapig tart."]
["(4) Ha az újbóli üzembe helyezés a kivonás napjától számított egy éven belül nem történik meg, a szerződés az egyéves időszak utolsó napját követő napon megszűnik."]
["(5) A szünetelést követő díjrészlet fizetésének esedékessége – a felek eltérő megállapodásának hiányában – a szünetelés megszűnésének a napja."]
["(6) A hivatalból történő ideiglenes kivonás következtében fennálló szünetelés esetén a biztosító a (2) bekezdésben meghatározott értesüléstől számított 15 napon belül tájékoztatja az üzemben tartót a kockázatviselés szünetelésének tényéről és az esetlegesen bekövetkező károkozás következményeiről."]
["(7) A szünetelés időtartama alatt az üzemben tartó kötelezettsége a szerződés folyamatos díjfizetéssel történő hatályban tartására nem áll fenn."]
["(8) A járműnyilvántartásban nem szereplő gépjárművek esetében a szünetelésnek nincs helye."]
[]
["Kártérítési igények érvényesítése"]
["27. § A biztosító, a Kártalanítási Számla kezelője, a Nemzeti Iroda, a kárrendezési megbízott, valamint a Kártalanítási Szervezet a gépjármű üzemeltetése során okozott kárt az e törvényben foglaltak szerint megtéríti."]
["28. § (1) A károsult kártérítési igényét e törvény alapján, a biztosítási szerződés keretei között a károkozó gépjármű üzemben tartójának biztosítójával szemben közvetlenül, illetve az e törvényben meghatározott esetekben a Kártalanítási Számla kezelőjével szemben jogosult érvényesíteni."]
["(2) A más tagállam területén lakóhellyel (székhellyel) rendelkező károsult keresetet indíthat a károkozó Magyarország területén székhellyel rendelkező biztosítójával szemben a lakóhelye (székhelye) szerinti tagállamban, vagy a baleset bekövetkezésének helye szerinti tagállamban, amennyiben a baleset a zöldkártyarendszer valamely, a károsult lakóhelyétől (székhelyétől) eltérő országában következett be."]
["(3) A biztosítóval szemben támasztott követeléseket a károsult választása szerint a kárképviselővel szemben is érvényesítheti a biztosítóra kiterjedő joghatállyal."]
[]
["29. § (1) A biztosítási esemény bekövetkeztekor a baleset részesei a helyszínen kötelesek átadni egymásnak a személy, a gépjármű és a biztosítási szerződés azonosításához szükséges – a 46. § (2) bekezdésének a), b) és d) pontjaiban meghatározott – adatokat, valamint a baleset lényeges körülményeire vonatkozó információkat. Az így átadott adatok az e törvényben meghatározott feladatainak ellátása céljából kizárólag a biztosítóhoz, a Nemzeti Irodához, a Kártalanítási Számla kezelőjéhez, a Kártalanítási Szervezethez, a levelezőhöz, a kárrendezési megbízotthoz, a kárképviselőhöz, az egészségbiztosítási szervhez, a nyugdíjbiztosítási szervhez továbbíthatók és a Bit. biztosítási titokra vonatkozó szabályai szerint kezelendők."]
["(2) A károsult a káreseményt – annak bekövetkeztétől, illetve a tudomásszerzéstől számított – 30 napon belül köteles bejelenteni a biztosítónak. A határidő elmulasztása esetén – kivéve, ha a károsult bizonyítja, hogy az önhibáján kívül történt – a késedelmes teljesítés jogkövetkezményei a káresemény bekövetkezése és a káresemény bejelentése közötti időszakra a biztosítóval, a kárrendezési megbízottal, a levelezővel, a Kártalanítási Számla kezelőjével, a kárképviselővel és a Nemzeti Irodával szemben nem alkalmazhatók."]
["(3) A Kártalanítási Alap fedezi a károsultnak a felszámolás alatt álló biztosítóval szemben fennálló követelését a biztosítási szerződésben, valamint e törvényben a kárigények érvényesítésével kapcsolatos rendelkezések figyelembevételével."]
[]
["30. § (1) A biztosított köteles a káreseményt – a kárrendezéshez szükséges adatok megadásával és a lényeges körülmények leírásával, valamint a káreseménnyel kapcsolatos hatósági (rendőrségi) eljárást lefolytató szerv megjelölésével – 5 munkanapon belül a biztosítójánál írásban bejelenteni."]
["(2) Az érvényes biztosítási szerződéssel nem rendelkező üzemben tartó az (1) bekezdésben meghatározottakat 5 munkanapon belül köteles a Kártalanítási Számla kezelőjének bejelenteni."]
["(3) Köteles a biztosított 5 munkanapon belül bejelenteni azt is, ha a káreseménnyel kapcsolatban ellene peres vagy nemperes eljárás indult. A biztosító jogosult ebben az eljárásban a biztosított képviseletéről gondoskodni."]
["(4) Az érvényes biztosítási szerződéssel nem rendelkező üzemben tartó a (3) bekezdésben meghatározottakat 5 munkanapon belül köteles a Kártalanítási Számla kezelőjének bejelenteni. A Kártalanítási Számla kezelője jogosult ebben az eljárásban az érvényes biztosítási szerződéssel nem rendelkező üzemben tartó képviseletéről gondoskodni."]
["(5) Külföldön bekövetkezett káresemény bejelentésének határidejét a hazaérkezés időpontjától kell számítani."]
["(6) A biztosító, a Nemzeti Iroda, a Kártalanítási Számla kezelője, a kárképviselő és a levelező kérelmére, a kárrendezési eljárás lefolytatása céljából, az eljáró hatóság tájékoztatást nyújt a káreseménnyel kapcsolatos eljárás állásáról, eredményéről, a károsult és a károkozó – 46. § (2) bekezdésének a) pontjában meghatározott – személyes adatairól, a gépjármű hatósági jelzéséről, a biztosító megnevezéséről, a biztosítást igazoló okirat számáról, valamint a káreseménnyel kapcsolatban a konkrét esetre vonatkoztatva a kárigények rendezéséhez szükséges alapvető adatokról."]
[]
["31. § A biztosító, ennek kárrendezési megbízottja, levelezője, a kárképviselő, a Kártalanítási Számla kezelője és a Nemzeti Iroda köteles a kárrendezéshez nélkülözhetetlen dokumentumok beérkezésétől számított 15 napon belül, de ezek beérkezésének hiányában is legkésőbb a kártérítési igény benyújtásától számított három hónapon belül a károsultnak:"]
["a) kellően megindokolt kártérítési javaslatot tenni azokban az esetekben, amelyekben a felelősség nem vitás és a kárt a 13. § (1)-(2) bekezdésében foglaltaknak megfelelően, jogcímenként (beleértve a kamatra vonatkozó tájékoztatást) összegszerűen megállapította, vagy"]
["b) indoklással ellátott választ adni a kárigényben foglalt egyes követelésekre, azokban az esetekben, amikor a felelősséget nem ismeri el, vagy az nem egyértelmű, vagy a teljes kárt összegszerűen nem állapította meg."]
[]
["32. § (1) A biztosító a kártérítési követelések jogosságát a biztosított felelősségre vonatkozó nyilatkozatában foglaltak és a rendelkezésre álló tények és adatok összevetése alapján, a biztosított kártérítési felelősségéhez mérten köteles megállapítani."]
["(2) A károsult kártérítési követelését elutasító jogerős ítélet hatálya a biztosítottra – a 35. § (1) bekezdésében meghatározott esetekben az üzemben tartóra és a vezetőre – is kiterjed, ha azt a károsult és a biztosító, a kárképviselő, a Nemzeti Iroda vagy a Kártalanítási Számla kezelője közötti perben hozta a bíróság."]
["(3) A biztosító, a Kártalanítási Számla kezelője egyösszegű pénzbeli kártérítés esetén köteles a megállapított összeget a kártérítési javaslat elfogadását, vagy a kártérítés jogerős megítélését követő 15 napon belül a károsultnak megfizetni."]
[]
["32/A. § (1) Gépjármű károsodása esetén a biztosító előzetes kalkulációt készít az általa téríthető helyreállítási költségek és kiadások nettó, illetve "]
["bruttó összegéről, illetve – amennyiben az értékcsökkenés fizetésének feltétele fennáll – az értékcsökkenés mértékének megfelelő összegről, és erről tájékoztatja a károsultat."]
["(2) A biztosító a gépjárműben keletkezett kár helyreállításához szükséges költségek általános forgalmi adóval növelt összegét a károsultnak csak akkor térítheti meg, ha a károsult által bemutatott számla tartalmazza a gépjármű helyreállításához szükséges munkálatok megnevezését, anyagköltségét és munkadíját, valamint az a számvitelről szóló törvény előírásainak megfelel kivéve, ha a károsult a közlekedésbiztonsági szempontokra is tekintettel a gépjármű megjavíttatása helyett a fentiek szerinti mértékű kártérítési összeggel szabadon kíván rendelkezni. Amennyiben az értékcsökkenés fizetésének feltétele fennáll, a biztosító az (1) bekezdés szerinti értékcsökkenés összegét téríti meg. Gazdasági totálkár esetén vagy ha a káresemény következtében károsult gépjármű helyreállítása műszaki okokból nem lehetséges, a biztosító a gépjármű károsodás időpontjában fennálló forgalmi értékének maradványértékkel (roncsértékkel) csökkentett összegét alapul véve köteles megtéríteni a károsult kárát."]
[]
["32/B. § (1) Ha a biztosító úgy ítéli meg, hogy a közlekedési balesettel érintett gépjármű kormányműve, futóműve, illetve karosszériája (alváza) olyan károsodást szenvedett, amely miatt a közúti forgalomban való további részvételre közlekedésbiztonsági szempontból alkalmatlannak tekinthető és a helyreállítás – a jogosult erre irányult nyilatkozata alapján – nem történik meg, a kárfelvételi eljárás befejezésétől számított 10 napon belül – az alkalmatlanság okának feltüntetésével – értesíti a közlekedési hatóságot, kivéve, ha a károsult a hulladékká vált gépjárművekről szóló jogszabály hatálya alá tartozó gépjármű esetén annak bontási átvételi igazolását a biztosítónak bemutatja."]
["(2) A gépjárműben keletkezett károsodás esetén a biztosító a kár helyreállításához szükséges teljes költséget biztosítási szolgáltatása keretében csak akkor térítheti meg a károsultnak, ha a közlekedési hatóság a gépjármű műszaki vizsgálata eredményeként"]
["a) arról tájékoztatja a biztosítót, hogy a gépjármű a közúti forgalomban való részvételre közlekedésbiztonsági szempontból alkalmas, vagy"]
["b) a gépjárművet közlekedésbiztonsági szempontból a (3) bekezdésben meghatározott kivétellel műszakilag alkalmatlannak minősíti, és ennek alapján a gépjárművet a járási hivatal – a külön jogszabályban meghatározottak szerint – ideiglenesen kivonta a forgalomból."]
["(3) A (2) bekezdés b) pontja nem alkalmazható abban az esetben, ha a közlekedési hatóság a gépjármű műszaki vizsgálata eredményeként a hulladékká vált gépjárművekről szóló jogszabály hatálya alá tartozó gépjárművet közlekedésbiztonsági szempontból véglegesen alkalmatlannak minősítette."]
["(4) A biztosító az értékcsökkenés összegét csak abban az esetben fizetheti ki a károsult részére, ha a károsult a hulladékká vált gépjárművekről szóló jogszabály hatálya alá tartozó gépjármű esetén annak bontási átvételi igazolását a biztosítónak bemutatta vagy a gépjárművet a járási hivatal – a külön jogszabályban meghatározottak szerint – végleg kivonta a forgalomból."]
["(5) A károsult részére a biztosító nem fizetheti ki a 32/A. § (1) bekezdése szerint kalkulált nettó összeget, illetve az értékcsökkenés összegét, ha a közlekedési hatóság arról tájékoztatja, hogy az üzemben tartó az (1) bekezdésben foglalt értesítés alapján elrendelt műszaki vizsgálatra a gépjárművet nem mutatta be, és a műszaki vizsgálatára más módon sem került sor."]
["(6) A 32/A. § (2) bekezdésében, valamint a (2)–(5) bekezdésben foglaltak nem érintik azt a lehetőséget, hogy a biztosító a 32/A. § (1) bekezdés szerint előzetesen kalkulált nettó összeg, illetve értékcsökkenés 60%-ának megfelelő összegű szolgáltatási előleget nyújtson."]
["(7) Az (1)–(6) bekezdésekben meghatározottakat nem kell alkalmazni, ha a kárt szenvedett gépjármű telephely szerinti országa nem Magyarország."]
[]
["Törvényi engedmény"]
[]
["33. § Amennyiben a biztosító, a Nemzeti Iroda vagy a Kártalanítási Számla kezelője a kárt megtérítette, a megtérített összeg erejéig őt illetik meg azok a jogok, amelyek a biztosítottat – a 35. § (1) bekezdésében meghatározott esetekben az üzemben tartót és a vezetőt – illették meg a kárért felelős személlyel szemben."]
[]
["Visszkereset"]
[]
["34. § (1) A biztosító, a Nemzeti Iroda, valamint a 36. § (6) bekezdésében meghatározott esetben a Kártalanítási Számla kezelője az általa kifizetett kártérítési összeg megtérítését követelheti:"]
["a) attól a vezetőtől, aki a gépjárművet az üzemben tartó vagy az egyébként jogosan használó engedélye nélkül vezette;"]
["b) a biztosítottól, több biztosított közös károkozása esetén bármelyiküktől, ha a kárt jogellenesen és szándékosan okozták;"]
["c) a vezetőtől, ha a gépjárművet alkoholos vagy a vezetési képességre hátrányosan ható szertől befolyásolt állapotban vezette, illetve bármely biztosítottól, ha a gépjármű vezetését ilyen személynek adta át, kivéve, ha bizonyítja, hogy a vezető alkoholos vagy a vezetési képességre hátrányosan ható szertől befolyásolt állapotát nem ismerhette fel (alkoholos befolyásoltságnak tekinthető a 0,8 ezreléket meghaladó véralkoholszint, illetve a 0,5 mg/l értéket meghaladó légalkohol szint);"]
["d) a vezetőtől, ha a gépjármű vezetésére jogosító engedéllyel nem rendelkezett, illetve bármely biztosítottól, ha a gépjármű vezetését ilyen személynek adta át, kivéve, ha bizonyítja, hogy a gépjárművet engedéllyel vezető esetében a gépjárművezetői engedély meglétét alapos okból feltételezte;"]
["e) az üzemben tartótól, ha a balesetet a gépjármű súlyosan elhanyagolt műszaki állapota okozta;"]
["f) a vezetőtől, ha a kárt segítségnyújtás elmulasztásával, illetve foglalkozás körében elkövetett szándékos veszélyeztetéssel okozta;"]
["g) az üzemben tartótól, illetve a vezetőtől, ha a szerződés megkötésekor, a biztosítási esemény bekövetkezésekor, vagy egyébként terhelő közlési, változásbejelentési, kárbejelentési kötelezettségét nem teljesítette, oly mértékben, ahogyan ez a fizetési kötelezettséget befolyásolta."]
["(2) Ha a biztosított az (1) bekezdés c) és d) pontjában, valamint a vezető az f) pontban felsorolt esetekben köteles a megtérítésre, a teljesített szolgáltatások keretei között egy biztosítási eseménnyel kapcsolatban a biztosító, a Nemzeti Iroda, valamint a Kártalanítási Számla kezelője legfeljebb 1,5 millió Ft-ig érvényesítheti követelését."]
["(3) Ha az üzemben tartó az (1) bekezdés e) pontjában meghatározott esetben köteles a megtérítésre, a teljesített szolgáltatások keretei között egy biztosítási eseménnyel kapcsolatban a biztosító, a Nemzeti Iroda, valamint a Kártalanítási Számla kezelője legfeljebb 750 ezer Ft-ig érvényesítheti követelését."]
["(4) Ha az üzemben tartó, illetve a vezető bizonyítja, hogy az (1) bekezdés g) pontjában meghatározott kötelezettségét nem szándékosan szegte meg, a biztosító, a Nemzeti Iroda, valamint a Kártalanítási Számla kezelője követelését az általa teljesített szolgáltatás keretei között legfeljebb 500 ezer Ft-ig érvényesítheti."]
["(5) Az elhunyt biztosított örököseivel szemben a biztosító, a Nemzeti Iroda, valamint a Kártalanítási Számla kezelője nem érvényesíthet megtérítési igényt."]
["A Gfbt. szabályai a biztosítókról és a biztosítási tevékenységről szóló 2003. évi LX. tv. (Bit.) 96. § és 10. számú melléklete alapján az alábbi­akkal egészülnek ki."]
["Fedezetlenségi díj, baleseti adó és a kiegészítő biztosítás megfizetésével kapcsolatos tudnivalók"]
["A befizetett díjat a biztosító először a baleseti adóra számolja el, és az ezek után fennmaradó összeget írja jóvá a biztosítási szerződésen. Amennyiben a biztosítási szerződés a kötelező gépjármű-felelősségbiztosítási szerződésen (alapbiztosításon) túl kiegészítő biztosítást is tartalmaz, a befizetett díjat a biztosító először az alapbiztosításra számolja el, és a fennmaradó összeget írja jóvá a kiegészítő biztosításon. A kiegészítő biztosítás díjának meg nem fizetése önmagában nem eredményezi a kötelező gépjármű-felelősségbiztosítási szerződés megszűnését."]
["Amennyiben a szerződő a biztosítási díj megfizetésén kívül fedezetlenségi díj fizetésére is köteles, a befizetett díjat a biztosító először a baleseti adóra, majd a fedezetlenségi díjra számolja el, és az ezek után fennmaradó összeget írja jóvá az új szerződésen."]
[]
["Biztosítási díj megfizetésének módja, gyakorisága, az első díjrészlet esedékessége"]
[]
["A biztosítás díja az alábbi módon és gyakorisággal fizethető"]
["– a biztosító által küldött készpénzátutalási megbízással (csekk),"]
["– átutalással,"]
["– csoportos beszedési megbízással"]
["havi, negyedéves, féléves és éves gyakoriság mellett."]
["A díjfizetés módjára és gyakoriságára vonatkozó egyes speciális rendelkezéseket a biztosító adott évre érvényes díjszabása tartalmazza."]
["A biztosítás első díjrészlete a számla kiállításának napján, amennyiben a számla kiállításának napja korábbi, mint a kockázatviselés kezdete, a kockázatviselés kezdetének napján esedékes. A folytatólagos díjrészlet az adott díjfizetési időszaknak az első napján esedékes. A határozott tartamú biztosítási szerződések biztosítási díja a biztosítás tartamára egy összegben illeti meg a biztosítót (egyszeri díj). Az egyszeri díj a számla kiállításának napján, amennyiben a számla kiállításának napja korábbi, mint a kockázatviselés kezdete, a kockázatviselés kezdetének napján esedékes."]
[]
["Elévülés"]
[]
["Jelen biztosítási szerződés alapján keletkezett kártérítési igények a Polgári Törvénykönyv elévülési szabályai szerint évülnek el."]
[]
["Közigazgatási és Elektronikus Közszolgáltatások Központi Hivatala megkeresésével kapcsolatos rendelkezések"]
[]
["Biztosító a biztosítási szerződés megkötéséhez, módosításához, állományban tartásához, valamint a szolgáltatás teljesítéséhez szükséges, a gépjárműre vonatkozó adatokat a Közigazgatási és Elektronikus Közszolgáltatások Központi Hivatala által vezetett nyilvántartásból lekéri."]
[]
["Ezen kiegészítések az egyes biztosítók esetén eltérhetnek."]
[]
["2011. évi CIII. törvény "]
["a népegészségügyi termékadóról (kivonat)"]
[]
["BALESETI ADÓ"]
[]
["1. Az adókötelezettség, az adó alanya"]
["11/A. § (1) A kötelező gépjármű-felelősségbiztosításról szóló törvény (Kgfb. tv.) szerinti biztosítási kötelezettség után baleseti adót (a további­akban e fejezet alkalmazásában a baleseti adó: adó) kell fizetni."]
["(2) Az (1) bekezdés szerinti adókötelezettség a Kgfb. tv. szerinti biztosí­tási időszak első napján keletkezik és utolsó napján szűnik meg."]
["(3) Ha a biztosító értesítése alapján a kötelező gépjármű felelősségbiztosí­tás díjának meg nem fizetése miatt a gépjármű forgalomból való kivonása iránti eljárás indul, az adókötelezettség – a (2) bekezdésben foglaltaktól eltérően – a gépjármű forgalomból való kivonása napján szűnik meg."]
["11/B. § Az adó alanya az a személy vagy szervezet, akit vagy amelyet a Kgfb. tv. szerinti biztosítási kötelezettség terhel."]
[]
["2. Az adó alapja, mértéke"]
["11/C. § (1) Az adó alapja az éves kötelező gépjármű-felelősségbiztosítási díj, ide értve a Kgfb. tv. szerint megállapított fedezetlenségi díjat is (a továbbiakban együtt: biztosítási díj)."]
["(2) Határozott tartamú Kgfb. tv. szerinti biztosítási szerződés esetén az adó alapja a határozott időtartamra megállapított egyszeri biztosítási díj."]
["(3) Az adó alapja"]
["a) a Kgfb. tv. szerinti fedezetlenségi időtartam, továbbá"]
["b) a Kgfb. tv. szerinti türelmi idő és – biztosító kockázatviselésével nem érintett –, a gépjármű forgalomból való kivonásának napjáig terjedő idő­tartam (a továbbiakban: biztosítási díjjal le nem fedett időtartam)"]
["azon napjaira, melyekre a biztosító az (1) vagy (2) bekezdés szerinti adót nem szedte be, a Magyar Biztosítók Szövetsége által közétett – a Kgfb. tv. szerinti türelmi idő első napján érvényes – fedezetlenségi díj napi összege és a fedezetlenségi időtartam, valamint a biztosítási díjjal le nem fedett időtartam napjai számának szorzata."]
["11/D. § Az adó mértéke az adóalap 30%-a, de a biztosító kockázatvise­lésével érintett időtartam naptári napjaira naponta legfeljebb 83 forint/gépjármű."]
[]
["3. Az adó megállapítása"]
["11/E. § (1) Az adót – a 11/F. §-ban foglalt kivétellel – a beszedésre kötelezett állapítja meg, vallja be és fizeti meg."]
["(2) Az adó beszedésére kötelezett a Kgfb. tv. szerinti kötelező felelősség­biztosítási szolgáltatást nyújtó biztosító (a továbbiakban: biztosító)."]
["(3) A biztosítónak az általa megállapított adót az esedékes biztosítási díjjal, díjrészlettel együtt kell beszednie, annyi részletben és olyan arány­ban, ahány részletben és amilyen arányban az adó alanyának a biztosítá­si díjfizetési kötelezettségének eleget kell tennie."]
["(4) Ha az adó alanya a biztosítási díj és a megállapított adó együttes összegénél kevesebbet fizetett, akkor azt úgy kell tekinteni, hogy részben vagy egészben a megállapított adót fizette meg."]
["(5) A biztosító a fizetendő baleseti adót akkor is tartozik befizetni, ha annak beszedését elmulasztotta."]
["(6) Ha a Kgfb. tv. szerinti biztosítási jogviszony díjnemfizetés miatt szű­nik meg és a Kgfb. tv. szerinti türelmi időben esedékes biztosítási díj után a biztosító az adót megfizette, a biztosítási jogviszony megszűnését magában foglaló hónapról szóló bevallásában a fizetendő adó összegét a biztosító az adónak az adóalany által meg nem fizetett összegével csök­kentheti."]
["11/F. § (1) A Kgfb. tv. szerinti határon átnyúló szolgáltatás esetén az adót az adó alanya önadózással, a biztosítási díj esedékességével egyidejűleg állapítja meg."]
["(2) A biztosítási díjjal le nem fedett időtartam azon napjaira, amelyekre a biztosító a 11/C. § (1) vagy (2) bekezdése alapján az adót nem szedte be, az adó alanya az adó összegét önadózással állapítja meg a gépjármű forgalomból való kivonását vagy az üzemben tartó személyében bekövet­kezett változás esetén, a változást követő hónap 15. napjáig. A biztosító a kockázatviselése megszűnésétől számított 15 napon belül igazolást ad az adóalany számára arról, hogy az adó a 11/E. § alapján mely napig van megfizetve."]
["11/G. § Ha a biztosítási díj az adóalany számára visszajár"]
["a) a beszedéssel megfizetett adó esetén a visszajáró díj alapulvételével számított adót a biztosító köteles az adóalanynak a visszajáró díj vissza­fizetésével egyidejűleg visszafizetni. A díj visszafizetésének hónapját követő 15. napig benyújtott bevallásában a biztosító jogosult a visszafi­zetett adóval az általa beszedett, bevallott adót csökkenteni,"]
["b) önadózással megfizetett adó esetén az adó alanya a visszajáró díj alapulvételével számított adót az adózás rendjéről szóló törvény szabályai szerint a díj visszafizetését követő hónap első napjától kezdődően az állami adóhatóság által rendszeresített nyomtatványon visszaigényelheti."]
[]
["4. Eljárási rendelkezések"]
["11/H. § (1) Az adóval kapcsolatos adóhatósági feladatokat az állami adóhatóság látja el."]
["(2) A beszedésre kötelezett, illetve – a 11/F. § szerinti esetben – az adó alanya az adót az adó megállapítására előírt határnapot követő hónap 15. napjáig vallja be és fizeti meg az állami adóhatóság által rendszeresített nyomtatványon."]
[]
["Biztosítási titokkal kapcsolatos tudnivalók"]
[]
["A biztosító a jelen szerződés kapcsán tudomására jutott, a szerződő, illetve a biztosított személyi körülményeire, vagyoni helyzetére, illetve gazdálkodására vonatkozó adatokat a 2003. évi LX. törvény (Bit.) 153–161. §-a alapján biztosítási titokként kezeli. Biztosítási titok csak akkor adható ki harmadik személynek, ha a szerződő vagy a biztosított, illetve annak törvényes képviselője erre vonatkozóan írásban felmentést ad, a biztosítási titok körét pontosan megjelölve."]
["Biztosítási titok minden olyan – minősített adatot nem tartalmazó –, a biztosító rendelkezésére álló adat, amely a biztosító ügyfeleinek személyi körülményeire, vagyoni helyzetére, illetve gazdálkodására, vagy a biztosítóval kötött szerződéseire vonatkozik. A biztosító köteles a tudomására jutott adatokat megőrizni és a biztosítási törvény szerint biztosítási titokként kezelni. A biztosító ügyfeleinek azon üzleti biztosítási titkait jogosult kezelni, amelyek a biztosítási szerződéssel, annak létrejöttével, nyilvántartásával, a kárral, szolgáltatással összefüggnek. Az adatkezelés célja csak a biztosítási szerződés megkötéséhez, módosításához, állományban tartásához, a biztosítási szerződésből származó követelések megítéléséhez szükséges."]
["A biztosítási titok tekintetében, időbeli korlátozás nélkül – ha a törvény másként nem rendelkezik – titoktartási kötelezettség terheli a biztosító tulajdonosait, vezetőit, alkalmazottait és mindazokat, akik ahhoz a biztosítóval kapcsolatos tevékenységük során bármilyen módon hozzájutottak."]
["Biztosítási titok csak akkor adható ki harmadik személynek, ha"]
["a) a biztosító ügyfele vagy annak törvényes képviselője a kiszolgáltatható biztosítási titokkört pontosan megjelölve, erre vonatkozóan írásban felmentést ad, vagy"]
["b) a biztosítási törvény alapján a titoktartási kötelezettség nem áll fenn."]
["A titoktartási kötelezettség nem áll fenn:"]
["a) a feladatkörében eljáró Felügyelettel,"]
["b) a folyamatban lévő büntetőeljárás keretében eljáró nyomozó hatósággal és ügyészséggel,"]
["c) büntetőügyben, polgári ügyben, valamint a csődeljárás, illetve felszámolási eljárás ügyében eljáró bírósággal, továbbá a végrehajtási ügyben eljáró önálló bírósági végrehajtóval,"]
["d) a hagyatéki ügyben eljáró közjegyzővel,"]
["e) adóügyben, az adóhatóság felhívására a biztosítót törvényben meghatározott körben nyilatkozattételi kötelezettség, illetve, ha biztosítási szerződésből eredő adókötelezettség alá eső kifizetésről törvényben meghatározott adatszolgáltatási kötelezettség terheli,"]
["f) a feladatkörében eljáró nemzetbiztonsági szolgálattal,"]
["g) a biztosítóval, a biztosításközvetítővel, a szaktanácsadóval, a harmadik országbeli biztosító, független biztosításközvetítő vagy szaktanácsadó magyarországi képviseletével, ezek érdekképviseleti szervezeteivel, illetve a biztosítási, biztosításközvetítői, szaktanácsadói tevékenységgel kapcsolatos versenyfelügyeleti feladatkörében eljáró Gazdasági Versenyhivatallal,"]
["h) feladatkörében eljáró gyámhatósággal,"]
["i) az egészségügyről szóló 1997. évi CLIV. törvény 108. § (2) bekezdésében foglalt egészségügyi hatósággal,"]
["j) a külön törvényben meghatározott feltételek megléte esetén a titkosszolgálati eszközök alkalmazására, titkos információ gyűjtésére felhatalmazott szervvel,"]
["k) a viszontbiztosítóval, valamint közös kockázatvállalás (együttbiztosítás) esetén a kockázatvállaló biztosítókkal,"]
["l) a törvényben szabályozott adattovábbítások során átadott adatok tekintetében a kötvénynyilvántartást vezető kötvénynyilvántartó szervvel,"]
["m)az állomány átruházás keretében átadásra kerülő biztosítási szerződési állomány tekintetében az átvevő biztosítóval,"]
["n) a kárrendezéshez és a megtérítési igény érvényesítéséhez szükséges adatok tekintetében, továbbá ezek egymásközti átadásával kapcsolatban a Kártalanítási Számlát, illetve a Kártalanítási Alapot kezelő szervezettel, a Nemzeti Irodával, a levelezővel, az Információs Központtal, a Kártalanítási Szervezettel, kárrendezési megbízottal és a kárképviselővel, illetve a károkozóval, amennyiben az önrendelkezési jogával élve a közúti közlekedési balesetével kapcsolatos kárrendezés kárfelvételi jegyzőkönyvéből"]
["a balesetben érintett másik jármű javítási adataihoz kíván hozzáférni,"]
["o) a kiszervezett tevékenység végzéséhez szükséges adatok tekintetében"]
["a kiszervezett tevékenységet végzővel,"]
["p) fióktelep esetében – ha a magyar jogszabályok által támasztott követelményeket kielégítő adatkezelés feltételei minden egyes adatra nézve teljesülnek, valamint a harmadik országbeli biztosító székhelye szerinti állam rendelkezik a magyar jogszabályok által támasztott követelménye"]
["ket kielégítő adatvédelmi jogszabállyal – a harmadik országbeli biztosítóval, biztosításközvetítővel, szaktanácsadóval szemben,"]
["q) a feladatkörében eljáró országgyűlési biztossal,"]
["r) a kártörténetre vonatkozó adatra és a bonus-malus besorolásranézve a 109/A. § (2) bekezdésében szabályozott esetekben a biztosítóval,"]
["s) a bonus-malus rendszer, az abba való besorolás, illetve a káresetek igazolásának részletes szabályairól szóló rendeletben meghatározott kártörténeti adatra és bonus-malus besorolásra nézve a rendeletben szabályozott esetekben a biztosítóval szemben, ha az a)–j), n), r) és s) pontban megjelölt szerv vagy személy írásbeli megkereséssel fordul hozzá, amely tartalmazza az ügyfél nevét vagy a biztosítási szerződés megjelölését, a kért adatok fajtáját, az adatkérés célját és jogalapját, azzal, hogy a k), l), m), p) és q) pontban megjelölt szerv vagy személy kizárólag a kért adatok fajtáját, az adatkérés célját és jogalapját köteles megjelölni. A cél és a jogalap igazolásának minősül az adat megismerésére jogosító jogszabályi rendelkezés megjelölése is."]
["A biztosítási titoktartási kötelezettség az eljárás keretén kívül az előzőekben meghatározott szervek alkalmazottaira is kiterjed. A biztosító a nyomozó hatóság, a nemzetbiztonsági szolgálat és az ügyészség írásbeli megkeresésére akkor is köteles haladéktalanul tájékoztatást adni, ha adat merül fel arra, hogy a biztosítási ügylet a Büntető Törvénykönyvről szóló 1978. évi IV. törvényben foglaltak szerinti"]
["a) kábítószerrel visszaéléssel,"]
["b) terrorcselekménnyel,"]
["c) robbanóanyaggal vagy robbantószerrel visszaéléssel,"]
["d) lőfegyverrel vagy lőszerrel visszaéléssel,"]
["e) pénzmosással,"]
["f) bűnszövetségben vagy bűnszervezetben elkövetett bűncselekménnyel"]
["van összefüggésben."]
["A biztosító a nyomozó hatóságot a „halaszthatatlan intézkedés” jelzéssel ellátott, külön jogszabályban előírt ügyészi jóváhagyást nélkülöző megkeresésére is köteles tájékoztatást adni az általa kezelt, az adott üggyel összefüggő, biztosítási titoknak minősülő adatokról."]
["A biztosítási titok megtartásának kötelezettsége nem áll fenn abban az esetben, ha a magyar bűnüldöző szerv, illetőleg az Országos Rendőr-főkapitányság – a pénzmosás megelőzéséről és megakadályozásáról szóló 2003. évi XV. törvényben meghatározott feladatkörében eljárva, vagy nemzetközi kötelezettségvállalás alapján külföldi bűnüldöző szerv, illetőleg külföldi Pénzügyi Információs Egység írásbeli megkeresése teljesítése céljából – írásban kér biztosítási titoknak minősülő adatot a biztosítótól, amennyiben a megkeresés tartalmazza a külföldi adatkérő által aláírt titoktartási záradékot."]
["Az ügyfél állapotával összefüggő adatokat a biztosító az egészségügyi és a hozzájuk kapcsolódó személyes adatok kezeléséről szóló 1997. évi XLVII. törvény rendelkezései szerint, kizárólag az érintett írásbeli hozzájárulásával kezelheti."]
["A szerződő/biztosított az ajánlattételkor felhatalmazza a biztosítót, hogy egészségi állapotára vonatkozó, a biztosítási szerződéssel közvetlen összefüggő adatokat beszerezze, azokat kezelje és egyúttal felmenti az ezen adatokkal rendelkező, valamint a biztosítottat kezelő intézményeket, illetve személyeket a titoktartási kötelezettség alól. A biztosító a megadott adatokat a 2003. évi LX. törvény 153–161. §-a alapján biztosítási titokként kezeli időbeli korlátozás nélkül, és csak az ott megjelölt szerveknek és az ott meghatározott módon adja ki."]
[]
["Kárbejelentés, panaszügyek intézése"]
["A biztosítási szerződéssel kapcsolatos kérdések, kárbejelentés esetén Ügyfélszolgálatunk rendelkezésre áll."]
["Ügyfélszolgálat: 1134 Budapest, Váci út 33."]
["Telefon: (36-1) 486-4343"]
["A biztosítási szerződéssel kapcsolatban felmerülő panaszügyek intézésére illetékes szervek "]
["Társaságunk vezérigazgatósága"]
[]
["UNION Vienna Insurance Group Biztosító Zrt."]
["Székhelye: 1082 Budapest, Baross u. 1."]
["Levelezési címe: 1461 Budapest, Pf.: 131."]
["Társaságunk felügyeleti szerve"]
["Magyar Nemzeti Bank"]
["Székhelye: 1013 Budapest, Krisztina krt. 39. (Krisztina Plaza)"]
["Levelezési címe: 1534 Budapest BKKP, Pf.: 777."]
[]
["Békéltető testület"]
["Pénzügyi Békéltető Testület"]
["Székhelye: 1013 Budapest, Krisztina krt. 39."]
["Levelezési címe: 1525 Budapest BKKP, Pf.: 172."]
[]
["A panaszügyintézés nem helyettesíti a peres eljárást."]
[]
["Hatályos jogszabályok"]
[]
["Jelen szerződésre vonatkozóan a magyar jog rendelkezései az irányadók. A biztosítási feltételekben nem rendezett kérdésekben a vonatkozó hatá­lyos jogszabályok, így különösen a 2009. évi LXII. törvény (Gfbt.), Polgári Törvénykönyv, a biztosítókról és a biztosítási tevékenységről szóló 2003. évi LX. törvény (Bit.) és a népegészségügyi termékadóról szóló 2011. évi CIII. törvény (Neta tv.) rendelkezéseit kell alkalmazni. Az irányadó jog­szabályok (különösen a Gfbt. és az annak felhatalmazása alapján alkotott rendeletek) változása esetén a jelen feltételek rendelkezéseinek és a hatályos jogszabályok kötelező érvényű előírásainak esetleges eltérésekor a hatályos jogszabályok az irányadók. A jogszabályok változásáról a biz­tosító nem köteles tájékoztatni a szerződőt."]
[]
["UNION Vienna Insurance Group Biztosító Zrt."]
[]
[]
[]
["UNION-Flotta kötelező gépjármű-felelősségbiztosítás"]
["Ügyfél-tájékoztató"]
[]
["1. A biztosítótársaságra vonatkozó adatok "]
["UNION Vienna Insurance Group Biztosító Zrt. "]
["1082 Budapest, Baross u. 1. "]
["H-1461 Budapest, Pf.: 131. "]
["Telefon: (36-1) 486-4200 "]
["Fax: (36-1) 486-4399 "]
["Cégjegyzékszám: 01-10-041566 Fővárosi Bíróság mint Cégbíróság"]
[]
["2. Biztosítási időszak és tartam "]
["A biztosítás határozott, vagy határozatlan időre köthető. "]
["Az állandó forgalmi engedélyre kötelezett gépjárművek esetében a biztosítási szerződés határozatlan tartamú. A biztosítási időszak 1 év. "]
[]
["A biztosítási feltételek 16. § (2) és (3) bekezdésében meghatározott esetekben határozott tartamú szerződés köthető. A biztosítási időszak megegyezik a kockázatviselés kezdete és vége közé eső időszakkal."]
[]
["3. Kockázatviselés kezdete "]
["A biztosító kockázatviselése (a biztosítási fedezet) a felek által a szerződésben meghatározott időpontban, ennek hiányában a szerződés létrejöttének időpontjában, illetve az üzemben tartói jogosultság keletkezésének – járműnyilvántartásba bejegyzett – időpontjában –, de legkorábban a biztosítási szerződésben megállapított időpontban, ennek hiányában a szerződés létrejöttének időpontjában – kezdődik."]
[]
["4. Biztosítási esemény "]
["A biztosító a biztosítási szerződésben megjelölt gépjármű üzemeltetése során a biztosított által másoknak okozott kárt téríti meg."]
[]
["5. Kizárások "]
["A biztosítás nem terjed ki arra a kárra, amely "]
["a) a károkozó gépjárműben elhelyezett tárgyakban keletkezett, ha ezek nem a gépjárművel utazók személyi használatára szóló tárgyak, "]
["b) a károkozó gépjárműben keletkezett, "]
["c) a károkozó gépjármű biztosítottjainak egymással szembeni igényéből származó dologi kárként, illetve elmaradt haszonként keletkezett, "]
["d) sugárzó, toxikus anyagok és termékek hatására, vagy az egészségügyi hatóságok részéről a sugárzás káros hatásainak megszüntetését célzó intézkedések folytán keletkezett, "]
["e) a gépjármű balesete nélkül az út burkolatában keletkezett, "]
["f) a gépjármű – forgalomban való részvétele nélkül – munkagépként való használata során keletkezett, "]
["g) álló gépjárműre fel-, illetve arról való lerakodás következtében keletkezett, "]
["h) üzemi balesetnek minősül, és a gépjármű javítási vagy karbantartási munkái során keletkezett, "]
["i) gépjárműverseny vagy az ahhoz szükséges edzés során következett be, "]
["j) környezetszennyezéssel a gépjármű balesete nélkül keletkezett, "]
["k) a gépjármű üzemeltetésével egyéb vagyontárgyban folyamatos állagrongálással okozott, illetőleg állagromlásból adódott, "]
["l) háború, háborús cselekmény, terrorcselekmény következményeként keletkezett."]
[]
["6. Díjfizetés "]
["A biztosítási díj a kockázat viselésének időtartamára előre illeti meg a biztosítót. "]
["A biztosítás első díjrészlete a számla kiállításának napján, amennyiben a számla kiállításának napja korábbi, mint a kockázatviselés kezdete, a kockázatviselés kezdetének napján esedékes. A folytatólagos díjrészlet az adott díjfizetési időszaknak az első napján esedékes. "]
["Ha a szerződő fél közlési vagy együttműködési kötelezettségének megsértése miatt a szerződés díja a kockázatviselés kezdetét követő hatvan napon belül a kockázatviselés kezdetétől alkalmazandó hatállyal módosul, vagy a szerződő fél által már megfizetett díjat jogszabályváltozás folytán utóbb más tartozására kell elszámolni, az üzemben tartó a díjkülönbözetet az esedékes következő biztosítási díjrészlettel együtt - a biztosítási időszakra járó díj teljes megfizetése esetén 30 napos határidővel - köteles megfizetni."]
["A határozott tartamú biztosítási szerződések biztosítási díja a biztosítás tartamára egy összegben illeti meg a biztosítót (egyszeri díj). Az egyszeri díj a számla kiállításának napján, amennyiben a számla kiállításának napja korábbi, mint a kockázatviselés kezdete, a kockázatviselés kezdetének napján esedékes. "]
[]
["A biztosítási díj mellett – a népegészségügyi termékadóról szóló 2011. évi CIII. törvényben foglaltaknak megfelelően – baleseti adót kell fizetni. A befizetett díjat a biztosító először a baleseti adóra számolja el, és az ezek után fennmaradó összeget írja jóvá a biztosítási szerződésen. Amennyiben a biztosítási szerződés a kötelező gépjármű-felelősségbiztosítási szerződésen (alapbiztosításon) túl kiegészítő biztosítást is tartalmaz, a befizetett díjat a biztosító először az alapbiztosításra számolja el, és a fennmaradó összeget írja jóvá a kiegészítő biztosításon. A kiegészítő biztosítás díjának meg nem fizetése önmagában nem eredményezi a kötelező gépjármű-felelősségbiztosítási szerződés megszűnését."]
["A biztosítás díja az alábbi módon és gyakorisággal fizethető: "]
["– készpénz átutalási megbízással (csekk); "]
["– átutalással; "]
["– csoportos beszedési megbízással "]
["negyedéves, féléves és éves gyakoriság mellett. "]
["A díjfizetés módjára és gyakoriságára vonatkozó egyes speciális rendelkezéseket a biztosító adott évre érvényes díjszabása tartalmazza. "]
[]
["Ha a biztosítási szerződés a biztosítási időszak tartama alatt díjnemfizetés miatt szűnik meg, az üzemben tartó annál a bizto­sítónál köteles a szerződést – az újrakötött szerződés kockázat­viselési kezdetének időpontjában alkalmazandó díjtarifa alapján – megkötni, ahol a szerződése díjnemfizetés miatt szűnt meg. A szerződő fél a szerződés megkötésekor köteles megfizetni az újrakötött szerződés vonatkozásában az adott biztosítási időszak hátralévő részére járó díjat, és - amennyiben még nem fizette meg - a díjnemfizetéssel megszűnt szerződés vonatkozásában a türelmi időre járó díjat. "]
[]
["Ha az üzemben tartó fedezetlenségi díj fizetésére is köteles, a fedezetlenségi díjat az esedékes biztosítási díjrészlettel együtt – a biztosítási időszakra járó díj teljes megfizetése esetén 30 napos határidővel – köteles megfizetni. Amennyiben a szerződő a biztosítási díj megfizetésén kívül fedezetlenségi díj fizetésére is köteles, a befizetett díjat a biztosító először baleseti adóra, majd a fedezetlenségi díjra számolja el, és az ezek után fennmaradó összeget írja jóvá az új szerződésen."]
[]
["7. A biztosítási díj változása "]
["A biztosító a biztosítási időszak utolsó napját megelőző 50. napig elküldött írásos értesítőben tájékoztatja a szerződő felet a biztosítási évfordulóról és a következő biztosítási időszakra – az értesítés időpontjában rendelkezésre álló adatok alapján – a díjtarifa szerint várható díjról. "]
[]
["Ha a biztosítási ajánlat a díjtarifától eltér, a biztosító az ajánlat átadásától számított 15 napon belül igazolható módon elküldött javaslatot tehet az ajánlat díjtarifának megfelelő módosítására. Ha az ajánlat módosítására tett javaslatot a szerződő a kézhezvételtől számított 15 napon belül nem kifogásolja, a szerződés a módosított ajánlat szerint jön létre. "]
["A biztosító a díjat az adott biztosítási időszak alatt – a kockázat­viselés kezdetétől számított 60 napon belül – megváltoztathatja, ha a szerződés díja a szerződőnek a szerződés megkötésekor fen­nálló közlési vagy együttműködési kötelezettségének megsértése következtében tér el a díjtarifa szerint megállapítandó díjtól."]
[]
["8. A szerződés megszűnésének esetei "]
[]
["Felmondás "]
["A szerződő felek bármelyike a biztosítási időszak utolsó napjára (biztosítási évfordulóra), azt legalább 30 nappal megelőzően a biztosítási szerződést írásban, indoklás nélkül felmondhatja. A felmondás akkor hatályos, ha az a másik félhez határidőben megérkezik. "]
[]
["Közös megegyezés "]
["A biztosítási időszakon belül a szerződő felek a biztosítási szerződést közös megegyezéssel is megszüntethetik. "]
[]
["Érdekmúlás "]
["A szerződés érdekmúlással szűnik meg a gépjármű forgalomból történő kivonásával, az üzemben tartó változása esetén, illetve szünetelés esetén ha az újbóli üzembe helyezés a kivonás napjától számított egy éven belül nem történik meg. "]
["A szerződés érdekmúlással szűnik meg a tulajdonjog átszállása esetén, ha a szerződéskötésre kötelezett üzemben tartó személyében változás áll be. "]
[]
["Díjnemfizetés "]
["Ha a szerződő az esedékes biztosítási díjat, a fedezetlenségi díjat, illetőleg a baleseti adót, nem fizeti meg, a biztosító a díj esedékességétől számított 30. nap elteltéig – a következményekre törté"]
["nő figyelmeztetés mellett – a szerződő félnek a díj esedékességétől számított 60 napos póthatáridővel, igazolható módon a teljesítésre vonatkozó felszólítást küld. A türelmi idő eredménytelen leteltével a szerződés – amennyiben egyéb okból még nem szűnt meg – az esedékességtől számított 60. napon megszűnik. "]
[]
["Biztosítási időtartam eltelte "]
["A határozott időtartamra kötött szerződés a szerződésben meghatározott biztosítási időtartam elteltével megszűnik."]
[]
["9. A biztosító szolgáltatásai "]
["A biztosító köteles a kárrendezéshez nélkülözhetetlen dokumentumok beérkezésétől számított 15 napon belül, de ezek beérkezésének hiányában is legkésőbb a kártérítési igény benyújtásától számított 3 hónapon belül a károsultnak "]
["a) kellően megindokolt kártérítési javaslatot tenni azokban az esetekben, amelyekben a felelősség nem vitás, és a kárt jogcímenként (beleértve a kamatra vonatkozó tájékoztatást) összegszerűen megállapította, vagy "]
["b) indoklással ellátott választ adni a kárigényben foglalt egyes követelésekre, azokban az esetekben, amikor a felelősséget nem ismeri el, vagy az nem egyértelmű, vagy a teljes kárt összegszerűen nem állapította meg. "]
["A biztosító egyösszegű pénzbeli kártérítés esetén köteles a megállapított összeget a kártérítési javaslat elfogadását, vagy a kártérítés jogerős megítélését követő 15 napon belül a károsultnak megfizetni. "]
["A kárösszeg meghatározására vonatkozó részletes szabályokat a biztosítási feltételek 32/A. és 32/B. §-ai tartalmazzák."]
[]
["10. Biztosítási titokkal kapcsolatos tudnivalók "]
["A biztosítókról és biztosítási tevékenységről szóló 2003. évi LX. törvény (Bit.) 153–161. §-a alapján biztosítási titok minden olyan – minősített adatot nem tartalmazó –, a biztosító rendelkezésére álló adat, amely a biztosító ügyfeleinek személyi körülményeire, vagyoni helyzetére, illetve gazdálkodására, vagy a biztosítóval kötött szerződéseire vonatkozik. A biztosító köteles a tudomására jutott adatokat megőrizni és a biztosítási törvény szerint biztosítási titokként kezelni. A biztosító ügyfeleinek azon üzleti biztosítási titkait jogosult kezelni, amelyek a biztosítási szerződéssel, annak létrejöttével, nyilvántartásával, a kárral, szolgáltatással összefüggnek. Az adatkezelés célja csak a biztosítási szerződés megkötéséhez, módosításához, állományban tartásához, a biztosítási szerződésből származó követelések megítéléséhez szükséges. A biztosítási titok tekintetében, időbeli korlátozás nélkül – ha a törvény másként nem rendelkezik – titoktartási kötelezettség terheli a biztosító tulajdonosait, vezetőit, alkalmazottait és mindazokat, akik ahhoz a biztosítóval kapcsolatos tevékenységük során bármilyen módon hozzájutottak. "]
["Biztosítási titok csak a biztosítási feltételekben meghatározott esetekben adható ki harmadik személynek."]
["11. Kárbejelentés, panaszügyek intézése "]
["A biztosítási szerződéssel kapcsolatos kérdések, kárbejelentés esetén Ügyfélszolgálatunk rendelkezésre áll. "]
["Ügyfélszolgálat: 1134 Budapest, Váci út 33. "]
["Telefon: (36-1) 486-4343 "]
[]
["A biztosítási szerződéssel kapcsolatban felmerülő panaszügyek intézésére illetékes szervek "]
["Társaságunk vezérigazgatósága "]
["UNION Vienna Insurance Group Biztosító Zrt. "]
["Székhelye: 1082 Budapest, Baross u. 1. "]
["Levelezési címe: 1461 Budapest, Pf.: 131. "]
[]
["Társaságunk felügyeleti szerve "]
["Magyar Nemzeti Bank"]
["Székhelye: 1013 Budapest, Krisztina krt. 39. (Krisztina Plaza) "]
["Levelezési címe: 1534 Budapest BKKP, Pf.: 777. "]
[]
["Békéltető testület "]
["Pénzügyi Békéltető Testület "]
["Székhelye: 1013 Budapest, Krisztina krt. 39. "]
["Levelezési címe: 1525 Budapest BKKP, Pf.: 172. "]
[]
["A panaszügyintézés nem helyettesíti a peres eljárást."]
[]
["12. Hatályos jogszabályok "]
["Jelen szerződésre vonatkozóan a magyar jog rendelkezései az irányadók. A biztosítási feltételekben nem rendezett kérdésekben a vonatkozó hatályos jogszabályok, így különösen a 2009. évi LXII. törvény (Gfbt.), a Polgári Törvénykönyv, a 2003. évi LX. törvény (Bit.) és a népegészségügyi termékadóról szóló 2011. évi CIII. törvény (Neta tv.) rendelkezéseit kell alkalmazni. Az irányadó jogszabályok (különösen a Gfbt. és az annak felhatalmazása alapján alkotott rendeletek) változása esetén a jelen feltételek rendelkezéseinek és a hatályos jogszabályok kötelező érvényű előírásainak esetleges eltérésekor a hatályos jogszabályok az irányadók. A jogszabályok változásáról a biztosító nem köteles tájékoztatni a szerződőt."]
[]
["2014. január 1. napján hatályba lépő fontosabb módosítások "]
[]
["Díjfizetés"]
["Ha a szerződő fél közlési vagy együttműködési kötelezettségének megsértése miatt a szerződés díja a kockázatviselés kezdetét követő hatvan napon belül a kockázatviselés kezdetétől alkalmazandó hatállyal módosul, vagy a szerződő fél által már megfizetett díjat jogszabályváltozás folytán utóbb más tartozására kell elszámolni, az üzemben tartó a díjkülönbözetet az esedékes következő biztosítási díjrészlettel együtt - a biztosítási időszakra járó díj teljes megfizetése esetén 30 napos határidővel - köteles megfizetni."]
[]
["Biztosítási szerződés megszűnése a gépjármű ideiglenes kivonása esetén"]
["Ha az újbóli üzembe helyezés a kivonás napjától számított egy éven belül nem történik meg, a szerződés az egyéves időszak utolsó napját követő napon megszűnik."]
[]
[]
["UNION Vienna Insurance Group Biztosító Zrt."]

{"sheet":"3. sz. mellekelt","index":5,"n_rows":176,"n_cols":1,"rows_kept":176,"cut":false,"hidden":false,"merged":[]}
[]
[]
[]
[]
[]
[]
[]
[]
["UNION-Flotta Gépjármű Értékvédelem Bázis Biztosítás"]
["Szerződési feltételek"]
[]
[]
["Az UNION Vienna Insurance Group Biztosító Zrt. a biztosítási díj megfizetése ellenében a kockázatviselés időtartama alatt a jelen biztosítási feltételekben rögzített esetekben és mértékben Magyarország hivatalos pénznemében a szerződésben meghatározott biztosítási szolgáltatást nyújtja."]
["1.            Fogalmak"]
["1.1.        Szerződő"]
["Az a személy, aki a járműre az 2009. évi LXII. törvény alapján kötelező gépjármű-felelősség biztosítására kötelezett. A díjfizetési kötelezettség a szerződő felet terheli. "]
["1.2.        Biztosított"]
["A jármű tulajdonosa."]
["1.3.        Biztosító"]
["UNION Vienna Insurance Group Biztosító Zrt."]
["H-1082 Budapest, Baross u. 1."]
["H-1461 Bp., Pf. 131."]
["Telefon: (+36-1) 486-4200"]
["Cégjegyzékszám: 01-10-041566 Fővárosi Bíróság, mint Cégbíróság"]
["1.4.        Biztosított jármű"]
["Minden a jelen szerződéshez kapcsolódó UNION-Flotta kötelező gépjármű-felelősségbiztosításba bevont, érvényes magyar hatósági jelzésekkel és dokumentumokkal ellátott, személygépjármű, motorkerékpár vagy legfeljebb 3500 kg össztömegű tehergépjármű. "]
["1.5.        Elsődleges biztosítás"]
["A káreseményért felelős másik fél kötelező gépjármű-felelősségbiztosítása, illetve ennek hiányában a Kártalanítási Számla által nyújtott fedezet."]
["1.6.        Elsődleges biztosító"]
["Az elsődleges biztosítást kezelő biztosító, illetve a Kártalanítási Számla."]
["1.7.        Kártalanítási Számla"]
["A kötelező gépjármű-felelősségbiztosítást művelő, Magyarország területén értékesítő biztosítók által létrehozott és folyamatosan finanszírozott pénzalap, amelynek célja a szerződéskötési kötelezettség ellenére kötelező gépjármű-felelősségbiztosítással nem rendelkező üzemben tartók, valamint – a jogszabályban meghatározott korlátozásokkal – az ismeretlen üzemben tartók által okozott károk megtérítése."]
["1.8.        Piaci érték"]
["1.8.1.    Kockázatviselés kezdetekori piaci érték"]
["A magyarországi EUROTAX-katalógus alapján meghatározott, a kockázatviselés kezdetére vonatkoztatott átlagos műszaki állapot szerinti forgalmi érték. "]
["Az átlagos műszaki állapot szerinti forgalmi érték meghatározása során a biztosító az alábbi paramétereket veszi figyelembe, függetlenül a biztosított jármű tényleges műszaki állapotától. A jármű"]
["–      forgalombiztos, sérülésmentes (látható sérülés nélküli), állapotosztálybeli besorolást illetően a 3. osztályba tartozik;"]
["–      legközelebbi műszaki vizsgája 1 év múlva esedékes;"]
["–      új állapotban való forgalomba helyezése május hónapban történt;"]
["–      a kategóriájára jellemző átlagos futásteljesítménnyel rendelkezik;"]
["–      gumiabroncsai szériaméretűek és azok profilmélysége 50%-os;"]
["–      gyári kulcskészlettel rendelkezik."]
["–      Az általános műszaki állapot meghatározásánál a biztosító a tulajdonosok számát figyelembe veszi."]
["Amennyiben az átlagos műszaki állapot szerinti forgalmi érték az EUROTAX-katalógus alapján nem állapítható meg, abban az esetben a biztosító a hazai, – illetve szükség szerinti esetekben – külföldi összehasonlító piaci adatok alapján határozza meg a piaci értéket."]
["1.8.2.    Kárkori piaci érték"]
["A magyarországi EUROTAX-katalógus alapján meghatározott, a káridőpontra vonatkoztatott – tényleges műszaki állapot szerinti – forgalmi érték. Amennyiben a piaci érték az EUROTAX-katalógus alapján nem állapítható meg, abban az esetben a biztosító a hazai, – illetve szükség szerinti esetekben – külföldi összehasonlító piaci adatok alapján határozza meg a piaci értéket. A piaci érték meghatározásakor a biztosított gépjárműbe utólag, nem a gyártó által beszerelt alkatrészek, illetve tartozékok értéknövelő tényezőként nem vehetők számításba, esetleges értékcsökkentő hatásukat ezzel szemben a biztosító figyelembe veszi."]
["1.9.        Biztosítási összeg"]
["Legfeljebb 1.000.000,-Ft minden biztosított járműre."]
["1.10.      Totálkár"]
["Olyan kár, amelynél a jármű pótlási értéke került megtérítésre, mert a gépjármű javítását az elsődleges biztosító gazdaságtalannak ítélte, illetve a helyreállítás műszakilag nem indokolt."]
["1.11.      Avulás"]
["A gépjármű, valamint egyes alkatrészek értékének az időmúlás, illetőleg a fokozatos elhasználódás miatti csökkenése."]
["2.            Biztosítási esemény"]
["2.1.        Totálkár esetén"]
["Az elsődleges biztosítással rendelkező fél a biztosított járműben olyan kárt okoz, amelyet az elsődleges biztosító biztosítási eseménynek fogad el, és megtéríti a biztosított jármű káridőponti értékét."]
["3.            Kizárások"]
["3.1.        A biztosítási szerződés nem terjed ki az alábbi esetekre:"]
["– ha a gépjármű totálkárát okozó meghibásodás vagy esemény már a kockázatviselés kezdete előtt megtörtént;"]
["– autóversenyen, illetve versenyre való felkészülés során keletkező károkra;"]
["– ha a biztosítási esemény bekövetkeztekor a gépjármű vezetője kábítószer vagy a vezetési képességet hátrányosan befolyásoló egyéb szer hatása alatt, vagy alkoholos befolyásoltság állapotában volt."]
["3.2.        Nem téríti meg a biztosító:"]
["– totálkár esetén – az elhasználódás kivételével – azt az összeget, amit az elsődleges biztosító a kártérítésből, illetve a biztosítási szolgáltatásból levont (például: roncsérték, meglévő sérülés a gépjárművön);"]
["– az ÁFA összegét, amennyiben a biztosított ÁFA visszaigénylésre jogosult."]
["4.            A szerződés időbeli hatálya"]
["A szerződés határozatlan tartamú. A biztosítási időszak 1 év. A biztosítási év kezdete, a biztosítási évforduló megegyezik a kapcsolódó UNION-Flotta kötelező gépjármű-felelősségbiztosításéval."]
["4.1.        A kockázatviselés kezdete"]
["A biztosító kockázatviselése az azt követő nap 0 órájakor kezdődik, amikor a szerződő a díjat a biztosító számlájára vagy pénztárába befizeti, illetőleg amikor a díj megfizetésére vonatkozóan halasztásban állapodtak meg, vagy a biztosító díj iránti igényét bírósági úton érvényesíti, feltéve, hogy a szerződés később érvényesen létrejött."]
["Ha a szerződő fél a díjat a biztosító képviselőjének fizette, a díjat legkésőbb a fizetés napjától számított negyedik napon a biztosító számlájára, illetőleg a pénztárába beérkezettnek kell tekinteni. A szerződő felek írásban megállapodhatnak a kockázatviselés kezdetének ettől eltérő időpontjában is."]
["4.2.        A biztosítási szerződés létrejötte"]
["A szerződés a felek írásbeli megállapodásával jön létre. A szerződő fél ajánlatát írásban terjeszti elő. Az ajánlat elfogadása esetén a biztosító a szerződésről kötvényt állít ki. Az ajánlat elutasítását a biztosító nem köteles indokolni."]
["A szerződés akkor is létrejön, ha a biztosító az ajánlatra 15 napon belül nem nyilatkozik. Ilyen esetben a szerződés az ajánlatnak a biztosító vagy képviselője részére történt átadásának időpontjára visszamenőleges hatállyal jön létre."]
["Amennyiben a biztosító az ajánlatnak a biztosító kockázatvállalására jogosult szervezeti egységéhez történő beérkezésétől számított 15 napon belül az ajánlatot visszautasítja, a szerződés nem jön létre, és az ezen időszak alatt bekövetkező károkért a biztosító nem köteles helytállni."]
["4.3.        A szerződés megszűnése"]
["4.3.1.    Felmondás"]
["A szerződést bármelyik fél a biztosítási évfordulóra, azt megelőzően legalább 30 nappal írásban felmondhatja."]
["4.3.2.    Érdekmúlás"]
["Amennyiben a szerződés hatálya alatt a biztosítási érdek megszűnik, a szerződés, illetve annak megfelelő része a változás napján megszűnik."]
["4.3.3.    Díjnemfizetés miatti megszűnés"]
["Amennyiben a szerződő a biztosítási díjat annak esedékességétől számított 30 napon belül nem fizette meg, úgy a szerződés a díj esedékességét követő 30. napon megszűnik, kivéve, ha a felek díjhalasztásban állapodtak meg, vagy a biztosító díjkövetelését bírósági úton érvényesíti."]
["Megszűnt szerződésre történő utólagos díjfizetéssel a szerződés nem lép automatikusan hatályba."]
["4.3.4.    Megváltoztatott díj el nem fogadása miatti megszűnés"]
["Amennyiben a szerződő a megváltoztatott díjat nem fogadja el, a szerződés jelen feltételek 6. pontjában írtak szerint szűnik meg."]
["5.            A szerződés területi hatálya"]
["A biztosítási szerződés területi hatálya Európa területére terjed ki. Európa földrajzi értelemben értendő, így a biztosítási védelem a FÁK (Független Államok Közössége) tagállamainak ázsiai területére, valamint Grúzia és Törökország ázsiai területére nem terjed ki."]
["6.            Díjfizetés"]
["A biztosítási díj a teljes biztosítási időszakra a kötvény kiállításának napján, amennyiben a kötvény kiállításának napja korábbi, mint a kockázatviselés kezdete, a kockázatviselés kezdetének napján egy összegben esedékes."]
["A biztosítási időszak egy év."]
["A szerződő felek részletfizetésben is megállapodhatnak. Részletfizetés esetén az első díjrészlet a kötvény kiállításának napján, amennyiben a kötvény kiállításának napja korábbi, mint a kockázatviselés kezdete, a kockázatviselés kezdetének napján, a további díjrészletek annak az időszaknak az első napján esedékesek, amelyre a díjrészlet vonatkozik. A biztosító a díjat a ténylegesen kockázatban töltött napokra számítja fel."]
["Amennyiben a biztosító a szerződés kapcsán szolgáltatást teljesített, akkor a teljes biztosítási időszakra járó biztosítási díj megfizetését követelheti."]
["A biztosító jogosult minden biztosítási időszakra módosított díjat megállapítani, ez esetben ezt legalább 50 nappal a biztosítási évforduló előtt a szerződő tudomására kell hoznia."]
["Ha a szerződő a módosítást nem fogadja el, akkor az arról szóló értesítést követően – a biztosítási év végére (utolsó napjára), azt legalább 30 nappal megelőzően – írásban felmondhatja a szerződést."]
["Ha a szerződő nem él a felmondási jogával, a szerződés a biztosító által közölt módosítás szerint marad hatályban."]
["7.            Biztosítási szolgáltatások"]
["A biztosítási esemény bekövetkezése esetén a biztosító megtéríti a gépjármű kockázatviselés kezdetekori és kárkori piaci értékének különbözetét, de legfeljebb az 1.9. pontban meghatározott biztosítási összeget."]
["A biztosító jogosult a biztosított gépjármű kárkori értékét az elsődleges biztosító által meghatározott összegtől eltérő összegben megállapítani."]
["A biztosító a szolgáltatásokból önrészesedést nem von le."]
["8.            Mentesülés"]
["8.1.        Mentesülés kármegelőzési és kárenyhítési kötelezettség megszegése miatt"]
["Mentesül a biztosító teljesítési kötelezettsége alól, amennyiben a szerződő vagy a biztosított a kármegelőzési és kárenyhítési kötelezettségét szándékosan vagy súlyosan gondatlan módon megsértette."]
["8.2.        Mentesülés tájékoztatási kötelezettség megszegése miatt"]
["Mentesül a biztosító, ha a szerződő vagy a biztosított a biztosítás elvállalásának szempontjából lényeges körülményeket illető közlési kötelezettségét megszegi, kivéve, ha bizonyítják, hogy az elhallgatott vagy be nem jelentett körülményt a biztosító a szerződéskötéskor ismerte vagy az nem hatott közre a biztosítási esemény bekövetkeztében."]
["Különösen lényeges a biztosítás elvállalása szempontjából valamennyi olyan körülmény, amely a biztosítási díj megállapítására van hatással, és amelyre vonatkozóan a biztosító az ajánlatban kérdést tett fel."]
["8.3.        Mentesülés a kárbejelentési kötelezettség megsértése miatt"]
["A biztosító teljesítési kötelezettsége nem áll be, amennyiben a szerződő vagy a biztosított a kárbejelentési kötelezettségét megsérti, és emiatt lényeges körülmények kideríthetetlenné válnak."]
["9.            A kárrendezés szabályai"]
["A biztosított köteles a kárrendezési eljárás során a biztosítóval együttműködni, és minden szükséges információt megadni."]
["A szolgáltatási igény elbírálásához be kell nyújtani:"]
["– igazolást az elsődleges biztosító által fizetett kártérítési összegről,"]
["– a káresemény időpontját igazoló dokumentumot,"]
["– a totálkár okát igazoló dokumentumot,"]
["– az elsődleges biztosító által készített, kárkori értékre vonatkozó számítást és egyéb dokumentumot,"]
["– a szervizelésről készült valamennyi számlát,"]
["– minden olyan iratot, amely a jogosultság, a biztosítási esemény, a kárösszeg megállapításához szükséges."]
["A fenti dokumentumok beszerzése és benyújtása a biztosított feladata, amelynek költségei a biztosítottat terhelik."]
["10.         Teljesítési kötelezettség"]
["A biztosító a kárrendezéshez szükséges utolsó irat beérkezését követő 15 napon belül köteles teljesíteni."]
["11.         Elévülési idő"]
["Jelen feltételek alapján kötött biztosítási szerződésből eredő igények a biztosítási esemény bekövetkezésétől számított egy év alatt elévülnek."]
["12.         Adatvédelem, titokvédelem"]
["A biztosító a jelen szerződés kapcsán tudomására jutott, a szerződő, illetve a biztosított személyi körülményeire, vagyoni helyzetére, illetve gazdálkodására vonatkozó adatokat a 2003. évi LX. törvény 153–161. §-a alapján biztosítási titokként kezeli. Biztosítási titok csak akkor adható ki harmadik személynek, ha a szerződő vagy a biztosított, illetve annak törvényes képviselője erre vonatkozóan írásban felmentést ad, a biztosítási titok körét pontosan megjelölve."]
["Biztosítási titok minden olyan – minősített adatot nem tartalmazó –, a biztosító rendelkezésére álló adat, amely a biztosító ügyfeleinek személyi körülményeire, vagyoni helyzetére, illetve gazdálkodására, vagy a biztosítóval kötött szerződéseire vonatkozik. A biztosító köteles a tudomására jutott adatokat megőrizni és a biztosítási törvény szerint biztosítási titokként kezelni. A biztosító ügyfeleinek azon üzleti biztosítási titkait jogosult kezelni, amelyek a biztosítási szerződéssel, annak létrejöttével, nyilvántartásával, a kárral, szolgáltatással összefüggnek. Az adatkezelés célja csak a biztosítási szerződés megkötéséhez, módosításához, állományban tartásához, a biztosítási szerződésből származó követelések megítéléséhez szükséges."]
["A biztosítási titok tekintetében, időbeli korlátozás nélkül – ha a törvény másként nem rendelkezik – titoktartási kötelezettség terheli a biztosító tulajdonosait, vezetőit, alkalmazottait és mindazokat, akik ahhoz a biztosítóval kapcsolatos tevékenységük során bármilyen módon hozzájutottak."]
["Biztosítási titok csak akkor adható ki harmadik személynek, ha"]
["a)     a biztosító ügyfele vagy annak törvényes képviselője a kiszolgáltatható biztosítási titokkört pontosan megjelölve, erre vonatkozóan írásban felmentést ad, vagy"]
["b)    a biztosítási törvény alapján a titoktartási kötelezettség nem áll fenn."]
["A titoktartási kötelezettség nem áll fenn:"]
["a)     a feladatkörében eljáró Felügyelettel,"]
["b)    a folyamatban lévő büntetőeljárás keretében eljáró nyomozó hatósággal és ügyészséggel,"]
["c)     büntetőügyben, polgári ügyben, valamint a csődeljárás, illetve felszámolási eljárás ügyében eljáró bírósággal, továbbá a végrehajtási ügyben eljáró önálló bírósági végrehajtóval,"]
["d)    a hagyatéki ügyben eljáró közjegyzővel,"]
["e)     adóügyben, az adóhatóság felhívására a biztosítót törvényben meghatározott körben nyilatkozattételi kötelezettség, illetve, ha biztosítási szerződésből eredő adókötelezettség alá eső kifizetésről törvényben meghatározott adatszolgáltatási kötelezettség terheli,"]
["f)     a feladatkörében eljáró nemzetbiztonsági szolgálattal,"]
["g)    a biztosítóval, a biztosításközvetítővel, a szaktanácsadóval, a harmadik országbeli biztosító, független biztosításközvetítő vagy szaktanácsadó magyarországi képviseletével, ezek érdekképviseleti szervezeteivel, illetve a biztosítási, biztosításközvetítői, szaktanácsadói tevékenységgel kapcsolatos versenyfelügyeleti feladatkörében eljáró Gazdasági Versenyhivatallal,"]
["h)     feladatkörében eljáró gyámhatósággal,"]
["i)      az egészségügyről szóló 1997. évi CLIV. törvény 108. § (2) bekezdésében foglalt egészségügyi hatósággal,"]
["j)      a külön törvényben meghatározott feltételek megléte esetén a titkosszolgálati eszközök alkalmazására, titkos információ gyűjtésére felhatalmazott szervvel,"]
["k)     a viszontbiztosítóval, valamint közös kockázatvállalás (együttbiztosítás) esetén a kockázatvállaló biztosítókkal,"]
["l)      a törvényben szabályozott adattovábbítások során átadott adatok tekintetében a kötvénynyilvántartást vezető kötvénynyilvántartó szervvel,"]
["m)   az állomány átruházás keretében átadásra kerülő biztosítási szerződési állomány tekintetében az átvevő biztosítóval,"]
["n)     a kiszervezett tevékenység végzéséhez szükséges adatok tekintetében a kiszervezett tevékenységet végzővel,"]
["o)    fióktelep esetében – ha a magyar jogszabályok által támasztott követelményeket kielégítő adatkezelés feltételei minden egyes adatra nézve teljesülnek, valamint a harmadik országbeli biztosító székhelye szerinti állam rendelkezik a magyar jogszabályok által támasztott követelményeket kielégítő adatvédelmi jogszabállyal – a harmadik országbeli biztosítóval, biztosításközvetítővel, szaktanácsadóval szemben,"]
["p)    a feladatkörében eljáró országgyűlési biztossal,"]
["q)    A biztosítási titoktartási kötelezettség az eljárás keretén kívül az előzőekben meghatározott szervek alkalmazottaira is kiterjed. A biztosító a nyomozó hatóság, a nemzetbiztonsági szolgálat és az ügyészség írásbeli megkeresésére akkor is köteles haladéktalanul tájékoztatást adni, ha adat merül fel arra, hogy a biztosítási ügylet"]
["a Büntető Törvénykönyvről szóló 1978. évi IV. törvényben foglaltak szerinti"]
["a)     kábítószerrel visszaéléssel,"]
["b)    terrorcselekménnyel,"]
["c)     robbanóanyaggal vagy robbantószerrel visszaéléssel,"]
["d)    lőfegyverrel vagy lőszerrel visszaéléssel,"]
["e)     pénzmosással,"]
["f)     bűnszövetségben vagy bűnszervezetben elkövetett bűncselekménnyel"]
["van összefüggésben."]
["A biztosító a nyomozó hatóságot a „halaszthatatlan intézkedés” jelzéssel ellátott, külön jogszabályban előírt ügyészi jóváhagyást nélkülöző megkeresésére is köteles tájékoztatást adni az általa kezelt, az adott üggyel összefüggő, biztosítási titoknak minősülő adatokról."]
["A biztosítási titok megtartásának kötelezettsége nem áll fenn abban az esetben, ha a magyar bűnüldöző szerv, illetőleg az Országos Rendőr-főkapitányság – a pénzmosás megelőzéséről és megakadályozásáról szóló 2003. évi XV. törvényben meghatározott feladatkörében eljárva, vagy nemzetközi kötelezettségvállalás alapján külföldi bűnüldöző szerv, illetőleg külföldi Pénzügyi Információs Egység írásbeli megkeresése teljesítése céljából – írásban kér biztosítási titoknak minősülő adatot a biztosítótól, amennyiben a megkeresés tartalmazza a külföldi adatkérő által aláírt titoktartási záradékot."]
["Az ügyfél állapotával összefüggő adatokat a biztosító az egészségügyi és a hozzájuk kapcsolódó személyes adatok kezeléséről szóló 1997. évi XLVII. törvény rendelkezései szerint, kizárólag az érintett írásbeli hozzájárulásával kezelheti."]
["A szerződő/biztosított az ajánlattételkor felhatalmazza a biztosítót, hogy egészségi állapotára vonatkozó, a biztosítási szerződéssel közvetlen összefüggő adatokat beszerezze, azokat kezelje és egyúttal felmenti az ezen adatokkal rendelkező, valamint a biztosítottat kezelő intézményeket, illetve személyeket a titoktartási kötelezettség alól. A biztosító a megadott adatokat a 2003. évi LX. törvény 153–161. §-a alapján biztosítási titokként kezeli időbeli korlátozás nélkül, és csak az ott megjelölt szerveknek és az ott meghatározott módon adja ki."]
["13.         Kárbejelentés, panaszügyek intézése"]
["13.1.      A biztosítási szerződéssel kapcsolatos kérdések, kárbejelentés esetén Ügyfélszolgálatunk rendelkezésre áll."]
["Ügyfélszolgálat: 1134 Budapest, Váci út 33."]
["Tel.: (+36-1) 486-4343"]
["13.2.      A biztosítási szerződéssel kapcsolatban felmerülő panaszügyek intézésére illetékes szervek Társaságunk vezérigazgatósága:"]
["UNION Vienna Insurance Group Biztosító Zrt."]
["Székhelye: 1082 Budapest, Baross u. 1."]
["Levelezési címe: 1461 Budapest, Pf.: 131."]
["13.3.      Társaságunk felügyeleti szerve:"]
["Magyar Nemzeti Bank"]
["Székhelye: 1013 Budapest, Krisztina krt. 39. (Krisztina Plaza)"]
["Levelezési címe: 1534 Budapest BKKP, Pf.: 777."]
["13.4.      Békéltető testület"]
["Pénzügyi Békéltető Testület"]
["Székhelye: 1013 Budapest, Krisztina krt. 39."]
["Levelezési címe: 1525 Budapest BKKP, Pf.: 172."]
["13.5.      A panaszügyintézés nem helyettesíti a peres eljárást."]
["14.         Irányadó jog"]
["Jelen biztosításra vonatkozóan a magyar jog rendelkezései az irányadók. A biztosítási feltételekben nem rendezett kérdésekben a vonatkozó hatályos jogszabályok, így különösen a Polgári Törvénykönyv és a biztosítókról és a biztosítási tevékenységről szóló 2003. évi LX. törvény (Bit.) rendelkezéseit kell alkalmazni. A jogszabályok változása esetén a jelen feltételek rendelkezéseinek és a hatályos jogszabályok kötelező érvényű előírásainak esetleges eltérésekor a hatályos jogszabályok az irányadók"]
[]
["UNION Vienna Insurance Group Biztosító Zrt. "]

{"sheet":"adatközlő","index":6,"n_rows":76,"n_cols":11,"rows_kept":76,"cut":false,"hidden":false,"merged":[[45,0,45,1],[46,0,46,1],[42,2,42,6],[40,2,40,6],[44,2,44,6],[40,0,40,1],[42,0,42,1],[43,0,43,1],[44,0,44,1]]}
["Személygépkocsi (37 kW teljesítményig )"]
["Személygépkocsi (38 kW-tól 50 kW teljesítményig )",null,null,null,null,null,null,null,"Évfordulós átkötés"]
["Személygépkocsi (51 kW-tól 70 kW teljesítményig )",null,null,null,null,null,null,null,"Jármű vásárlás"]
["Személygépkocsi (71 kW-tól 100 kW teljesítményig )",null,null,null,null,null,null,null,"Üzembentartó váltás"]
["Személygépkocsi (101 kW-tól 180 kW teljesítményig )",null,null,null,null,null,null,null,"DNF miatti újrakötés"]
["Személygépkocsi (180 kW teljesítmény felett )"]
["Motorkerékpár (12 kW teljesítményig )"]
["Motorkerékpár (13 kW-tól 35 kW teljesítményig )"]
["Motorkerékpár (36 kW-tól 70 kW teljesítményig )"]
["Motorkerékpár (71 kW-tól 94 kW teljesítményig )"]
["Motorkerékpár (94 kW teljesítmény felett )"]
["Autóbusz (10-19 férőhely)"]
["Autóbusz (20-42 férőhely)"]
["Autóbusz (43-79 férőhely)"]
["Autóbusz (80 férőhelytől)"]
["Trolibusz"]
["Tehergépkocsi (1450 kg össztömegig)"]
["Tehergépkocsi (1451-2300 kg össztömegig)"]
["Tehergépkocsi (2301-3500 kg össztömegig)"]
["Tehergépkocsi (3501-7500 kgössztömegig)"]
["Tehergépkocsi (7501-12000 kg össztömegig)"]
["Tehergépkocsi (12000 kg össztömeg felett)"]
["Vontató"]
["Pótkocsik, félpótkocsik (750 kg össztömegig)"]
["Pótkocsik, félpótkocsik (751-3500 kg össztömegig)"]
["Pótkocsik, félpótkocsik (3501-10000 kg össztömegig)"]
["Pótkocsik, félpótkocsik (10000 kg össztömeg felett)"]
["Mezőgazdasági vontató"]
["Lassú járműv"]
["Munkagépek"]
["Segédmotoros kerékpár"]
["Négykerekű segédmotoros kerékpár"]
[]
[]
[null,null,{"$f":"IF(K48=0,\"\",\"Kérjük, hogy a szürke háttérrel jelölt  gépjárművek esetén adja meg a biztosítás kötés okát!\")","v":""}]
[]
[]
[]
[]
[]
["Szerződő:",null,{"$f":"díjszamító!B4","v":0}]
[]
["Szerződő székhelye:",null,{"$f":"IF(Keretszerz!C11=\"\",\"\",Keretszerz!C11)","v":""}]
[]
["Szerződő levelezési címe:"]
[]
["Szerződő adószáma:",null,{"$f":"IF(Keretszerz!N10=\"\",\"\",Keretszerz!N10)","v":""},null,null,"Fő tevékenység TEÁOR száma:",{"$f":"díjszamító!J15","v":0}]
[null,null,null,null,null,null,null,null,null,null,{"$f":"SUM(K49:K1000)","v":0}]
["Sorszám","Gyártmány/\nTípus","Fajta / Alkategória","Rendszám","Forgalmi engdélyszám","Alvázszám","Tulajdonszerzés időpontja","Kockázatviselés kezdete","Kötés oka","KGFB éves díja (Ft)"]
[1,null,null,null,null,null,null,null,null,null,{"$f":"IF(AND(F50<>\"\",I50=\"\"),1,0)","v":0}]
[2,null,null,null,null,null,null,null,null,null,{"$f":"IF(AND(F51<>\"\",I51=\"\"),1,0)","v":0}]
[3,null,null,null,null,null,null,null,null,null,0]
[4,null,null,null,null,null,null,null,null,null,0]
[5,null,null,null,null,null,null,null,null,null,0]
[6,null,null,null,null,null,null,null,null,null,0]
[7,null,null,null,null,null,null,null,null,null,0]
[8,null,null,null,null,null,null,null,null,null,0]
[9,null,null,null,null,null,null,null,null,null,0]
[10,null,null,null,null,null,null,null,null,null,0]
[11,null,null,null,null,null,null,null,null,null,0]
[12,null,null,null,null,null,null,null,null,null,0]
[13,null,null,null,null,null,null,null,null,null,0]
[14,null,null,null,null,null,null,null,null,null,0]
[15,null,null,null,null,null,null,null,null,null,0]
[16,null,null,null,null,null,null,null,null,null,0]
[17,null,null,null,null,null,null,null,null,null,0]
[18,null,null,null,null,null,null,null,null,null,0]
[19,null,null,null,null,null,null,null,null,null,0]
[20,null,null,null,null,null,null,null,null,null,0]
[21,null,null,null,null,null,null,null,null,null,0]
[22,null,null,null,null,null,null,null,null,null,0]
[23,null,null,null,null,null,null,null,null,null,0]
[24,null,null,null,null,null,null,null,null,null,0]
[25,null,null,null,null,null,null,null,null,null,0]
[26,null,null,null,null,null,null,null,null,null,0]
[27,null,null,null,null,null,null,null,null,null,0]